Build: #889 failed

Job: PHP 7.3 - SQLite failed

Stages & jobs

  1. Default Stage

Build log

The build generated 406 lines of output. Download or view full build log

18-Feb-2021 21:22:55 Build phpBB3 - Development Docker Master - PHP 7.1 - SQLite #889 (PHPBB3-DDM-JOB1-889) started building on agent Docker
18-Feb-2021 21:22:55
18-Feb-2021 21:22:55 Build working directory is /home/bamboo/xml-data/build-dir/PHPBB3-DDM-JOB1
18-Feb-2021 21:22:55 Executing build phpBB3 - Development Docker Master - PHP 7.1 - SQLite #889 (PHPBB3-DDM-JOB1-889)
18-Feb-2021 21:22:55 Starting task 'Checkout Default Repository' of type 'com.atlassian.bamboo.plugins.vcs:task.vcs.checkout'
18-Feb-2021 21:22:55 Checking out into /home/bamboo/xml-data/build-dir/PHPBB3-DDM-JOB1
18-Feb-2021 21:22:55 Updating source code to revision: 7110b61df59a57be51e6d5b91cc52f52f8591aff
18-Feb-2021 21:22:56 Fetching 'refs/heads/master' from 'https://github.com/phpbb/phpbb.git'.
18-Feb-2021 21:22:57 Checking out revision 7110b61df59a57be51e6d5b91cc52f52f8591aff.
18-Feb-2021 21:22:57 Creating local git repository in '/home/bamboo/xml-data/build-dir/PHPBB3-DDM-JOB1/.git'.
18-Feb-2021 21:22:57 Cloning into '/home/bamboo/xml-data/build-dir/PHPBB3-DDM-JOB1'...
18-Feb-2021 21:22:57 done.
18-Feb-2021 21:23:02 Already on 'master'
18-Feb-2021 21:23:02 Updated source code to revision: 7110b61df59a57be51e6d5b91cc52f52f8591aff
18-Feb-2021 21:23:02 Finished task 'Checkout Default Repository' with result: Success
18-Feb-2021 21:23:02 Running pre-build action: VCS Version Collector
18-Feb-2021 21:23:02
Substituting variable: ${bamboo.working.directory} with /home/bamboo/xml-data/build-dir/PHPBB3-DDM-JOB1
18-Feb-2021 21:23:02 Starting task 'Build image' of type 'com.atlassian.bamboo.plugins.bamboo-docker-plugin:task.docker.cli'
18-Feb-2021 21:23:02
Beginning to execute external process for build 'phpBB3 - Development Docker Master - PHP 7.1 - SQLite #889 (PHPBB3-DDM-JOB1-889)'
... running command line:
/usr/bin/docker build --force-rm=true --tag=phpbb:php-7.1 /home/bamboo/xml-data/build-dir/PHPBB3-DDM-JOB1
... in: /home/bamboo/xml-data/build-dir/PHPBB3-DDM-JOB1
... using extra environment variables:
bamboo_planRepository_1_branch=master
bamboo_repository_75956230_previous_revision_number=7bfcd4f28883524e13103b1b744b396484180ba4
bamboo_planRepository_1_branchDisplayName=master
bamboo_repository_revision_number=7110b61df59a57be51e6d5b91cc52f52f8591aff
bamboo_resultsUrl=https://bamboo.phpbb.com/browse/PHPBB3-DDM-JOB1-889
bamboo_capability_system_builder_command_Git=/usr/bin/git
bamboo_build_working_directory=/home/bamboo/xml-data/build-dir/PHPBB3-DDM-JOB1
bamboo_planRepository_1_name=phpBB Master
bamboo_buildKey=PHPBB3-DDM-JOB1
bamboo_shortPlanName=Development Docker Master
bamboo_planRepository_name=phpBB Master
bamboo_repository_75956230_git_branch=master
bamboo_buildNumber=889
bamboo_capability_system_builder_phpunit_PHPUnit=/usr/bin/phpunit
bamboo_repository_75956230_name=phpBB Master
bamboo_shortJobName=PHP 7.1 - SQLite
bamboo_buildResultsUrl=https://bamboo.phpbb.com/browse/PHPBB3-DDM-JOB1-889
bamboo_planRepository_repositoryUrl=https://github.com/phpbb/phpbb.git
bamboo_repository_75956230_git_repositoryUrl=https://github.com/phpbb/phpbb.git
bamboo_agentId=65929217
bamboo_planName=phpBB3 - Development Docker Master
bamboo_shortPlanKey=DDM
bamboo_shortJobKey=JOB1
bamboo_capability_system_jdk_JDK_1_7_0_65=/usr/lib/jvm/java-7-openjdk-amd64
bamboo_planRepository_revision=7110b61df59a57be51e6d5b91cc52f52f8591aff
bamboo_buildTimeStamp=2021-02-18T21:08:55.649Z
bamboo_repository_previous_revision_number=7bfcd4f28883524e13103b1b744b396484180ba4
bamboo_capability_system_jdk_JDK_1_6_0_16=/usr/lib/jvm/java-6-sun-1.6.0.16
bamboo_capability_system_builder_mvn2_Maven_2=/usr/share/maven2
bamboo_planRepository_previousRevision=7bfcd4f28883524e13103b1b744b396484180ba4
bamboo_repository_git_branch=master
bamboo_buildResultKey=PHPBB3-DDM-JOB1-889
bamboo_repository_branch_name=master
bamboo_buildPlanName=phpBB3 - Development Docker Master - PHP 7.1 - SQLite
bamboo_planRepository_1_revision=7110b61df59a57be51e6d5b91cc52f52f8591aff
bamboo_repository_name=phpBB Master
bamboo_buildFailed=false
bamboo_capability_system_docker_executable=/usr/bin/docker
bamboo_repository_75956230_git_username=
bamboo_planRepository_branch=master
bamboo_agentWorkingDirectory=/home/bamboo/xml-data/build-dir
bamboo_capability_system_git_executable=/usr/bin/git
bamboo_capability_system_builder_phpunit_PHPUnit_3_4=/usr/bin/phpunit
bamboo_repository_git_username=
bamboo_planRepository_1_previousRevision=7bfcd4f28883524e13103b1b744b396484180ba4
bamboo_repository_75956230_branch_name=master
bamboo_planRepository_branchDisplayName=master
bamboo_planRepository_1_type=gitv2
bamboo_planRepository_branchName=master
bamboo_capability_system_jdk_JDK=/usr/lib/jvm/java-6-sun
bamboo_plan_storageTag=PHPBB3-DDM
bamboo_hg_cache_directory=/home/bamboo/xml-data/build-dir/_hg-repositories-cache
bamboo_planRepository_1_username=
bamboo_planRepository_type=gitv2
bamboo_git_cache_directory=/home/bamboo/xml-data/build-dir/_git-repositories-cache
bamboo_repository_git_repositoryUrl=https://github.com/phpbb/phpbb.git
bamboo_capability_system_builder_ant_Ant=/usr/share/ant
bamboo_repository_75956230_revision_number=7110b61df59a57be51e6d5b91cc52f52f8591aff
bamboo_tmp_directory=/home/bamboo/temp
bamboo_working_directory=/home/bamboo/xml-data/build-dir/PHPBB3-DDM-JOB1
bamboo_planKey=PHPBB3-DDM
bamboo_capability_local=true
bamboo_planRepository_1_repositoryUrl=https://github.com/phpbb/phpbb.git
bamboo_planRepository_username=
bamboo_capability_system_jdk_JDK_1_6=/usr/lib/jvm/java-6-sun
bamboo_capability_system_jdk_JDK_1_7=/usr/lib/jvm/java-7-openjdk-amd64
bamboo_planRepository_1_branchName=master
18-Feb-2021 21:23:02 Sending build context to Docker daemon  25.12MB
18-Feb-2021 21:23:02
18-Feb-2021 21:23:03 Step 1/5 : FROM php:7.1
18-Feb-2021 21:23:03 ---> 060b5298208c
18-Feb-2021 21:23:03 Step 2/5 : RUN apt-get update && apt-get install -y         git         zlib1g-dev         bzip2         zip         && docker-php-ext-install -j$(nproc) zip
18-Feb-2021 21:23:03 ---> Using cache
18-Feb-2021 21:23:03 ---> 2cbb79fbac44
18-Feb-2021 21:23:03 Step 3/5 : RUN pecl install xdebug-2.6.1
18-Feb-2021 21:23:03 ---> Using cache
18-Feb-2021 21:23:03 ---> 89722eae3058
18-Feb-2021 21:23:03 Step 4/5 : RUN docker-php-ext-enable xdebug
18-Feb-2021 21:23:03 ---> Using cache
18-Feb-2021 21:23:03 ---> 211aebaaec56
18-Feb-2021 21:23:03 Step 5/5 : RUN echo "memory_limit = 1536M" >> /usr/local/etc/php/conf.d/memory.ini
18-Feb-2021 21:23:03 ---> Using cache
18-Feb-2021 21:23:03 ---> 16873a7bf5c8
18-Feb-2021 21:23:03 Successfully built 16873a7bf5c8
18-Feb-2021 21:23:03 Successfully tagged phpbb:php-7.1
18-Feb-2021 21:23:03 Built Docker image 'phpbb:php-7.1'
18-Feb-2021 21:23:03 Finished task 'Build image' with result: Success
18-Feb-2021 21:23:03
Substituting variable: ${bamboo.working.directory} with /home/bamboo/xml-data/build-dir/PHPBB3-DDM-JOB1
18-Feb-2021 21:23:03 Starting task 'Run tests' of type 'com.atlassian.bamboo.plugins.bamboo-docker-plugin:task.docker.cli'
18-Feb-2021 21:23:03 Running image name (phpbb:php-7.1)
18-Feb-2021 21:23:03
Beginning to execute external process for build 'phpBB3 - Development Docker Master - PHP 7.1 - SQLite #889 (PHPBB3-DDM-JOB1-889)'
... running command line:
/usr/bin/docker run --volume /home/bamboo/xml-data/build-dir/PHPBB3-DDM-JOB1:/data --workdir /data/phpBB --rm -u=991 -t phpbb:php-7.1 /bin/bash -c php ../composer.phar install --dev; cd ../build; ../phpBB/vendor/bin/phing build
... in: /home/bamboo/xml-data/build-dir/PHPBB3-DDM-JOB1
... using extra environment variables:
bamboo_planRepository_1_branch=master
bamboo_repository_75956230_previous_revision_number=7bfcd4f28883524e13103b1b744b396484180ba4
bamboo_planRepository_1_branchDisplayName=master
bamboo_repository_revision_number=7110b61df59a57be51e6d5b91cc52f52f8591aff
bamboo_resultsUrl=https://bamboo.phpbb.com/browse/PHPBB3-DDM-JOB1-889
bamboo_capability_system_builder_command_Git=/usr/bin/git
bamboo_build_working_directory=/home/bamboo/xml-data/build-dir/PHPBB3-DDM-JOB1
bamboo_planRepository_1_name=phpBB Master
bamboo_buildKey=PHPBB3-DDM-JOB1
bamboo_shortPlanName=Development Docker Master
bamboo_planRepository_name=phpBB Master
bamboo_repository_75956230_git_branch=master
bamboo_buildNumber=889
bamboo_capability_system_builder_phpunit_PHPUnit=/usr/bin/phpunit
bamboo_repository_75956230_name=phpBB Master
bamboo_shortJobName=PHP 7.1 - SQLite
bamboo_buildResultsUrl=https://bamboo.phpbb.com/browse/PHPBB3-DDM-JOB1-889
bamboo_planRepository_repositoryUrl=https://github.com/phpbb/phpbb.git
bamboo_repository_75956230_git_repositoryUrl=https://github.com/phpbb/phpbb.git
bamboo_agentId=65929217
bamboo_planName=phpBB3 - Development Docker Master
bamboo_shortPlanKey=DDM
bamboo_shortJobKey=JOB1
bamboo_capability_system_jdk_JDK_1_7_0_65=/usr/lib/jvm/java-7-openjdk-amd64
bamboo_planRepository_revision=7110b61df59a57be51e6d5b91cc52f52f8591aff
bamboo_buildTimeStamp=2021-02-18T21:08:55.649Z
bamboo_repository_previous_revision_number=7bfcd4f28883524e13103b1b744b396484180ba4
bamboo_capability_system_jdk_JDK_1_6_0_16=/usr/lib/jvm/java-6-sun-1.6.0.16
bamboo_capability_system_builder_mvn2_Maven_2=/usr/share/maven2
bamboo_planRepository_previousRevision=7bfcd4f28883524e13103b1b744b396484180ba4
bamboo_repository_git_branch=master
bamboo_buildResultKey=PHPBB3-DDM-JOB1-889
bamboo_repository_branch_name=master
bamboo_buildPlanName=phpBB3 - Development Docker Master - PHP 7.1 - SQLite
bamboo_planRepository_1_revision=7110b61df59a57be51e6d5b91cc52f52f8591aff
bamboo_build_commandline_com_atlassian_bamboo_plugins_bamboo_docker_plugin_task_docker_cli_3=/usr/bin/docker build --force-rm=true --tag=phpbb:php-7.1 /home/bamboo/xml-data/build-dir/PHPBB3-DDM-JOB1
bamboo_repository_name=phpBB Master
bamboo_buildFailed=false
bamboo_capability_system_docker_executable=/usr/bin/docker
bamboo_repository_75956230_git_username=
bamboo_planRepository_branch=master
bamboo_agentWorkingDirectory=/home/bamboo/xml-data/build-dir
bamboo_capability_system_git_executable=/usr/bin/git
bamboo_capability_system_builder_phpunit_PHPUnit_3_4=/usr/bin/phpunit
bamboo_repository_git_username=
bamboo_planRepository_1_previousRevision=7bfcd4f28883524e13103b1b744b396484180ba4
bamboo_repository_75956230_branch_name=master
bamboo_planRepository_branchDisplayName=master
bamboo_planRepository_1_type=gitv2
bamboo_planRepository_branchName=master
bamboo_capability_system_jdk_JDK=/usr/lib/jvm/java-6-sun
bamboo_plan_storageTag=PHPBB3-DDM
bamboo_hg_cache_directory=/home/bamboo/xml-data/build-dir/_hg-repositories-cache
bamboo_planRepository_1_username=
bamboo_planRepository_type=gitv2
bamboo_git_cache_directory=/home/bamboo/xml-data/build-dir/_git-repositories-cache
bamboo_repository_git_repositoryUrl=https://github.com/phpbb/phpbb.git
bamboo_capability_system_builder_ant_Ant=/usr/share/ant
bamboo_repository_75956230_revision_number=7110b61df59a57be51e6d5b91cc52f52f8591aff
bamboo_tmp_directory=/home/bamboo/temp
bamboo_working_directory=/home/bamboo/xml-data/build-dir/PHPBB3-DDM-JOB1
bamboo_planKey=PHPBB3-DDM
bamboo_capability_local=true
bamboo_planRepository_1_repositoryUrl=https://github.com/phpbb/phpbb.git
bamboo_planRepository_username=
bamboo_capability_system_jdk_JDK_1_6=/usr/lib/jvm/java-6-sun
bamboo_capability_system_jdk_JDK_1_7=/usr/lib/jvm/java-7-openjdk-amd64
bamboo_planRepository_1_branchName=master
18-Feb-2021 21:23:05 Cannot create cache directory /.composer/cache/repo/https---repo.packagist.org/, or directory is not writable. Proceeding without cache
18-Feb-2021 21:23:05 Cannot create cache directory /.composer/cache/files/, or directory is not writable. Proceeding without cache
18-Feb-2021 21:23:05 You are using the deprecated option "--dev". It has no effect and will break in Composer 3.
18-Feb-2021 21:23:05 Installing dependencies from lock file (including require-dev)
18-Feb-2021 21:23:05 Verifying lock file contents can be installed on current platform.
18-Feb-2021 21:23:05 Warning: The lock file is not up to date with the latest changes in composer.json. You may be getting outdated dependencies. It is recommended that you run `composer update` or `composer update <package name>`.
18-Feb-2021 21:23:05 Package operations: 90 installs, 0 updates, 0 removals
18-Feb-2021 21:23:05   - Downloading composer/installers (v1.10.0)
18-Feb-2021 21:23:05   - Downloading composer/package-versions-deprecated (1.11.99.1)
18-Feb-2021 21:23:05   - Downloading bantu/ini-get-wrapper (v1.0.1)
18-Feb-2021 21:23:05   - Downloading chita/topological_sort (v3.0.1)
18-Feb-2021 21:23:05   - Downloading symfony/process (v3.4.47)
18-Feb-2021 21:23:05   - Downloading symfony/finder (v3.4.47)
18-Feb-2021 21:23:05   - Downloading symfony/polyfill-ctype (v1.22.0)
18-Feb-2021 21:23:05   - Downloading symfony/filesystem (v3.4.47)
18-Feb-2021 21:23:05   - Downloading symfony/polyfill-mbstring (v1.22.0)
18-Feb-2021 21:23:05   - Downloading psr/log (1.1.3)
18-Feb-2021 21:23:05   - Downloading symfony/debug (v3.4.47)
18-Feb-2021 21:23:05   - Downloading symfony/console (v3.4.47)
18-Feb-2021 21:23:05   - Downloading seld/phar-utils (1.1.1)
18-Feb-2021 21:23:05   - Downloading seld/jsonlint (1.8.3)
18-Feb-2021 21:23:05   - Downloading react/promise (v2.8.0)
18-Feb-2021 21:23:05   - Downloading justinrainbow/json-schema (5.2.10)
18-Feb-2021 21:23:05   - Downloading composer/xdebug-handler (1.4.5)
18-Feb-2021 21:23:05   - Downloading composer/spdx-licenses (1.5.5)
18-Feb-2021 21:23:05   - Downloading composer/semver (3.2.4)
18-Feb-2021 21:23:05   - Downloading composer/ca-bundle (1.2.9)
18-Feb-2021 21:23:05   - Downloading composer/composer (2.0.8)
18-Feb-2021 21:23:05   - Downloading doctrine/event-manager (1.1.1)
18-Feb-2021 21:23:05   - Downloading doctrine/cache (1.10.2)
18-Feb-2021 21:23:05   - Downloading doctrine/dbal (3.0.0)
18-Feb-2021 21:23:05   - Downloading symfony/dom-crawler (v3.4.47)
18-Feb-2021 21:23:05   - Downloading symfony/css-selector (v3.4.47)
18-Feb-2021 21:23:05   - Downloading symfony/browser-kit (v3.4.47)
18-Feb-2021 21:23:05   - Downloading symfony/polyfill-php72 (v1.22.0)
18-Feb-2021 21:23:05   - Downloading symfony/polyfill-intl-normalizer (v1.22.0)
18-Feb-2021 21:23:05   - Downloading symfony/polyfill-intl-idn (v1.22.0)
18-Feb-2021 21:23:05   - Downloading ralouphie/getallheaders (3.0.3)
18-Feb-2021 21:23:05   - Downloading psr/http-message (1.0.1)
18-Feb-2021 21:23:05   - Downloading guzzlehttp/psr7 (1.7.0)
18-Feb-2021 21:23:05   - Downloading guzzlehttp/promises (1.4.0)
18-Feb-2021 21:23:05   - Downloading guzzlehttp/guzzle (6.5.5)
18-Feb-2021 21:23:05   - Downloading fabpot/goutte (v3.2.3)
18-Feb-2021 21:23:05   - Downloading google/recaptcha (1.2.4)
18-Feb-2021 21:23:05   - Downloading symfony/yaml (v3.4.47)
18-Feb-2021 21:23:05   - Downloading laravel/homestead (v7.20.0)
18-Feb-2021 21:23:05   - Downloading lusitanian/oauth (v0.8.11)
18-Feb-2021 21:23:05   - Downloading marc1706/fast-image-size (v1.1.6)
18-Feb-2021 21:23:05   - Downloading patchwork/utf8 (v1.3.3)
18-Feb-2021 21:23:05   - Downloading phing/phing (2.16.3)
18-Feb-2021 21:23:05   - Downloading webmozart/assert (1.9.1)
18-Feb-2021 21:23:05   - Downloading phpdocumentor/reflection-common (2.2.0)
18-Feb-2021 21:23:05   - Downloading phpdocumentor/type-resolver (1.4.0)
18-Feb-2021 21:23:05   - Downloading phpdocumentor/reflection-docblock (5.2.2)
18-Feb-2021 21:23:05   - Downloading sebastian/version (2.0.1)
18-Feb-2021 21:23:05   - Downloading sebastian/resource-operations (2.0.2)
18-Feb-2021 21:23:05   - Downloading sebastian/recursion-context (3.0.1)
18-Feb-2021 21:23:05   - Downloading sebastian/object-reflector (1.1.2)
18-Feb-2021 21:23:05   - Downloading sebastian/object-enumerator (3.0.4)
18-Feb-2021 21:23:05   - Downloading sebastian/global-state (2.0.0)
18-Feb-2021 21:23:05   - Downloading sebastian/exporter (3.1.3)
18-Feb-2021 21:23:05   - Downloading sebastian/environment (4.2.4)
18-Feb-2021 21:23:05   - Downloading sebastian/diff (3.0.3)
18-Feb-2021 21:23:05   - Downloading sebastian/comparator (3.0.3)
18-Feb-2021 21:23:05   - Downloading phpunit/php-timer (2.1.3)
18-Feb-2021 21:23:05   - Downloading phpunit/php-text-template (1.2.1)
18-Feb-2021 21:23:05   - Downloading phpunit/php-file-iterator (2.0.3)
18-Feb-2021 21:23:05   - Downloading theseer/tokenizer (1.2.0)
18-Feb-2021 21:23:05   - Downloading sebastian/code-unit-reverse-lookup (1.0.2)
18-Feb-2021 21:23:05   - Downloading phpunit/php-token-stream (3.1.2)
18-Feb-2021 21:23:05   - Downloading phpunit/php-code-coverage (6.1.4)
18-Feb-2021 21:23:05   - Downloading doctrine/instantiator (1.4.0)
18-Feb-2021 21:23:05   - Downloading phpspec/prophecy (1.12.2)
18-Feb-2021 21:23:05   - Downloading phar-io/version (2.0.1)
18-Feb-2021 21:23:05   - Downloading phar-io/manifest (1.0.3)
18-Feb-2021 21:23:05   - Downloading myclabs/deep-copy (1.10.2)
18-Feb-2021 21:23:05   - Downloading phpunit/phpunit (7.5.20)
18-Feb-2021 21:23:05   - Downloading phpunit/dbunit (4.0.0)
18-Feb-2021 21:23:05   - Downloading psr/container (1.0.0)
18-Feb-2021 21:23:05   - Downloading s9e/sweetdom (2.0.0)
18-Feb-2021 21:23:05   - Downloading s9e/regexp-builder (1.4.4)
18-Feb-2021 21:23:05   - Downloading s9e/text-formatter (2.8.1)
18-Feb-2021 21:23:05   - Downloading squizlabs/php_codesniffer (3.5.8)
18-Feb-2021 21:23:05   - Downloading symfony/config (v3.4.47)
18-Feb-2021 21:23:05   - Downloading symfony/http-foundation (v3.4.47)
18-Feb-2021 21:23:05   - Downloading symfony/event-dispatcher (v3.4.47)
18-Feb-2021 21:23:05   - Downloading symfony/http-kernel (v3.4.47)
18-Feb-2021 21:23:05   - Downloading symfony/dependency-injection (v3.4.47)
18-Feb-2021 21:23:05   - Downloading zendframework/zend-eventmanager (3.2.1)
18-Feb-2021 21:23:05   - Downloading zendframework/zend-code (3.4.1)
18-Feb-2021 21:23:05   - Downloading ocramius/proxy-manager (2.2.3)
18-Feb-2021 21:23:05   - Downloading symfony/proxy-manager-bridge (v3.4.47)
18-Feb-2021 21:23:05   - Downloading symfony/routing (v3.4.47)
18-Feb-2021 21:23:05   - Downloading twig/twig (v2.14.3)
18-Feb-2021 21:23:05   - Downloading symfony/twig-bridge (v3.4.47)
18-Feb-2021 21:23:06   0/88 [>---------------------------]   0%  - Downloading composer/package-versions-deprecated (1.11.99.1)
18-Feb-2021 21:23:06   - Downloading bantu/ini-get-wrapper (v1.0.1)
18-Feb-2021 21:23:07   - Downloading chita/topological_sort (v3.0.1)
18-Feb-2021 21:23:07   - Downloading symfony/process (v3.4.47)
18-Feb-2021 21:23:08   - Downloading symfony/finder (v3.4.47)
18-Feb-2021 21:23:08   - Downloading symfony/polyfill-ctype (v1.22.0)
18-Feb-2021 21:23:09   - Downloading symfony/filesystem (v3.4.47)
18-Feb-2021 21:23:09   - Downloading symfony/polyfill-mbstring (v1.22.0)
18-Feb-2021 21:23:10   - Downloading psr/log (1.1.3)
18-Feb-2021 21:23:10
18-Feb-2021 21:23:10   3/88 [>---------------------------]   3%
18-Feb-2021 21:23:10   5/88 [=>--------------------------]   5%
18-Feb-2021 21:23:10   6/88 [=>--------------------------]   6%
18-Feb-2021 21:23:10   8/88 [==>-------------------------]   9%
18-Feb-2021 21:23:10   9/88 [==>-------------------------]  10%
18-Feb-2021 21:23:10 12/88 [===>------------------------]  13%
18-Feb-2021 21:23:10 14/88 [====>-----------------------]  15%
18-Feb-2021 21:23:10 15/88 [====>-----------------------]  17%
18-Feb-2021 21:23:10 16/88 [=====>----------------------]  18%
18-Feb-2021 21:23:10 17/88 [=====>----------------------]  19%
18-Feb-2021 21:23:10 20/88 [======>---------------------]  22%
18-Feb-2021 21:23:10 22/88 [=======>--------------------]  25%
18-Feb-2021 21:23:10 23/88 [=======>--------------------]  26%
18-Feb-2021 21:23:10 25/88 [=======>--------------------]  28%
18-Feb-2021 21:23:10 27/88 [========>-------------------]  30%
18-Feb-2021 21:23:10 30/88 [=========>------------------]  34%
18-Feb-2021 21:23:10 31/88 [=========>------------------]  35%
18-Feb-2021 21:23:10 33/88 [==========>-----------------]  37%
18-Feb-2021 21:23:10 37/88 [===========>----------------]  42%
18-Feb-2021 21:23:11 38/88 [============>---------------]  43%
18-Feb-2021 21:23:11 39/88 [============>---------------]  44%
18-Feb-2021 21:23:11 40/88 [============>---------------]  45%
18-Feb-2021 21:23:11 43/88 [=============>--------------]  48%
18-Feb-2021 21:23:11 44/88 [==============>-------------]  50%
18-Feb-2021 21:23:11 46/88 [==============>-------------]  52%
18-Feb-2021 21:23:11 47/88 [==============>-------------]  53%
18-Feb-2021 21:23:11 48/88 [===============>------------]  54%
18-Feb-2021 21:23:11 49/88 [===============>------------]  55%
18-Feb-2021 21:23:11 51/88 [================>-----------]  57%
18-Feb-2021 21:23:11 52/88 [================>-----------]  59%
18-Feb-2021 21:23:11 54/88 [=================>----------]  61%
18-Feb-2021 21:23:11 55/88 [=================>----------]  62%
18-Feb-2021 21:23:11 56/88 [=================>----------]  63%
18-Feb-2021 21:23:11 57/88 [==================>---------]  64%
18-Feb-2021 21:23:11 58/88 [==================>---------]  65%
18-Feb-2021 21:23:11 59/88 [==================>---------]  67%
18-Feb-2021 21:23:11 60/88 [===================>--------]  68%
18-Feb-2021 21:23:11 61/88 [===================>--------]  69%
18-Feb-2021 21:23:11 63/88 [====================>-------]  71%
18-Feb-2021 21:23:11 64/88 [====================>-------]  72%
18-Feb-2021 21:23:11 65/88 [====================>-------]  73%
18-Feb-2021 21:23:11 66/88 [=====================>------]  75%
18-Feb-2021 21:23:11 67/88 [=====================>------]  76%
18-Feb-2021 21:23:11 70/88 [======================>-----]  79%
18-Feb-2021 21:23:11 74/88 [=======================>----]  84%
18-Feb-2021 21:23:11 76/88 [========================>---]  86%
18-Feb-2021 21:23:11 77/88 [========================>---]  87%
18-Feb-2021 21:23:11 78/88 [========================>---]  88%
18-Feb-2021 21:23:11 79/88 [=========================>--]  89%
18-Feb-2021 21:23:11 80/88 [=========================>--]  90%
18-Feb-2021 21:23:11 81/88 [=========================>--]  92%
18-Feb-2021 21:23:12 86/88 [===========================>]  97%
18-Feb-2021 21:23:12 87/88 [===========================>]  98%
18-Feb-2021 21:23:12 88/88 [============================] 100%
18-Feb-2021 21:23:12   - Installing composer/installers (v1.10.0): Extracting archive
18-Feb-2021 21:23:12   - Installing composer/package-versions-deprecated (1.11.99.1): Extracting archive
18-Feb-2021 21:23:12   - Installing bantu/ini-get-wrapper (v1.0.1): Extracting archive
18-Feb-2021 21:23:12   - Installing chita/topological_sort (v3.0.1): Extracting archive
18-Feb-2021 21:23:12   - Installing symfony/process (v3.4.47): Extracting archive
18-Feb-2021 21:23:12   - Installing symfony/finder (v3.4.47): Extracting archive
18-Feb-2021 21:23:12   - Installing symfony/polyfill-ctype (v1.22.0): Extracting archive
18-Feb-2021 21:23:12   - Installing symfony/filesystem (v3.4.47): Extracting archive
18-Feb-2021 21:23:12   - Installing symfony/polyfill-mbstring (v1.22.0): Extracting archive
18-Feb-2021 21:23:12   - Installing psr/log (1.1.3): Extracting archive
18-Feb-2021 21:23:12   - Installing symfony/debug (v3.4.47): Extracting archive
18-Feb-2021 21:23:12   - Installing symfony/console (v3.4.47): Extracting archive
18-Feb-2021 21:23:12   - Installing seld/phar-utils (1.1.1): Extracting archive
18-Feb-2021 21:23:12   - Installing seld/jsonlint (1.8.3): Extracting archive
18-Feb-2021 21:23:12   - Installing react/promise (v2.8.0): Extracting archive
18-Feb-2021 21:23:12   - Installing justinrainbow/json-schema (5.2.10): Extracting archive
18-Feb-2021 21:23:12   - Installing composer/xdebug-handler (1.4.5): Extracting archive
18-Feb-2021 21:23:12   - Installing composer/spdx-licenses (1.5.5): Extracting archive
18-Feb-2021 21:23:12   - Installing composer/semver (3.2.4): Extracting archive
18-Feb-2021 21:23:12   - Installing composer/ca-bundle (1.2.9): Extracting archive
18-Feb-2021 21:23:12   - Installing composer/composer (2.0.8): Extracting archive
18-Feb-2021 21:23:12   - Installing doctrine/event-manager (1.1.1): Extracting archive
18-Feb-2021 21:23:12   - Installing doctrine/cache (1.10.2): Extracting archive
18-Feb-2021 21:23:12   - Installing doctrine/dbal (3.0.0): Extracting archive
18-Feb-2021 21:23:12   - Installing symfony/dom-crawler (v3.4.47): Extracting archive
18-Feb-2021 21:23:12   - Installing symfony/css-selector (v3.4.47): Extracting archive
18-Feb-2021 21:23:12   - Installing symfony/browser-kit (v3.4.47): Extracting archive
18-Feb-2021 21:23:12   - Installing symfony/polyfill-php72 (v1.22.0): Extracting archive
18-Feb-2021 21:23:12   - Installing symfony/polyfill-intl-normalizer (v1.22.0): Extracting archive
18-Feb-2021 21:23:12   - Installing symfony/polyfill-intl-idn (v1.22.0): Extracting archive
18-Feb-2021 21:23:12   - Installing ralouphie/getallheaders (3.0.3): Extracting archive
18-Feb-2021 21:23:12   - Installing psr/http-message (1.0.1): Extracting archive
18-Feb-2021 21:23:12   - Installing guzzlehttp/psr7 (1.7.0): Extracting archive
18-Feb-2021 21:23:12   - Installing guzzlehttp/promises (1.4.0): Extracting archive
18-Feb-2021 21:23:12   - Installing guzzlehttp/guzzle (6.5.5): Extracting archive
18-Feb-2021 21:23:12   - Installing fabpot/goutte (v3.2.3): Extracting archive
18-Feb-2021 21:23:12   - Installing google/recaptcha (1.2.4): Extracting archive
18-Feb-2021 21:23:12   - Installing symfony/yaml (v3.4.47): Extracting archive
18-Feb-2021 21:23:12   - Installing laravel/homestead (v7.20.0): Extracting archive
18-Feb-2021 21:23:12   - Installing lusitanian/oauth (v0.8.11): Extracting archive
18-Feb-2021 21:23:12   - Installing marc1706/fast-image-size (v1.1.6): Extracting archive
18-Feb-2021 21:23:12   - Installing patchwork/utf8 (v1.3.3): Extracting archive
18-Feb-2021 21:23:12   - Installing phing/phing (2.16.3): Extracting archive
18-Feb-2021 21:23:12   - Installing webmozart/assert (1.9.1): Extracting archive
18-Feb-2021 21:23:12   - Installing phpdocumentor/reflection-common (2.2.0): Extracting archive
18-Feb-2021 21:23:12   - Installing phpdocumentor/type-resolver (1.4.0): Extracting archive
18-Feb-2021 21:23:12   - Installing phpdocumentor/reflection-docblock (5.2.2): Extracting archive
18-Feb-2021 21:23:12   - Installing sebastian/version (2.0.1): Extracting archive
18-Feb-2021 21:23:12   - Installing sebastian/resource-operations (2.0.2): Extracting archive
18-Feb-2021 21:23:12   - Installing sebastian/recursion-context (3.0.1): Extracting archive
18-Feb-2021 21:23:12   - Installing sebastian/object-reflector (1.1.2): Extracting archive
18-Feb-2021 21:23:12   - Installing sebastian/object-enumerator (3.0.4): Extracting archive
18-Feb-2021 21:23:12   - Installing sebastian/global-state (2.0.0): Extracting archive
18-Feb-2021 21:23:12   - Installing sebastian/exporter (3.1.3): Extracting archive
18-Feb-2021 21:23:12   - Installing sebastian/environment (4.2.4): Extracting archive
18-Feb-2021 21:23:12   - Installing sebastian/diff (3.0.3): Extracting archive
18-Feb-2021 21:23:12   - Installing sebastian/comparator (3.0.3): Extracting archive
18-Feb-2021 21:23:12   - Installing phpunit/php-timer (2.1.3): Extracting archive
18-Feb-2021 21:23:12   - Installing phpunit/php-text-template (1.2.1): Extracting archive
18-Feb-2021 21:23:12   - Installing phpunit/php-file-iterator (2.0.3): Extracting archive
18-Feb-2021 21:23:12   - Installing theseer/tokenizer (1.2.0): Extracting archive
18-Feb-2021 21:23:12   - Installing sebastian/code-unit-reverse-lookup (1.0.2): Extracting archive
18-Feb-2021 21:23:12   - Installing phpunit/php-token-stream (3.1.2): Extracting archive
18-Feb-2021 21:23:12   - Installing phpunit/php-code-coverage (6.1.4): Extracting archive
18-Feb-2021 21:23:12   - Installing doctrine/instantiator (1.4.0): Extracting archive
18-Feb-2021 21:23:12   - Installing phpspec/prophecy (1.12.2): Extracting archive
18-Feb-2021 21:23:12   - Installing phar-io/version (2.0.1): Extracting archive
18-Feb-2021 21:23:12   - Installing phar-io/manifest (1.0.3): Extracting archive
18-Feb-2021 21:23:12   - Installing myclabs/deep-copy (1.10.2): Extracting archive
18-Feb-2021 21:23:12   - Installing phpunit/phpunit (7.5.20): Extracting archive
18-Feb-2021 21:23:12   - Installing phpunit/dbunit (4.0.0): Extracting archive
18-Feb-2021 21:23:12   - Installing psr/container (1.0.0): Extracting archive
18-Feb-2021 21:23:12   - Installing s9e/sweetdom (2.0.0): Extracting archive
18-Feb-2021 21:23:12   - Installing s9e/regexp-builder (1.4.4): Extracting archive
18-Feb-2021 21:23:12   - Installing s9e/text-formatter (2.8.1): Extracting archive
18-Feb-2021 21:23:12   - Installing squizlabs/php_codesniffer (3.5.8): Extracting archive
18-Feb-2021 21:23:12   - Installing symfony/config (v3.4.47): Extracting archive
18-Feb-2021 21:23:12   - Installing symfony/polyfill-php56 (v1.20.0)
18-Feb-2021 21:23:12   - Installing symfony/polyfill-php70 (v1.20.0)
18-Feb-2021 21:23:12   - Installing symfony/http-foundation (v3.4.47): Extracting archive
18-Feb-2021 21:23:12   - Installing symfony/event-dispatcher (v3.4.47): Extracting archive
18-Feb-2021 21:23:12   - Installing symfony/http-kernel (v3.4.47): Extracting archive
18-Feb-2021 21:23:12   - Installing symfony/dependency-injection (v3.4.47): Extracting archive
18-Feb-2021 21:23:12   - Installing zendframework/zend-eventmanager (3.2.1): Extracting archive
18-Feb-2021 21:23:12   - Installing zendframework/zend-code (3.4.1): Extracting archive
18-Feb-2021 21:23:12   - Installing ocramius/proxy-manager (2.2.3): Extracting archive
18-Feb-2021 21:23:12   - Installing symfony/proxy-manager-bridge (v3.4.47): Extracting archive
18-Feb-2021 21:23:12   - Installing symfony/routing (v3.4.47): Extracting archive
18-Feb-2021 21:23:12   - Installing twig/twig (v2.14.3): Extracting archive
18-Feb-2021 21:23:12   - Installing symfony/twig-bridge (v3.4.47): Extracting archive
18-Feb-2021 21:23:12   0/76 [>---------------------------]   0%
18-Feb-2021 21:23:12 10/76 [===>------------------------]  13%
18-Feb-2021 21:23:12 19/76 [=======>--------------------]  25%
18-Feb-2021 21:23:13 29/76 [==========>-----------------]  38%
18-Feb-2021 21:23:13 36/76 [=============>--------------]  47%
18-Feb-2021 21:23:13 46/76 [================>-----------]  60%
18-Feb-2021 21:23:13 56/76 [====================>-------]  73%
18-Feb-2021 21:23:14 63/76 [=======================>----]  82%
18-Feb-2021 21:23:14 71/76 [==========================>-]  93%
18-Feb-2021 21:23:14 75/76 [===========================>]  98%
18-Feb-2021 21:23:14 76/76 [============================] 100%
18-Feb-2021 21:23:14 Package patchwork/utf8 is abandoned, you should avoid using it. Use symfony/polyfill-mbstring or symfony/string instead.
18-Feb-2021 21:23:14 Package zendframework/zend-code is abandoned, you should avoid using it. Use laminas/laminas-code instead.
18-Feb-2021 21:23:14 Package zendframework/zend-eventmanager is abandoned, you should avoid using it. Use laminas/laminas-eventmanager instead.
18-Feb-2021 21:23:14 Package phpunit/dbunit is abandoned, you should avoid using it. No replacement was suggested.
18-Feb-2021 21:23:14 Package phpunit/php-token-stream is abandoned, you should avoid using it. No replacement was suggested.
18-Feb-2021 21:23:14 Generating autoload files
18-Feb-2021 21:23:15 composer/package-versions-deprecated: Generating version class...
18-Feb-2021 21:23:15 composer/package-versions-deprecated: ...done generating version class
18-Feb-2021 21:23:15 52 packages you are using are looking for funding.
18-Feb-2021 21:23:15 Use the `composer fund` command to find out more!
18-Feb-2021 21:23:15
18-Feb-2021 21:23:15 Fatal error: Composer detected issues in your platform: Your Composer dependencies require a PHP version ">= 7.3.0". You are running 7.1.33. in /data/phpBB/vendor/composer/platform_check.php on line 24
18-Feb-2021 21:23:15
18-Feb-2021 21:23:15 Call Stack:
18-Feb-2021 21:23:15     0.0003     351944   1. {main}() /data/phpBB/vendor/phing/phing/bin/phing:0
18-Feb-2021 21:23:15     0.0006     366576   2. require_once('/data/phpBB/vendor/phing/phing/bin/phing.php') /data/phpBB/vendor/phing/phing/bin/phing:14
18-Feb-2021 21:23:15     0.0008     367680   3. require_once('/data/phpBB/vendor/autoload.php') /data/phpBB/vendor/phing/phing/bin/phing.php:14
18-Feb-2021 21:23:15     0.0010     382712   4. ComposerAutoloaderInit00d759b73e294ae026886f6b63cae9df::getLoader() /data/phpBB/vendor/autoload.php:7
18-Feb-2021 21:23:15     0.0011     388176   5. require('/data/phpBB/vendor/composer/platform_check.php') /data/phpBB/vendor/composer/autoload_real.php:25
18-Feb-2021 21:23:15     0.0012     388752   6. trigger_error() /data/phpBB/vendor/composer/platform_check.php:24
18-Feb-2021 21:23:15
18-Feb-2021 21:23:15 Exit code: 255, output: STDOUT:  Package zendframework/zend-code is abandoned, you should avoid using it. Use laminas/laminas-code instead.STDOUT:  Package zendframework/zend-eventmanager is abandoned, you should avoid using it. Use laminas/laminas-eventmanager instead.STDOUT:  Package phpunit/dbunit is abandoned, you should avoid using it. No replacement was suggested.STDOUT:  Package phpunit/php-token-stream is abandoned, you should avoid using it. No replacement was suggested.STDOUT:  Generating autoload filesSTDOUT:  composer/package-versions-deprecated: Generating version class...STDOUT:  composer/package-versions-deprecated: ...done generating version classSTDOUT:  52 packages you are using are looking for funding.STDOUT:  Use the `composer fund` command to find out more!STDOUT:  STDOUT:  Fatal error: Composer detected issues in your platform: Your Composer dependencies require a PHP version ">= 7.3.0". You are running 7.1.33. in /data/phpBB/vendor/composer/platform_check.php on line 24STDOUT:  STDOUT:  Call Stack:STDOUT:      0.0003     351944   1. {main}() /data/phpBB/vendor/phing/phing/bin/phing:0STDOUT:      0.0006     366576   2. require_once('/data/phpBB/vendor/phing/phing/bin/phing.php') /data/phpBB/vendor/phing/phing/bin/phing:14STDOUT:      0.0008     367680   3. require_once('/data/phpBB/vendor/autoload.php') /data/phpBB/vendor/phing/phing/bin/phing.php:14STDOUT:      0.0010     382712   4. ComposerAutoloaderInit00d759b73e294ae026886f6b63cae9df::getLoader() /data/phpBB/vendor/autoload.php:7STDOUT:      0.0011     388176   5. require('/data/phpBB/vendor/composer/platform_check.php') /data/phpBB/vendor/composer/autoload_real.php:25STDOUT:      0.0012     388752   6. trigger_error() /data/phpBB/vendor/composer/platform_check.php:24STDOUT: 
18-Feb-2021 21:23:15 Error occurred while running Task 'Run tests(2)' of type com.atlassian.bamboo.plugins.bamboo-docker-plugin:task.docker.cli.
18-Feb-2021 21:23:16 com.atlassian.bamboo.task.TaskException: Failed to execute task
18-Feb-2021 21:23:16         at com.atlassian.bamboo.plugins.docker.service.RunService.execute(RunService.java:75)
18-Feb-2021 21:23:16         at com.atlassian.bamboo.plugins.docker.tasks.cli.DockerCliTask.execute(DockerCliTask.java:70)
18-Feb-2021 21:23:16         at com.atlassian.bamboo.task.TaskExecutorImpl.lambda$executeTasks$3(TaskExecutorImpl.java:323)
18-Feb-2021 21:23:16         at com.atlassian.bamboo.task.TaskExecutorImpl.executeTaskWithPrePostActions(TaskExecutorImpl.java:256)
18-Feb-2021 21:23:16         at com.atlassian.bamboo.task.TaskExecutorImpl.executeTasks(TaskExecutorImpl.java:323)
18-Feb-2021 21:23:16         at com.atlassian.bamboo.task.TaskExecutorImpl.execute(TaskExecutorImpl.java:116)
18-Feb-2021 21:23:16         at com.atlassian.bamboo.build.pipeline.tasks.ExecuteBuildTask.call(ExecuteBuildTask.java:73)
18-Feb-2021 21:23:16         at com.atlassian.bamboo.v2.build.agent.DefaultBuildAgent.executeBuildPhase(DefaultBuildAgent.java:184)
18-Feb-2021 21:23:16         at com.atlassian.bamboo.v2.build.agent.DefaultBuildAgent.build(DefaultBuildAgent.java:156)
18-Feb-2021 21:23:16         at com.atlassian.bamboo.v2.build.agent.BuildAgentControllerImpl.lambda$waitAndPerformBuild$0(BuildAgentControllerImpl.java:130)
18-Feb-2021 21:23:16         at com.atlassian.bamboo.variable.CustomVariableContextImpl.withVariableSubstitutor(CustomVariableContextImpl.java:118)
18-Feb-2021 21:23:16         at com.atlassian.bamboo.v2.build.agent.BuildAgentControllerImpl.waitAndPerformBuild(BuildAgentControllerImpl.java:124)
18-Feb-2021 21:23:16         at com.atlassian.bamboo.v2.build.agent.DefaultBuildAgent.lambda$start$0(DefaultBuildAgent.java:108)
18-Feb-2021 21:23:16         at com.atlassian.bamboo.utils.BambooRunnables$1.run(BambooRunnables.java:48)
18-Feb-2021 21:23:16         at com.atlassian.bamboo.security.ImpersonationHelper.runWith(ImpersonationHelper.java:26)
18-Feb-2021 21:23:16         at com.atlassian.bamboo.security.ImpersonationHelper.runWithSystemAuthority(ImpersonationHelper.java:17)
18-Feb-2021 21:23:16         at com.atlassian.bamboo.security.ImpersonationHelper$1.run(ImpersonationHelper.java:41)
18-Feb-2021 21:23:16         at java.lang.Thread.run(Thread.java:748)
18-Feb-2021 21:23:16 Caused by: com.atlassian.bamboo.docker.DockerException: Error running Docker run command
18-Feb-2021 21:23:16         at com.atlassian.bamboo.docker.DockerContainerServiceImpl.run(DockerContainerServiceImpl.java:130)
18-Feb-2021 21:23:16         at sun.reflect.GeneratedMethodAccessor3133.invoke(Unknown Source)
18-Feb-2021 21:23:16         at sun.reflect.DelegatingMethodAccessorImpl.invoke(DelegatingMethodAccessorImpl.java:43)
18-Feb-2021 21:23:16         at java.lang.reflect.Method.invoke(Method.java:498)
18-Feb-2021 21:23:16         at com.atlassian.plugin.util.ContextClassLoaderSettingInvocationHandler.invoke(ContextClassLoaderSettingInvocationHandler.java:26)
18-Feb-2021 21:23:16         at com.sun.proxy.$Proxy446.run(Unknown Source)
18-Feb-2021 21:23:16         at sun.reflect.GeneratedMethodAccessor3133.invoke(Unknown Source)
18-Feb-2021 21:23:16         at sun.reflect.DelegatingMethodAccessorImpl.invoke(DelegatingMethodAccessorImpl.java:43)
18-Feb-2021 21:23:16         at java.lang.reflect.Method.invoke(Method.java:498)
18-Feb-2021 21:23:16         at org.springframework.aop.support.AopUtils.invokeJoinpointUsingReflection(AopUtils.java:343)
18-Feb-2021 21:23:16         at org.eclipse.gemini.blueprint.service.importer.support.internal.aop.ServiceInvoker.doInvoke(ServiceInvoker.java:56)
18-Feb-2021 21:23:16         at org.eclipse.gemini.blueprint.service.importer.support.internal.aop.ServiceInvoker.invoke(ServiceInvoker.java:60)
18-Feb-2021 21:23:16         at org.springframework.aop.framework.ReflectiveMethodInvocation.proceed(ReflectiveMethodInvocation.java:186)
18-Feb-2021 21:23:16         at org.springframework.aop.support.DelegatingIntroductionInterceptor.doProceed(DelegatingIntroductionInterceptor.java:136)
18-Feb-2021 21:23:16         at org.springframework.aop.support.DelegatingIntroductionInterceptor.invoke(DelegatingIntroductionInterceptor.java:124)
18-Feb-2021 21:23:16         at org.springframework.aop.framework.ReflectiveMethodInvocation.proceed(ReflectiveMethodInvocation.java:186)
18-Feb-2021 21:23:16         at org.eclipse.gemini.blueprint.service.util.internal.aop.ServiceTCCLInterceptor.invokeUnprivileged(ServiceTCCLInterceptor.java:70)
18-Feb-2021 21:23:16         at org.eclipse.gemini.blueprint.service.util.internal.aop.ServiceTCCLInterceptor.invoke(ServiceTCCLInterceptor.java:53)
18-Feb-2021 21:23:16         at org.springframework.aop.framework.ReflectiveMethodInvocation.proceed(ReflectiveMethodInvocation.java:186)
18-Feb-2021 21:23:16         at org.eclipse.gemini.blueprint.service.importer.support.LocalBundleContextAdvice.invoke(LocalBundleContextAdvice.java:57)
18-Feb-2021 21:23:16         at org.springframework.aop.framework.ReflectiveMethodInvocation.proceed(ReflectiveMethodInvocation.java:186)
18-Feb-2021 21:23:16         at org.springframework.aop.support.DelegatingIntroductionInterceptor.doProceed(DelegatingIntroductionInterceptor.java:136)
18-Feb-2021 21:23:16         at org.springframework.aop.support.DelegatingIntroductionInterceptor.invoke(DelegatingIntroductionInterceptor.java:124)
18-Feb-2021 21:23:16         at org.springframework.aop.framework.ReflectiveMethodInvocation.proceed(ReflectiveMethodInvocation.java:186)
18-Feb-2021 21:23:16         at org.springframework.aop.framework.JdkDynamicAopProxy.invoke(JdkDynamicAopProxy.java:212)
18-Feb-2021 21:23:16         at com.sun.proxy.$Proxy889.run(Unknown Source)
18-Feb-2021 21:23:16         at com.atlassian.bamboo.plugins.docker.client.DockerCmd.run(DockerCmd.java:47)
18-Feb-2021 21:23:16         at com.atlassian.bamboo.plugins.docker.service.RunService.execute(RunService.java:64)
18-Feb-2021 21:23:16         ... 17 more
18-Feb-2021 21:23:16 Caused by: com.atlassian.utils.process.ProcessException: Error executing /usr/bin/docker run --volume /home/bamboo/xml-data/build-dir/PHPBB3-DDM-JOB1:/data --workdir /data/phpBB --rm -u=991 -t phpbb:php-7.1 /bin/bash -c "php ../composer.phar install --dev; cd ../build; ../phpBB/vendor/bin/phing build"
18-Feb-2021 21:23:16         at com.atlassian.bamboo.docker.DockerContainerServiceImpl.execute(DockerContainerServiceImpl.java:302)
18-Feb-2021 21:23:16         at com.atlassian.bamboo.docker.DockerContainerServiceImpl.execute(DockerContainerServiceImpl.java:273)
18-Feb-2021 21:23:16         at com.atlassian.bamboo.docker.DockerContainerServiceImpl.run(DockerContainerServiceImpl.java:107)
18-Feb-2021 21:23:16         ... 44 more
18-Feb-2021 21:23:16 Starting task 'Parsing test results' of type 'com.atlassian.bamboo.plugins.testresultparser:task.testresultparser.junit'
18-Feb-2021 21:23:16 Parsing test results under /home/bamboo/xml-data/build-dir/PHPBB3-DDM-JOB1...
18-Feb-2021 21:23:16 Failing task since test cases were expected but none were found.
18-Feb-2021 21:23:16 Finished task 'Parsing test results' with result: Failed
18-Feb-2021 21:23:16 Running post build plugin 'NCover Results Collector'
18-Feb-2021 21:23:16 Running post build plugin 'Artifact Copier'
18-Feb-2021 21:23:16 Publishing an artifact: Coverage HTML Report
18-Feb-2021 21:23:16 Unable to publish artifact [Coverage HTML Report]: the source directory /home/bamboo/xml-data/build-dir/PHPBB3-DDM-JOB1/build/coverage does not exist.
18-Feb-2021 21:23:16 The artifact hasn't been successfully published after 170.1 μs
18-Feb-2021 21:23:16 Running post build plugin 'npm Cache Cleanup'
18-Feb-2021 21:23:16 Running post build plugin 'Clover Results Collector'
18-Feb-2021 21:23:16 Running post build plugin 'Docker Container Cleanup'
18-Feb-2021 21:23:16 Successfully removed working directory at '/home/bamboo/xml-data/build-dir/PHPBB3-DDM-JOB1'
18-Feb-2021 21:23:16 Finalising the build...
18-Feb-2021 21:23:16 Stopping timer.
18-Feb-2021 21:23:16 Build PHPBB3-DDM-JOB1-889 completed.
18-Feb-2021 21:23:16 Running on server: post build plugin 'NCover Results Collector'
18-Feb-2021 21:23:16 Running on server: post build plugin 'Build Hanging Detection Configuration'
18-Feb-2021 21:23:16 Running on server: post build plugin 'Clover Delta Calculator'
18-Feb-2021 21:23:16 Running on server: post build plugin 'Maven Dependencies Postprocessor'
18-Feb-2021 21:23:16 All post build plugins have finished
18-Feb-2021 21:23:16 Generating build results summary...
18-Feb-2021 21:23:16 Saving build results to disk...
18-Feb-2021 21:23:17 Store variable context...
18-Feb-2021 21:23:17 Indexing build results...
18-Feb-2021 21:23:17 Finished building PHPBB3-DDM-JOB1-889.