Build: #891 failed

Job: PHP 7.3 - SQLite failed

Stages & jobs

  1. Default Stage

Build log

The build generated 477 lines of output. Download or view full build log

27-Feb-2021 15:43:30 Build phpBB3 - Development Docker Master - PHP 7.1 - SQLite #891 (PHPBB3-DDM-JOB1-891) started building on agent Default Agent
27-Feb-2021 15:43:30
27-Feb-2021 15:43:30 Build working directory is /home/bamboo/xml-data/build-dir/PHPBB3-DDM-JOB1
27-Feb-2021 15:43:30 Executing build phpBB3 - Development Docker Master - PHP 7.1 - SQLite #891 (PHPBB3-DDM-JOB1-891)
27-Feb-2021 15:43:30 Starting task 'Checkout Default Repository' of type 'com.atlassian.bamboo.plugins.vcs:task.vcs.checkout'
27-Feb-2021 15:43:30 Checking out into /home/bamboo/xml-data/build-dir/PHPBB3-DDM-JOB1
27-Feb-2021 15:43:30 Updating source code to revision: 389641fa4e7c2fe7623ef4b1ccfbc40f43a9dc77
27-Feb-2021 15:43:31 Fetching 'refs/heads/master' from 'https://github.com/phpbb/phpbb.git'.
27-Feb-2021 15:43:32 Checking out revision 389641fa4e7c2fe7623ef4b1ccfbc40f43a9dc77.
27-Feb-2021 15:43:32 Creating local git repository in '/home/bamboo/xml-data/build-dir/PHPBB3-DDM-JOB1/.git'.
27-Feb-2021 15:43:32 Cloning into '/home/bamboo/xml-data/build-dir/PHPBB3-DDM-JOB1'...
27-Feb-2021 15:43:32 done.
27-Feb-2021 15:43:35 Note: checking out '389641fa4e7c2fe7623ef4b1ccfbc40f43a9dc77'.
27-Feb-2021 15:43:35
27-Feb-2021 15:43:35 You are in 'detached HEAD' state. You can look around, make experimental
27-Feb-2021 15:43:35 changes and commit them, and you can discard any commits you make in this
27-Feb-2021 15:43:35 state without impacting any branches by performing another checkout.
27-Feb-2021 15:43:35
27-Feb-2021 15:43:35 If you want to create a new branch to retain commits you create, you may
27-Feb-2021 15:43:35 do so (now or later) by using -b with the checkout command again. Example:
27-Feb-2021 15:43:35
27-Feb-2021 15:43:35   git checkout -b new_branch_name
27-Feb-2021 15:43:35
27-Feb-2021 15:43:35 HEAD is now at 389641f... Merge branch '3.3.x'
27-Feb-2021 15:43:35 Updated source code to revision: 389641fa4e7c2fe7623ef4b1ccfbc40f43a9dc77
27-Feb-2021 15:43:35 Finished task 'Checkout Default Repository' with result: Success
27-Feb-2021 15:43:35 Running pre-build action: VCS Version Collector
27-Feb-2021 15:43:35
Substituting variable: ${bamboo.working.directory} with /home/bamboo/xml-data/build-dir/PHPBB3-DDM-JOB1
27-Feb-2021 15:43:35 Starting task 'Build image' of type 'com.atlassian.bamboo.plugins.bamboo-docker-plugin:task.docker.cli'
27-Feb-2021 15:43:35
Beginning to execute external process for build 'phpBB3 - Development Docker Master - PHP 7.1 - SQLite #891 (PHPBB3-DDM-JOB1-891)'
... running command line:
/usr/bin/docker build --force-rm=true --tag=phpbb:php-7.1 /home/bamboo/xml-data/build-dir/PHPBB3-DDM-JOB1
... in: /home/bamboo/xml-data/build-dir/PHPBB3-DDM-JOB1
... using extra environment variables:
bamboo_planRepository_1_branch=master
bamboo_repository_75956230_previous_revision_number=fade5e08f117609a75fc286671479985241b8def
bamboo_planRepository_1_branchDisplayName=master
bamboo_repository_revision_number=389641fa4e7c2fe7623ef4b1ccfbc40f43a9dc77
bamboo_resultsUrl=https://bamboo.phpbb.com/browse/PHPBB3-DDM-JOB1-891
bamboo_capability_system_builder_command_Git=/usr/bin/git
bamboo_build_working_directory=/home/bamboo/xml-data/build-dir/PHPBB3-DDM-JOB1
bamboo_planRepository_1_name=phpBB Master
bamboo_buildKey=PHPBB3-DDM-JOB1
bamboo_capability_phpbb_tests=true
bamboo_shortPlanName=Development Docker Master
bamboo_capability_system_builder_command_fop=/usr/bin/fop
bamboo_capability_dbms_sqlite_2=true
bamboo_planRepository_name=phpBB Master
bamboo_repository_75956230_git_branch=master
bamboo_buildNumber=891
bamboo_capability_system_builder_phpunit_PHPUnit=/usr/bin/phpunit
bamboo_repository_75956230_name=phpBB Master
bamboo_shortJobName=PHP 7.1 - SQLite
bamboo_buildResultsUrl=https://bamboo.phpbb.com/browse/PHPBB3-DDM-JOB1-891
bamboo_planRepository_repositoryUrl=https://github.com/phpbb/phpbb.git
bamboo_repository_75956230_git_repositoryUrl=https://github.com/phpbb/phpbb.git
bamboo_agentId=131073
bamboo_planName=phpBB3 - Development Docker Master
bamboo_shortPlanKey=DDM
bamboo_shortJobKey=JOB1
bamboo_capability_dbms_mysql_55=true
bamboo_capability_system_jdk_JDK_1_7_0_65=/usr/lib/jvm/java-7-openjdk-amd64
bamboo_planRepository_revision=389641fa4e7c2fe7623ef4b1ccfbc40f43a9dc77
bamboo_buildTimeStamp=2021-02-27T15:26:58.179Z
bamboo_repository_previous_revision_number=fade5e08f117609a75fc286671479985241b8def
bamboo_capability_system_jdk_JDK_1_6_0_16=/usr/lib/jvm/java-6-sun-1.6.0.16
bamboo_capability_system_builder_mvn2_Maven_2=/usr/share/maven2
bamboo_planRepository_previousRevision=fade5e08f117609a75fc286671479985241b8def
bamboo_repository_git_branch=master
bamboo_buildResultKey=PHPBB3-DDM-JOB1-891
bamboo_repository_branch_name=master
bamboo_buildPlanName=phpBB3 - Development Docker Master - PHP 7.1 - SQLite
bamboo_planRepository_1_revision=389641fa4e7c2fe7623ef4b1ccfbc40f43a9dc77
bamboo_repository_name=phpBB Master
bamboo_buildFailed=false
bamboo_capability_system_docker_executable=/usr/bin/docker
bamboo_repository_75956230_git_username=
bamboo_planRepository_branch=master
bamboo_agentWorkingDirectory=/home/bamboo/xml-data/build-dir
bamboo_capability_system_git_executable=/usr/bin/git
bamboo_capability_system_builder_phpunit_PHPUnit_3_4=/usr/bin/phpunit
bamboo_repository_git_username=
bamboo_planRepository_1_previousRevision=fade5e08f117609a75fc286671479985241b8def
bamboo_repository_75956230_branch_name=master
bamboo_planRepository_branchDisplayName=master
bamboo_planRepository_1_type=gitv2
bamboo_planRepository_branchName=master
bamboo_capability_system_jdk_JDK=/usr/lib/jvm/java-6-sun
bamboo_plan_storageTag=PHPBB3-DDM
bamboo_hg_cache_directory=/home/bamboo/xml-data/build-dir/_hg-repositories-cache
bamboo_planRepository_1_username=
bamboo_planRepository_type=gitv2
bamboo_git_cache_directory=/home/bamboo/xml-data/build-dir/_git-repositories-cache
bamboo_repository_git_repositoryUrl=https://github.com/phpbb/phpbb.git
bamboo_capability_system_builder_ant_Ant=/usr/share/ant
bamboo_repository_75956230_revision_number=389641fa4e7c2fe7623ef4b1ccfbc40f43a9dc77
bamboo_tmp_directory=/home/bamboo/temp
bamboo_working_directory=/home/bamboo/xml-data/build-dir/PHPBB3-DDM-JOB1
bamboo_planKey=PHPBB3-DDM
bamboo_capability_local=true
bamboo_planRepository_1_repositoryUrl=https://github.com/phpbb/phpbb.git
bamboo_planRepository_username=
bamboo_capability_system_jdk_JDK_1_6=/usr/lib/jvm/java-6-sun
bamboo_capability_system_jdk_JDK_1_7=/usr/lib/jvm/java-7-openjdk-amd64
bamboo_planRepository_1_branchName=master
27-Feb-2021 15:43:35 Sending build context to Docker daemon  25.18MB
27-Feb-2021 15:43:35
27-Feb-2021 15:43:36 Step 1/5 : FROM php:7.1
27-Feb-2021 15:43:36 ---> 060b5298208c
27-Feb-2021 15:43:36 Step 2/5 : RUN apt-get update && apt-get install -y         git         zlib1g-dev         bzip2         zip         && docker-php-ext-install -j$(nproc) zip
27-Feb-2021 15:43:36 ---> Using cache
27-Feb-2021 15:43:36 ---> 91867ed570d0
27-Feb-2021 15:43:36 Step 3/5 : RUN pecl install xdebug-2.6.1
27-Feb-2021 15:43:36 ---> Using cache
27-Feb-2021 15:43:36 ---> 275e56c14141
27-Feb-2021 15:43:36 Step 4/5 : RUN docker-php-ext-enable xdebug
27-Feb-2021 15:43:36 ---> Using cache
27-Feb-2021 15:43:36 ---> 61358c4289e7
27-Feb-2021 15:43:36 Step 5/5 : RUN echo "memory_limit = 1536M" >> /usr/local/etc/php/conf.d/memory.ini
27-Feb-2021 15:43:37 ---> Running in 3582d40fe390
27-Feb-2021 15:43:41 Removing intermediate container 3582d40fe390
27-Feb-2021 15:43:41 ---> 7a771944570e
27-Feb-2021 15:43:42 Successfully built 7a771944570e
27-Feb-2021 15:43:42 Successfully tagged phpbb:php-7.1
27-Feb-2021 15:43:42 Built Docker image 'phpbb:php-7.1'
27-Feb-2021 15:43:42 Finished task 'Build image' with result: Success
27-Feb-2021 15:43:42
Substituting variable: ${bamboo.working.directory} with /home/bamboo/xml-data/build-dir/PHPBB3-DDM-JOB1
27-Feb-2021 15:43:42 Starting task 'Run tests' of type 'com.atlassian.bamboo.plugins.bamboo-docker-plugin:task.docker.cli'
27-Feb-2021 15:43:42 Running image name (phpbb:php-7.1)
27-Feb-2021 15:43:42
Beginning to execute external process for build 'phpBB3 - Development Docker Master - PHP 7.1 - SQLite #891 (PHPBB3-DDM-JOB1-891)'
... running command line:
/usr/bin/docker run --volume /home/bamboo/xml-data/build-dir/PHPBB3-DDM-JOB1:/data --workdir /data/phpBB --rm -u=991 -t phpbb:php-7.1 /bin/bash -c php ../composer.phar install --dev; cd ../build; ../phpBB/vendor/bin/phing build
... in: /home/bamboo/xml-data/build-dir/PHPBB3-DDM-JOB1
... using extra environment variables:
bamboo_planRepository_1_branch=master
bamboo_repository_75956230_previous_revision_number=fade5e08f117609a75fc286671479985241b8def
bamboo_planRepository_1_branchDisplayName=master
bamboo_repository_revision_number=389641fa4e7c2fe7623ef4b1ccfbc40f43a9dc77
bamboo_resultsUrl=https://bamboo.phpbb.com/browse/PHPBB3-DDM-JOB1-891
bamboo_capability_system_builder_command_Git=/usr/bin/git
bamboo_build_working_directory=/home/bamboo/xml-data/build-dir/PHPBB3-DDM-JOB1
bamboo_planRepository_1_name=phpBB Master
bamboo_buildKey=PHPBB3-DDM-JOB1
bamboo_capability_phpbb_tests=true
bamboo_shortPlanName=Development Docker Master
bamboo_capability_system_builder_command_fop=/usr/bin/fop
bamboo_capability_dbms_sqlite_2=true
bamboo_planRepository_name=phpBB Master
bamboo_repository_75956230_git_branch=master
bamboo_buildNumber=891
bamboo_capability_system_builder_phpunit_PHPUnit=/usr/bin/phpunit
bamboo_repository_75956230_name=phpBB Master
bamboo_shortJobName=PHP 7.1 - SQLite
bamboo_buildResultsUrl=https://bamboo.phpbb.com/browse/PHPBB3-DDM-JOB1-891
bamboo_planRepository_repositoryUrl=https://github.com/phpbb/phpbb.git
bamboo_repository_75956230_git_repositoryUrl=https://github.com/phpbb/phpbb.git
bamboo_agentId=131073
bamboo_planName=phpBB3 - Development Docker Master
bamboo_shortPlanKey=DDM
bamboo_shortJobKey=JOB1
bamboo_capability_dbms_mysql_55=true
bamboo_capability_system_jdk_JDK_1_7_0_65=/usr/lib/jvm/java-7-openjdk-amd64
bamboo_planRepository_revision=389641fa4e7c2fe7623ef4b1ccfbc40f43a9dc77
bamboo_buildTimeStamp=2021-02-27T15:26:58.179Z
bamboo_repository_previous_revision_number=fade5e08f117609a75fc286671479985241b8def
bamboo_capability_system_jdk_JDK_1_6_0_16=/usr/lib/jvm/java-6-sun-1.6.0.16
bamboo_capability_system_builder_mvn2_Maven_2=/usr/share/maven2
bamboo_planRepository_previousRevision=fade5e08f117609a75fc286671479985241b8def
bamboo_repository_git_branch=master
bamboo_buildResultKey=PHPBB3-DDM-JOB1-891
bamboo_repository_branch_name=master
bamboo_buildPlanName=phpBB3 - Development Docker Master - PHP 7.1 - SQLite
bamboo_planRepository_1_revision=389641fa4e7c2fe7623ef4b1ccfbc40f43a9dc77
bamboo_build_commandline_com_atlassian_bamboo_plugins_bamboo_docker_plugin_task_docker_cli_3=/usr/bin/docker build --force-rm=true --tag=phpbb:php-7.1 /home/bamboo/xml-data/build-dir/PHPBB3-DDM-JOB1
bamboo_repository_name=phpBB Master
bamboo_buildFailed=false
bamboo_capability_system_docker_executable=/usr/bin/docker
bamboo_repository_75956230_git_username=
bamboo_planRepository_branch=master
bamboo_agentWorkingDirectory=/home/bamboo/xml-data/build-dir
bamboo_capability_system_git_executable=/usr/bin/git
bamboo_capability_system_builder_phpunit_PHPUnit_3_4=/usr/bin/phpunit
bamboo_repository_git_username=
bamboo_planRepository_1_previousRevision=fade5e08f117609a75fc286671479985241b8def
bamboo_repository_75956230_branch_name=master
bamboo_planRepository_branchDisplayName=master
bamboo_planRepository_1_type=gitv2
bamboo_planRepository_branchName=master
bamboo_capability_system_jdk_JDK=/usr/lib/jvm/java-6-sun
bamboo_plan_storageTag=PHPBB3-DDM
bamboo_hg_cache_directory=/home/bamboo/xml-data/build-dir/_hg-repositories-cache
bamboo_planRepository_1_username=
bamboo_planRepository_type=gitv2
bamboo_git_cache_directory=/home/bamboo/xml-data/build-dir/_git-repositories-cache
bamboo_repository_git_repositoryUrl=https://github.com/phpbb/phpbb.git
bamboo_capability_system_builder_ant_Ant=/usr/share/ant
bamboo_repository_75956230_revision_number=389641fa4e7c2fe7623ef4b1ccfbc40f43a9dc77
bamboo_tmp_directory=/home/bamboo/temp
bamboo_working_directory=/home/bamboo/xml-data/build-dir/PHPBB3-DDM-JOB1
bamboo_planKey=PHPBB3-DDM
bamboo_capability_local=true
bamboo_planRepository_1_repositoryUrl=https://github.com/phpbb/phpbb.git
bamboo_planRepository_username=
bamboo_capability_system_jdk_JDK_1_6=/usr/lib/jvm/java-6-sun
bamboo_capability_system_jdk_JDK_1_7=/usr/lib/jvm/java-7-openjdk-amd64
bamboo_planRepository_1_branchName=master
27-Feb-2021 15:43:43 Cannot create cache directory /.composer/cache/repo/https---repo.packagist.org/, or directory is not writable. Proceeding without cache
27-Feb-2021 15:43:43 Cannot create cache directory /.composer/cache/files/, or directory is not writable. Proceeding without cache
27-Feb-2021 15:43:43 You are using the deprecated option "--dev". It has no effect and will break in Composer 3.
27-Feb-2021 15:43:43 Installing dependencies from lock file (including require-dev)
27-Feb-2021 15:43:43 Verifying lock file contents can be installed on current platform.
27-Feb-2021 15:43:43 Package operations: 108 installs, 0 updates, 0 removals
27-Feb-2021 15:43:43   - Downloading composer/installers (v1.10.0)
27-Feb-2021 15:43:43   - Downloading composer/package-versions-deprecated (1.11.99.1)
27-Feb-2021 15:43:43   - Downloading bantu/ini-get-wrapper (v1.0.1)
27-Feb-2021 15:43:43   - Downloading chita/topological_sort (v3.0.1)
27-Feb-2021 15:43:43   - Downloading symfony/polyfill-php80 (v1.22.1)
27-Feb-2021 15:43:43   - Downloading symfony/process (v5.2.3)
27-Feb-2021 15:43:43   - Downloading symfony/finder (v5.2.3)
27-Feb-2021 15:43:43   - Downloading symfony/polyfill-ctype (v1.22.1)
27-Feb-2021 15:43:43   - Downloading symfony/filesystem (v5.2.3)
27-Feb-2021 15:43:43   - Downloading symfony/polyfill-mbstring (v1.22.1)
27-Feb-2021 15:43:43   - Downloading symfony/polyfill-intl-normalizer (v1.22.1)
27-Feb-2021 15:43:43   - Downloading symfony/polyfill-intl-grapheme (v1.22.1)
27-Feb-2021 15:43:43   - Downloading symfony/string (v5.2.3)
27-Feb-2021 15:43:43   - Downloading psr/container (1.0.0)
27-Feb-2021 15:43:43   - Downloading symfony/service-contracts (v2.2.0)
27-Feb-2021 15:43:43   - Downloading symfony/polyfill-php73 (v1.22.1)
27-Feb-2021 15:43:43   - Downloading symfony/console (v5.2.3)
27-Feb-2021 15:43:43   - Downloading seld/phar-utils (1.1.1)
27-Feb-2021 15:43:43   - Downloading seld/jsonlint (1.8.3)
27-Feb-2021 15:43:43   - Downloading react/promise (v2.8.0)
27-Feb-2021 15:43:43   - Downloading psr/log (1.1.3)
27-Feb-2021 15:43:43   - Downloading justinrainbow/json-schema (5.2.10)
27-Feb-2021 15:43:43   - Downloading composer/xdebug-handler (1.4.5)
27-Feb-2021 15:43:43   - Downloading composer/spdx-licenses (1.5.5)
27-Feb-2021 15:43:43   - Downloading composer/semver (3.2.4)
27-Feb-2021 15:43:43   - Downloading composer/ca-bundle (1.2.9)
27-Feb-2021 15:43:43   - Downloading composer/composer (2.0.11)
27-Feb-2021 15:43:43   - Downloading doctrine/event-manager (1.1.1)
27-Feb-2021 15:43:43   - Downloading doctrine/cache (1.10.2)
27-Feb-2021 15:43:43   - Downloading doctrine/dbal (3.0.0)
27-Feb-2021 15:43:43   - Downloading symfony/dom-crawler (v5.2.3)
27-Feb-2021 15:43:43   - Downloading symfony/css-selector (v5.2.3)
27-Feb-2021 15:43:43   - Downloading symfony/browser-kit (v5.2.3)
27-Feb-2021 15:43:43   - Downloading symfony/polyfill-php72 (v1.22.1)
27-Feb-2021 15:43:43   - Downloading symfony/polyfill-intl-idn (v1.22.1)
27-Feb-2021 15:43:43   - Downloading ralouphie/getallheaders (3.0.3)
27-Feb-2021 15:43:43   - Downloading psr/http-message (1.0.1)
27-Feb-2021 15:43:43   - Downloading guzzlehttp/psr7 (1.7.0)
27-Feb-2021 15:43:43   - Downloading guzzlehttp/promises (1.4.0)
27-Feb-2021 15:43:43   - Downloading guzzlehttp/guzzle (6.5.5)
27-Feb-2021 15:43:43   - Downloading fabpot/goutte (v3.3.1)
27-Feb-2021 15:43:43   - Downloading google/recaptcha (1.2.4)
27-Feb-2021 15:43:43   - Downloading laminas/laminas-zendframework-bridge (1.1.1)
27-Feb-2021 15:43:43   - Downloading laminas/laminas-eventmanager (3.3.0)
27-Feb-2021 15:43:43   - Downloading laminas/laminas-code (3.4.1)
27-Feb-2021 15:43:43   - Downloading symfony/deprecation-contracts (v2.2.0)
27-Feb-2021 15:43:43   - Downloading symfony/yaml (v5.2.3)
27-Feb-2021 15:43:43   - Downloading laravel/homestead (v10.17.0)
27-Feb-2021 15:43:43   - Downloading lusitanian/oauth (v0.8.11)
27-Feb-2021 15:43:43   - Downloading marc1706/fast-image-size (v1.1.6)
27-Feb-2021 15:43:43   - Downloading sebastian/version (3.0.2)
27-Feb-2021 15:43:43   - Downloading sebastian/type (2.3.1)
27-Feb-2021 15:43:43   - Downloading sebastian/resource-operations (3.0.3)
27-Feb-2021 15:43:43   - Downloading sebastian/recursion-context (4.0.4)
27-Feb-2021 15:43:43   - Downloading sebastian/object-reflector (2.0.4)
27-Feb-2021 15:43:43   - Downloading sebastian/object-enumerator (4.0.4)
27-Feb-2021 15:43:43   - Downloading sebastian/global-state (5.0.2)
27-Feb-2021 15:43:43   - Downloading sebastian/exporter (4.0.3)
27-Feb-2021 15:43:43   - Downloading sebastian/environment (5.1.3)
27-Feb-2021 15:43:43   - Downloading sebastian/diff (4.0.4)
27-Feb-2021 15:43:43   - Downloading sebastian/comparator (4.0.6)
27-Feb-2021 15:43:43   - Downloading sebastian/code-unit (1.0.8)
27-Feb-2021 15:43:43   - Downloading sebastian/cli-parser (1.0.1)
27-Feb-2021 15:43:43   - Downloading phpunit/php-timer (5.0.3)
27-Feb-2021 15:43:43   - Downloading phpunit/php-text-template (2.0.4)
27-Feb-2021 15:43:43   - Downloading phpunit/php-invoker (3.1.1)
27-Feb-2021 15:43:43   - Downloading phpunit/php-file-iterator (3.0.5)
27-Feb-2021 15:43:43   - Downloading theseer/tokenizer (1.2.0)
27-Feb-2021 15:43:43   - Downloading nikic/php-parser (v4.10.4)
27-Feb-2021 15:43:43   - Downloading sebastian/lines-of-code (1.0.3)
27-Feb-2021 15:43:43   - Downloading sebastian/complexity (2.0.2)
27-Feb-2021 15:43:43   - Downloading sebastian/code-unit-reverse-lookup (2.0.3)
27-Feb-2021 15:43:43   - Downloading phpunit/php-code-coverage (9.2.5)
27-Feb-2021 15:43:43   - Downloading webmozart/assert (1.9.1)
27-Feb-2021 15:43:43   - Downloading phpdocumentor/reflection-common (2.2.0)
27-Feb-2021 15:43:43   - Downloading phpdocumentor/type-resolver (1.4.0)
27-Feb-2021 15:43:43   - Downloading phpdocumentor/reflection-docblock (5.2.2)
27-Feb-2021 15:43:43   - Downloading doctrine/instantiator (1.4.0)
27-Feb-2021 15:43:43   - Downloading phpspec/prophecy (1.12.2)
27-Feb-2021 15:43:43   - Downloading phar-io/version (3.1.0)
27-Feb-2021 15:43:43   - Downloading phar-io/manifest (2.0.1)
27-Feb-2021 15:43:43   - Downloading myclabs/deep-copy (1.10.2)
27-Feb-2021 15:43:43   - Downloading phpunit/phpunit (9.5.2)
27-Feb-2021 15:43:43   - Downloading misantron/dbunit (5.1.0)
27-Feb-2021 15:43:43   - Downloading patchwork/utf8 (v1.3.3)
27-Feb-2021 15:43:43   - Downloading phing/phing (2.16.4)
27-Feb-2021 15:43:43   - Downloading s9e/sweetdom (2.0.0)
27-Feb-2021 15:43:43   - Downloading s9e/regexp-builder (1.4.4)
27-Feb-2021 15:43:43   - Downloading s9e/text-formatter (2.8.3)
27-Feb-2021 15:43:43   - Downloading squizlabs/php_codesniffer (3.5.8)
27-Feb-2021 15:43:43   - Downloading symfony/config (v5.2.3)
27-Feb-2021 15:43:43   - Downloading symfony/debug (v4.4.19)
27-Feb-2021 15:43:43   - Downloading psr/event-dispatcher (1.0.0)
27-Feb-2021 15:43:43   - Downloading symfony/event-dispatcher-contracts (v2.2.0)
27-Feb-2021 15:43:43   - Downloading symfony/http-foundation (v5.2.3)
27-Feb-2021 15:43:43   - Downloading symfony/http-client-contracts (v2.3.1)
27-Feb-2021 15:43:43   - Downloading symfony/event-dispatcher (v5.2.3)
27-Feb-2021 15:43:43   - Downloading symfony/var-dumper (v5.2.3)
27-Feb-2021 15:43:43   - Downloading symfony/error-handler (v5.2.3)
27-Feb-2021 15:43:43   - Downloading symfony/http-kernel (v5.2.3)
27-Feb-2021 15:43:43   - Downloading symfony/mime (v5.2.3)
27-Feb-2021 15:43:43   - Downloading symfony/dependency-injection (v5.2.3)
27-Feb-2021 15:43:43   - Downloading friendsofphp/proxy-manager-lts (v1.0.3)
27-Feb-2021 15:43:43   - Downloading symfony/proxy-manager-bridge (v5.2.3)
27-Feb-2021 15:43:43   - Downloading symfony/routing (v5.2.3)
27-Feb-2021 15:43:43   - Downloading twig/twig (v2.14.3)
27-Feb-2021 15:43:43   - Downloading symfony/translation-contracts (v2.3.0)
27-Feb-2021 15:43:43   - Downloading symfony/twig-bridge (v5.2.3)
27-Feb-2021 15:43:43    0/108 [>---------------------------]   0%  - Downloading composer/package-versions-deprecated (1.11.99.1)
27-Feb-2021 15:43:44   - Downloading bantu/ini-get-wrapper (v1.0.1)
27-Feb-2021 15:43:44   - Downloading chita/topological_sort (v3.0.1)
27-Feb-2021 15:43:45   - Downloading symfony/polyfill-php80 (v1.22.1)
27-Feb-2021 15:43:45   - Downloading symfony/process (v5.2.3)
27-Feb-2021 15:43:46   - Downloading symfony/finder (v5.2.3)
27-Feb-2021 15:43:46   - Downloading symfony/polyfill-ctype (v1.22.1)
27-Feb-2021 15:43:47   - Downloading symfony/filesystem (v5.2.3)
27-Feb-2021 15:43:48   - Downloading symfony/polyfill-mbstring (v1.22.1)
27-Feb-2021 15:43:48
27-Feb-2021 15:43:48    3/108 [>---------------------------]   2%
27-Feb-2021 15:43:48    5/108 [=>--------------------------]   4%
27-Feb-2021 15:43:48    7/108 [=>--------------------------]   6%
27-Feb-2021 15:43:48    8/108 [==>-------------------------]   7%
27-Feb-2021 15:43:48    9/108 [==>-------------------------]   8%
27-Feb-2021 15:43:48   12/108 [===>------------------------]  11%
27-Feb-2021 15:43:48   14/108 [===>------------------------]  12%
27-Feb-2021 15:43:48   15/108 [===>------------------------]  13%
27-Feb-2021 15:43:48   18/108 [====>-----------------------]  16%
27-Feb-2021 15:43:48   19/108 [====>-----------------------]  17%
27-Feb-2021 15:43:48   20/108 [=====>----------------------]  18%
27-Feb-2021 15:43:48   21/108 [=====>----------------------]  19%
27-Feb-2021 15:43:48   22/108 [=====>----------------------]  20%
27-Feb-2021 15:43:48   24/108 [======>---------------------]  22%
27-Feb-2021 15:43:48   25/108 [======>---------------------]  23%
27-Feb-2021 15:43:48   26/108 [======>---------------------]  24%
27-Feb-2021 15:43:48   27/108 [=======>--------------------]  25%
27-Feb-2021 15:43:48   28/108 [=======>--------------------]  25%
27-Feb-2021 15:43:48   29/108 [=======>--------------------]  26%
27-Feb-2021 15:43:49   30/108 [=======>--------------------]  27%
27-Feb-2021 15:43:49   31/108 [========>-------------------]  28%
27-Feb-2021 15:43:49   32/108 [========>-------------------]  29%
27-Feb-2021 15:43:49   33/108 [========>-------------------]  30%
27-Feb-2021 15:43:49   34/108 [========>-------------------]  31%
27-Feb-2021 15:43:49   36/108 [=========>------------------]  33%
27-Feb-2021 15:43:49   37/108 [=========>------------------]  34%
27-Feb-2021 15:43:49   38/108 [=========>------------------]  35%
27-Feb-2021 15:43:49   39/108 [==========>-----------------]  36%
27-Feb-2021 15:43:49   41/108 [==========>-----------------]  37%
27-Feb-2021 15:43:49   43/108 [===========>----------------]  39%
27-Feb-2021 15:43:49   44/108 [===========>----------------]  40%
27-Feb-2021 15:43:49   45/108 [===========>----------------]  41%
27-Feb-2021 15:43:49   46/108 [===========>----------------]  42%
27-Feb-2021 15:43:49   47/108 [============>---------------]  43%
27-Feb-2021 15:43:49   48/108 [============>---------------]  44%
27-Feb-2021 15:43:49   49/108 [============>---------------]  45%
27-Feb-2021 15:43:49   53/108 [=============>--------------]  49%
27-Feb-2021 15:43:49   54/108 [==============>-------------]  50%
27-Feb-2021 15:43:49   55/108 [==============>-------------]  50%
27-Feb-2021 15:43:49   56/108 [==============>-------------]  51%
27-Feb-2021 15:43:49   57/108 [==============>-------------]  52%
27-Feb-2021 15:43:49   59/108 [===============>------------]  54%
27-Feb-2021 15:43:49   60/108 [===============>------------]  55%
27-Feb-2021 15:43:49   65/108 [================>-----------]  60%
27-Feb-2021 15:43:49   66/108 [=================>----------]  61%
27-Feb-2021 15:43:49   67/108 [=================>----------]  62%
27-Feb-2021 15:43:49   69/108 [=================>----------]  63%
27-Feb-2021 15:43:49   71/108 [==================>---------]  65%
27-Feb-2021 15:43:49   72/108 [==================>---------]  66%
27-Feb-2021 15:43:49   74/108 [===================>--------]  68%
27-Feb-2021 15:43:50   75/108 [===================>--------]  69%
27-Feb-2021 15:43:50   78/108 [====================>-------]  72%
27-Feb-2021 15:43:50   82/108 [=====================>------]  75%
27-Feb-2021 15:43:50   83/108 [=====================>------]  76%
27-Feb-2021 15:43:50   84/108 [=====================>------]  77%
27-Feb-2021 15:43:50   85/108 [======================>-----]  78%
27-Feb-2021 15:43:50   86/108 [======================>-----]  79%
27-Feb-2021 15:43:50   87/108 [======================>-----]  80%
27-Feb-2021 15:43:51   88/108 [======================>-----]  81%
27-Feb-2021 15:43:51   89/108 [=======================>----]  82%
27-Feb-2021 15:43:51   90/108 [=======================>----]  83%
27-Feb-2021 15:43:51   92/108 [=======================>----]  85%
27-Feb-2021 15:43:51   93/108 [========================>---]  86%
27-Feb-2021 15:43:51   94/108 [========================>---]  87%
27-Feb-2021 15:43:51   95/108 [========================>---]  87%
27-Feb-2021 15:43:51   96/108 [========================>---]  88%
27-Feb-2021 15:43:51   97/108 [=========================>--]  89%
27-Feb-2021 15:43:51   98/108 [=========================>--]  90%
27-Feb-2021 15:43:51   99/108 [=========================>--]  91%
27-Feb-2021 15:43:52 100/108 [=========================>--]  92%
27-Feb-2021 15:43:52 101/108 [==========================>-]  93%
27-Feb-2021 15:43:52 102/108 [==========================>-]  94%
27-Feb-2021 15:43:52 103/108 [==========================>-]  95%
27-Feb-2021 15:43:52 104/108 [==========================>-]  96%
27-Feb-2021 15:43:52 105/108 [===========================>]  97%
27-Feb-2021 15:43:52 106/108 [===========================>]  98%
27-Feb-2021 15:43:52 107/108 [===========================>]  99%
27-Feb-2021 15:43:52 108/108 [============================] 100%
27-Feb-2021 15:43:52   - Installing composer/installers (v1.10.0): Extracting archive
27-Feb-2021 15:43:52   - Installing composer/package-versions-deprecated (1.11.99.1): Extracting archive
27-Feb-2021 15:43:52   - Installing bantu/ini-get-wrapper (v1.0.1): Extracting archive
27-Feb-2021 15:43:52   - Installing chita/topological_sort (v3.0.1): Extracting archive
27-Feb-2021 15:43:52   - Installing symfony/polyfill-php80 (v1.22.1): Extracting archive
27-Feb-2021 15:43:52   - Installing symfony/process (v5.2.3): Extracting archive
27-Feb-2021 15:43:52   - Installing symfony/finder (v5.2.3): Extracting archive
27-Feb-2021 15:43:52   - Installing symfony/polyfill-ctype (v1.22.1): Extracting archive
27-Feb-2021 15:43:52   - Installing symfony/filesystem (v5.2.3): Extracting archive
27-Feb-2021 15:43:52   - Installing symfony/polyfill-mbstring (v1.22.1): Extracting archive
27-Feb-2021 15:43:52   - Installing symfony/polyfill-intl-normalizer (v1.22.1): Extracting archive
27-Feb-2021 15:43:52   - Installing symfony/polyfill-intl-grapheme (v1.22.1): Extracting archive
27-Feb-2021 15:43:52   - Installing symfony/string (v5.2.3): Extracting archive
27-Feb-2021 15:43:52   - Installing psr/container (1.0.0): Extracting archive
27-Feb-2021 15:43:52   - Installing symfony/service-contracts (v2.2.0): Extracting archive
27-Feb-2021 15:43:52   - Installing symfony/polyfill-php73 (v1.22.1): Extracting archive
27-Feb-2021 15:43:52   - Installing symfony/console (v5.2.3): Extracting archive
27-Feb-2021 15:43:52   - Installing seld/phar-utils (1.1.1): Extracting archive
27-Feb-2021 15:43:52   - Installing seld/jsonlint (1.8.3): Extracting archive
27-Feb-2021 15:43:52   - Installing react/promise (v2.8.0): Extracting archive
27-Feb-2021 15:43:52   - Installing psr/log (1.1.3): Extracting archive
27-Feb-2021 15:43:52   - Installing justinrainbow/json-schema (5.2.10): Extracting archive
27-Feb-2021 15:43:52   - Installing composer/xdebug-handler (1.4.5): Extracting archive
27-Feb-2021 15:43:52   - Installing composer/spdx-licenses (1.5.5): Extracting archive
27-Feb-2021 15:43:52   - Installing composer/semver (3.2.4): Extracting archive
27-Feb-2021 15:43:52   - Installing composer/ca-bundle (1.2.9): Extracting archive
27-Feb-2021 15:43:52   - Installing composer/composer (2.0.11): Extracting archive
27-Feb-2021 15:43:52   - Installing doctrine/event-manager (1.1.1): Extracting archive
27-Feb-2021 15:43:52   - Installing doctrine/cache (1.10.2): Extracting archive
27-Feb-2021 15:43:52   - Installing doctrine/dbal (3.0.0): Extracting archive
27-Feb-2021 15:43:52   - Installing symfony/dom-crawler (v5.2.3): Extracting archive
27-Feb-2021 15:43:52   - Installing symfony/css-selector (v5.2.3): Extracting archive
27-Feb-2021 15:43:52   - Installing symfony/browser-kit (v5.2.3): Extracting archive
27-Feb-2021 15:43:52   - Installing symfony/polyfill-php72 (v1.22.1): Extracting archive
27-Feb-2021 15:43:52   - Installing symfony/polyfill-intl-idn (v1.22.1): Extracting archive
27-Feb-2021 15:43:52   - Installing ralouphie/getallheaders (3.0.3): Extracting archive
27-Feb-2021 15:43:52   - Installing psr/http-message (1.0.1): Extracting archive
27-Feb-2021 15:43:52   - Installing guzzlehttp/psr7 (1.7.0): Extracting archive
27-Feb-2021 15:43:52   - Installing guzzlehttp/promises (1.4.0): Extracting archive
27-Feb-2021 15:43:52   - Installing guzzlehttp/guzzle (6.5.5): Extracting archive
27-Feb-2021 15:43:52   - Installing fabpot/goutte (v3.3.1): Extracting archive
27-Feb-2021 15:43:52   - Installing google/recaptcha (1.2.4): Extracting archive
27-Feb-2021 15:43:52   - Installing laminas/laminas-zendframework-bridge (1.1.1): Extracting archive
27-Feb-2021 15:43:52   - Installing laminas/laminas-eventmanager (3.3.0): Extracting archive
27-Feb-2021 15:43:52   - Installing laminas/laminas-code (3.4.1): Extracting archive
27-Feb-2021 15:43:52   - Installing symfony/deprecation-contracts (v2.2.0): Extracting archive
27-Feb-2021 15:43:52   - Installing symfony/yaml (v5.2.3): Extracting archive
27-Feb-2021 15:43:52   - Installing laravel/homestead (v10.17.0): Extracting archive
27-Feb-2021 15:43:52   - Installing lusitanian/oauth (v0.8.11): Extracting archive
27-Feb-2021 15:43:52   - Installing marc1706/fast-image-size (v1.1.6): Extracting archive
27-Feb-2021 15:43:52   - Installing sebastian/version (3.0.2): Extracting archive
27-Feb-2021 15:43:52   - Installing sebastian/type (2.3.1): Extracting archive
27-Feb-2021 15:43:52   - Installing sebastian/resource-operations (3.0.3): Extracting archive
27-Feb-2021 15:43:52   - Installing sebastian/recursion-context (4.0.4): Extracting archive
27-Feb-2021 15:43:52   - Installing sebastian/object-reflector (2.0.4): Extracting archive
27-Feb-2021 15:43:52   - Installing sebastian/object-enumerator (4.0.4): Extracting archive
27-Feb-2021 15:43:52   - Installing sebastian/global-state (5.0.2): Extracting archive
27-Feb-2021 15:43:52   - Installing sebastian/exporter (4.0.3): Extracting archive
27-Feb-2021 15:43:52   - Installing sebastian/environment (5.1.3): Extracting archive
27-Feb-2021 15:43:52   - Installing sebastian/diff (4.0.4): Extracting archive
27-Feb-2021 15:43:52   - Installing sebastian/comparator (4.0.6): Extracting archive
27-Feb-2021 15:43:52   - Installing sebastian/code-unit (1.0.8): Extracting archive
27-Feb-2021 15:43:52   - Installing sebastian/cli-parser (1.0.1): Extracting archive
27-Feb-2021 15:43:52   - Installing phpunit/php-timer (5.0.3): Extracting archive
27-Feb-2021 15:43:52   - Installing phpunit/php-text-template (2.0.4): Extracting archive
27-Feb-2021 15:43:52   - Installing phpunit/php-invoker (3.1.1): Extracting archive
27-Feb-2021 15:43:52   - Installing phpunit/php-file-iterator (3.0.5): Extracting archive
27-Feb-2021 15:43:52   - Installing theseer/tokenizer (1.2.0): Extracting archive
27-Feb-2021 15:43:52   - Installing nikic/php-parser (v4.10.4): Extracting archive
27-Feb-2021 15:43:52   - Installing sebastian/lines-of-code (1.0.3): Extracting archive
27-Feb-2021 15:43:52   - Installing sebastian/complexity (2.0.2): Extracting archive
27-Feb-2021 15:43:52   - Installing sebastian/code-unit-reverse-lookup (2.0.3): Extracting archive
27-Feb-2021 15:43:52   - Installing phpunit/php-code-coverage (9.2.5): Extracting archive
27-Feb-2021 15:43:52   - Installing webmozart/assert (1.9.1): Extracting archive
27-Feb-2021 15:43:52   - Installing phpdocumentor/reflection-common (2.2.0): Extracting archive
27-Feb-2021 15:43:52   - Installing phpdocumentor/type-resolver (1.4.0): Extracting archive
27-Feb-2021 15:43:52   - Installing phpdocumentor/reflection-docblock (5.2.2): Extracting archive
27-Feb-2021 15:43:52   - Installing doctrine/instantiator (1.4.0): Extracting archive
27-Feb-2021 15:43:52   - Installing phpspec/prophecy (1.12.2): Extracting archive
27-Feb-2021 15:43:52   - Installing phar-io/version (3.1.0): Extracting archive
27-Feb-2021 15:43:52   - Installing phar-io/manifest (2.0.1): Extracting archive
27-Feb-2021 15:43:52   - Installing myclabs/deep-copy (1.10.2): Extracting archive
27-Feb-2021 15:43:52   - Installing phpunit/phpunit (9.5.2): Extracting archive
27-Feb-2021 15:43:52   - Installing misantron/dbunit (5.1.0): Extracting archive
27-Feb-2021 15:43:52   - Installing patchwork/utf8 (v1.3.3): Extracting archive
27-Feb-2021 15:43:52   - Installing phing/phing (2.16.4): Extracting archive
27-Feb-2021 15:43:52   - Installing s9e/sweetdom (2.0.0): Extracting archive
27-Feb-2021 15:43:52   - Installing s9e/regexp-builder (1.4.4): Extracting archive
27-Feb-2021 15:43:52   - Installing s9e/text-formatter (2.8.3): Extracting archive
27-Feb-2021 15:43:52   - Installing squizlabs/php_codesniffer (3.5.8): Extracting archive
27-Feb-2021 15:43:52   - Installing symfony/config (v5.2.3): Extracting archive
27-Feb-2021 15:43:52   - Installing symfony/debug (v4.4.19): Extracting archive
27-Feb-2021 15:43:52   - Installing psr/event-dispatcher (1.0.0): Extracting archive
27-Feb-2021 15:43:52   - Installing symfony/event-dispatcher-contracts (v2.2.0): Extracting archive
27-Feb-2021 15:43:52   - Installing symfony/http-foundation (v5.2.3): Extracting archive
27-Feb-2021 15:43:52   - Installing symfony/http-client-contracts (v2.3.1): Extracting archive
27-Feb-2021 15:43:52   - Installing symfony/event-dispatcher (v5.2.3): Extracting archive
27-Feb-2021 15:43:52   - Installing symfony/var-dumper (v5.2.3): Extracting archive
27-Feb-2021 15:43:52   - Installing symfony/error-handler (v5.2.3): Extracting archive
27-Feb-2021 15:43:52   - Installing symfony/http-kernel (v5.2.3): Extracting archive
27-Feb-2021 15:43:52   - Installing symfony/mime (v5.2.3): Extracting archive
27-Feb-2021 15:43:52   - Installing symfony/dependency-injection (v5.2.3): Extracting archive
27-Feb-2021 15:43:52   - Installing friendsofphp/proxy-manager-lts (v1.0.3): Extracting archive
27-Feb-2021 15:43:52   - Installing symfony/proxy-manager-bridge (v5.2.3): Extracting archive
27-Feb-2021 15:43:52   - Installing symfony/routing (v5.2.3): Extracting archive
27-Feb-2021 15:43:52   - Installing twig/twig (v2.14.3): Extracting archive
27-Feb-2021 15:43:52   - Installing symfony/translation-contracts (v2.3.0): Extracting archive
27-Feb-2021 15:43:52   - Installing symfony/twig-bridge (v5.2.3): Extracting archive
27-Feb-2021 15:43:53   0/96 [>---------------------------]   0%
27-Feb-2021 15:43:53   9/96 [==>-------------------------]   9%
27-Feb-2021 15:43:53 19/96 [=====>----------------------]  19%
27-Feb-2021 15:43:53 29/96 [========>-------------------]  30%
27-Feb-2021 15:43:53 39/96 [===========>----------------]  40%
27-Feb-2021 15:43:54 49/96 [==============>-------------]  51%
27-Feb-2021 15:43:54 59/96 [=================>----------]  61%
27-Feb-2021 15:43:54 69/96 [====================>-------]  71%
27-Feb-2021 15:43:54 73/96 [=====================>------]  76%
27-Feb-2021 15:43:54 82/96 [=======================>----]  85%
27-Feb-2021 15:43:55 92/96 [==========================>-]  95%
27-Feb-2021 15:43:55 95/96 [===========================>]  98%
27-Feb-2021 15:43:55 96/96 [============================] 100%
27-Feb-2021 15:43:55 Package patchwork/utf8 is abandoned, you should avoid using it. Use symfony/polyfill-mbstring or symfony/string instead.
27-Feb-2021 15:43:55 Generating autoload files
27-Feb-2021 15:43:55 composer/package-versions-deprecated: Generating version class...
27-Feb-2021 15:43:55 composer/package-versions-deprecated: ...done generating version class
27-Feb-2021 15:43:55 76 packages you are using are looking for funding.
27-Feb-2021 15:43:55 Use the `composer fund` command to find out more!
27-Feb-2021 15:43:55
27-Feb-2021 15:43:55 Fatal error: Composer detected issues in your platform: Your Composer dependencies require a PHP version ">= 7.3.0". You are running 7.1.33. in /data/phpBB/vendor/composer/platform_check.php on line 24
27-Feb-2021 15:43:55
27-Feb-2021 15:43:55 Call Stack:
27-Feb-2021 15:43:55     0.0003     351944   1. {main}() /data/phpBB/vendor/phing/phing/bin/phing:0
27-Feb-2021 15:43:55     0.0006     366576   2. require_once('/data/phpBB/vendor/phing/phing/bin/phing.php') /data/phpBB/vendor/phing/phing/bin/phing:14
27-Feb-2021 15:43:55     0.0008     367680   3. require_once('/data/phpBB/vendor/autoload.php') /data/phpBB/vendor/phing/phing/bin/phing.php:14
27-Feb-2021 15:43:55     0.0010     382712   4. ComposerAutoloaderInitb2738f1a01e06f897ee618dfcc462e3e::getLoader() /data/phpBB/vendor/autoload.php:7
27-Feb-2021 15:43:55     0.0011     388176   5. require('/data/phpBB/vendor/composer/platform_check.php') /data/phpBB/vendor/composer/autoload_real.php:25
27-Feb-2021 15:43:55     0.0012     388752   6. trigger_error() /data/phpBB/vendor/composer/platform_check.php:24
27-Feb-2021 15:43:55
27-Feb-2021 15:43:56 Exit code: 255, output: STDOUT:  92/96 [==========================>-]  95%STDOUT:  95/96 [===========================>]  98%STDOUT:  96/96 [============================] 100%STDOUT:  Package patchwork/utf8 is abandoned, you should avoid using it. Use symfony/polyfill-mbstring or symfony/string instead.STDOUT:  Generating autoload filesSTDOUT:  composer/package-versions-deprecated: Generating version class...STDOUT:  composer/package-versions-deprecated: ...done generating version classSTDOUT:  76 packages you are using are looking for funding.STDOUT:  Use the `composer fund` command to find out more!STDOUT:  STDOUT:  Fatal error: Composer detected issues in your platform: Your Composer dependencies require a PHP version ">= 7.3.0". You are running 7.1.33. in /data/phpBB/vendor/composer/platform_check.php on line 24STDOUT:  STDOUT:  Call Stack:STDOUT:      0.0003     351944   1. {main}() /data/phpBB/vendor/phing/phing/bin/phing:0STDOUT:      0.0006     366576   2. require_once('/data/phpBB/vendor/phing/phing/bin/phing.php') /data/phpBB/vendor/phing/phing/bin/phing:14STDOUT:      0.0008     367680   3. require_once('/data/phpBB/vendor/autoload.php') /data/phpBB/vendor/phing/phing/bin/phing.php:14STDOUT:      0.0010     382712   4. ComposerAutoloaderInitb2738f1a01e06f897ee618dfcc462e3e::getLoader() /data/phpBB/vendor/autoload.php:7STDOUT:      0.0011     388176   5. require('/data/phpBB/vendor/composer/platform_check.php') /data/phpBB/vendor/composer/autoload_real.php:25STDOUT:      0.0012     388752   6. trigger_error() /data/phpBB/vendor/composer/platform_check.php:24STDOUT: 
27-Feb-2021 15:43:56 Error occurred while running Task 'Run tests(2)' of type com.atlassian.bamboo.plugins.bamboo-docker-plugin:task.docker.cli.
27-Feb-2021 15:43:56 com.atlassian.bamboo.task.TaskException: Failed to execute task
27-Feb-2021 15:43:56         at com.atlassian.bamboo.plugins.docker.service.RunService.execute(RunService.java:75)
27-Feb-2021 15:43:56         at com.atlassian.bamboo.plugins.docker.tasks.cli.DockerCliTask.execute(DockerCliTask.java:70)
27-Feb-2021 15:43:56         at com.atlassian.bamboo.task.TaskExecutorImpl.lambda$executeTasks$3(TaskExecutorImpl.java:323)
27-Feb-2021 15:43:56         at com.atlassian.bamboo.task.TaskExecutorImpl.executeTaskWithPrePostActions(TaskExecutorImpl.java:256)
27-Feb-2021 15:43:56         at com.atlassian.bamboo.task.TaskExecutorImpl.executeTasks(TaskExecutorImpl.java:323)
27-Feb-2021 15:43:56         at com.atlassian.bamboo.task.TaskExecutorImpl.execute(TaskExecutorImpl.java:116)
27-Feb-2021 15:43:56         at com.atlassian.bamboo.build.pipeline.tasks.ExecuteBuildTask.call(ExecuteBuildTask.java:73)
27-Feb-2021 15:43:56         at com.atlassian.bamboo.v2.build.agent.DefaultBuildAgent.executeBuildPhase(DefaultBuildAgent.java:184)
27-Feb-2021 15:43:56         at com.atlassian.bamboo.v2.build.agent.DefaultBuildAgent.build(DefaultBuildAgent.java:156)
27-Feb-2021 15:43:56         at com.atlassian.bamboo.v2.build.agent.BuildAgentControllerImpl.lambda$waitAndPerformBuild$0(BuildAgentControllerImpl.java:130)
27-Feb-2021 15:43:56         at com.atlassian.bamboo.variable.CustomVariableContextImpl.withVariableSubstitutor(CustomVariableContextImpl.java:118)
27-Feb-2021 15:43:56         at com.atlassian.bamboo.v2.build.agent.BuildAgentControllerImpl.waitAndPerformBuild(BuildAgentControllerImpl.java:124)
27-Feb-2021 15:43:56         at com.atlassian.bamboo.v2.build.agent.DefaultBuildAgent.lambda$start$0(DefaultBuildAgent.java:108)
27-Feb-2021 15:43:56         at com.atlassian.bamboo.utils.BambooRunnables$1.run(BambooRunnables.java:48)
27-Feb-2021 15:43:56         at com.atlassian.bamboo.security.ImpersonationHelper.runWith(ImpersonationHelper.java:26)
27-Feb-2021 15:43:56         at com.atlassian.bamboo.security.ImpersonationHelper.runWithSystemAuthority(ImpersonationHelper.java:17)
27-Feb-2021 15:43:56         at com.atlassian.bamboo.security.ImpersonationHelper$1.run(ImpersonationHelper.java:41)
27-Feb-2021 15:43:56         at java.lang.Thread.run(Thread.java:748)
27-Feb-2021 15:43:56 Caused by: com.atlassian.bamboo.docker.DockerException: Error running Docker run command
27-Feb-2021 15:43:56         at com.atlassian.bamboo.docker.DockerContainerServiceImpl.run(DockerContainerServiceImpl.java:130)
27-Feb-2021 15:43:56         at sun.reflect.GeneratedMethodAccessor3133.invoke(Unknown Source)
27-Feb-2021 15:43:56         at sun.reflect.DelegatingMethodAccessorImpl.invoke(DelegatingMethodAccessorImpl.java:43)
27-Feb-2021 15:43:56         at java.lang.reflect.Method.invoke(Method.java:498)
27-Feb-2021 15:43:56         at com.atlassian.plugin.util.ContextClassLoaderSettingInvocationHandler.invoke(ContextClassLoaderSettingInvocationHandler.java:26)
27-Feb-2021 15:43:56         at com.sun.proxy.$Proxy446.run(Unknown Source)
27-Feb-2021 15:43:56         at sun.reflect.GeneratedMethodAccessor3133.invoke(Unknown Source)
27-Feb-2021 15:43:56         at sun.reflect.DelegatingMethodAccessorImpl.invoke(DelegatingMethodAccessorImpl.java:43)
27-Feb-2021 15:43:56         at java.lang.reflect.Method.invoke(Method.java:498)
27-Feb-2021 15:43:56         at org.springframework.aop.support.AopUtils.invokeJoinpointUsingReflection(AopUtils.java:343)
27-Feb-2021 15:43:56         at org.eclipse.gemini.blueprint.service.importer.support.internal.aop.ServiceInvoker.doInvoke(ServiceInvoker.java:56)
27-Feb-2021 15:43:56         at org.eclipse.gemini.blueprint.service.importer.support.internal.aop.ServiceInvoker.invoke(ServiceInvoker.java:60)
27-Feb-2021 15:43:56         at org.springframework.aop.framework.ReflectiveMethodInvocation.proceed(ReflectiveMethodInvocation.java:186)
27-Feb-2021 15:43:56         at org.springframework.aop.support.DelegatingIntroductionInterceptor.doProceed(DelegatingIntroductionInterceptor.java:136)
27-Feb-2021 15:43:56         at org.springframework.aop.support.DelegatingIntroductionInterceptor.invoke(DelegatingIntroductionInterceptor.java:124)
27-Feb-2021 15:43:56         at org.springframework.aop.framework.ReflectiveMethodInvocation.proceed(ReflectiveMethodInvocation.java:186)
27-Feb-2021 15:43:56         at org.eclipse.gemini.blueprint.service.util.internal.aop.ServiceTCCLInterceptor.invokeUnprivileged(ServiceTCCLInterceptor.java:70)
27-Feb-2021 15:43:56         at org.eclipse.gemini.blueprint.service.util.internal.aop.ServiceTCCLInterceptor.invoke(ServiceTCCLInterceptor.java:53)
27-Feb-2021 15:43:56         at org.springframework.aop.framework.ReflectiveMethodInvocation.proceed(ReflectiveMethodInvocation.java:186)
27-Feb-2021 15:43:56         at org.eclipse.gemini.blueprint.service.importer.support.LocalBundleContextAdvice.invoke(LocalBundleContextAdvice.java:57)
27-Feb-2021 15:43:56         at org.springframework.aop.framework.ReflectiveMethodInvocation.proceed(ReflectiveMethodInvocation.java:186)
27-Feb-2021 15:43:56         at org.springframework.aop.support.DelegatingIntroductionInterceptor.doProceed(DelegatingIntroductionInterceptor.java:136)
27-Feb-2021 15:43:56         at org.springframework.aop.support.DelegatingIntroductionInterceptor.invoke(DelegatingIntroductionInterceptor.java:124)
27-Feb-2021 15:43:56         at org.springframework.aop.framework.ReflectiveMethodInvocation.proceed(ReflectiveMethodInvocation.java:186)
27-Feb-2021 15:43:56         at org.springframework.aop.framework.JdkDynamicAopProxy.invoke(JdkDynamicAopProxy.java:212)
27-Feb-2021 15:43:56         at com.sun.proxy.$Proxy889.run(Unknown Source)
27-Feb-2021 15:43:56         at com.atlassian.bamboo.plugins.docker.client.DockerCmd.run(DockerCmd.java:47)
27-Feb-2021 15:43:56         at com.atlassian.bamboo.plugins.docker.service.RunService.execute(RunService.java:64)
27-Feb-2021 15:43:56         ... 17 more
27-Feb-2021 15:43:56 Caused by: com.atlassian.utils.process.ProcessException: Error executing /usr/bin/docker run --volume /home/bamboo/xml-data/build-dir/PHPBB3-DDM-JOB1:/data --workdir /data/phpBB --rm -u=991 -t phpbb:php-7.1 /bin/bash -c "php ../composer.phar install --dev; cd ../build; ../phpBB/vendor/bin/phing build"
27-Feb-2021 15:43:56         at com.atlassian.bamboo.docker.DockerContainerServiceImpl.execute(DockerContainerServiceImpl.java:302)
27-Feb-2021 15:43:56         at com.atlassian.bamboo.docker.DockerContainerServiceImpl.execute(DockerContainerServiceImpl.java:273)
27-Feb-2021 15:43:56         at com.atlassian.bamboo.docker.DockerContainerServiceImpl.run(DockerContainerServiceImpl.java:107)
27-Feb-2021 15:43:56         ... 44 more
27-Feb-2021 15:43:56 Starting task 'Parsing test results' of type 'com.atlassian.bamboo.plugins.testresultparser:task.testresultparser.junit'
27-Feb-2021 15:43:56 Parsing test results under /home/bamboo/xml-data/build-dir/PHPBB3-DDM-JOB1...
27-Feb-2021 15:43:56 Failing task since test cases were expected but none were found.
27-Feb-2021 15:43:56 Finished task 'Parsing test results' with result: Failed
27-Feb-2021 15:43:56 Running post build plugin 'NCover Results Collector'
27-Feb-2021 15:43:56 Running post build plugin 'Artifact Copier'
27-Feb-2021 15:43:56 Publishing an artifact: Coverage HTML Report
27-Feb-2021 15:43:56 Unable to publish artifact [Coverage HTML Report]: the source directory /home/bamboo/xml-data/build-dir/PHPBB3-DDM-JOB1/build/coverage does not exist.
27-Feb-2021 15:43:56 The artifact hasn't been successfully published after 432.9 μs
27-Feb-2021 15:43:56 Running post build plugin 'npm Cache Cleanup'
27-Feb-2021 15:43:56 Running post build plugin 'Clover Results Collector'
27-Feb-2021 15:43:56 Running post build plugin 'Docker Container Cleanup'
27-Feb-2021 15:43:57 Successfully removed working directory at '/home/bamboo/xml-data/build-dir/PHPBB3-DDM-JOB1'
27-Feb-2021 15:43:57 Finalising the build...
27-Feb-2021 15:43:57 Stopping timer.
27-Feb-2021 15:43:57 Build PHPBB3-DDM-JOB1-891 completed.
27-Feb-2021 15:43:57 Running on server: post build plugin 'NCover Results Collector'
27-Feb-2021 15:43:57 Running on server: post build plugin 'Build Hanging Detection Configuration'
27-Feb-2021 15:43:57 Running on server: post build plugin 'Clover Delta Calculator'
27-Feb-2021 15:43:57 Running on server: post build plugin 'Maven Dependencies Postprocessor'
27-Feb-2021 15:43:57 All post build plugins have finished
27-Feb-2021 15:43:57 Generating build results summary...
27-Feb-2021 15:43:57 Saving build results to disk...
27-Feb-2021 15:43:57 Store variable context...
27-Feb-2021 15:43:57 Indexing build results...
27-Feb-2021 15:43:57 Finished building PHPBB3-DDM-JOB1-891.