Build: #892 failed

Job: PHP 7.3 - SQLite failed

Stages & jobs

  1. Default Stage

Build log

The build generated 472 lines of output. Download or view full build log

27-Feb-2021 15:47:52 Build phpBB3 - Development Docker Master - PHP 7.1 - SQLite #892 (PHPBB3-DDM-JOB1-892) started building on agent Docker
27-Feb-2021 15:47:52
27-Feb-2021 15:47:52 Build working directory is /home/bamboo/xml-data/build-dir/PHPBB3-DDM-JOB1
27-Feb-2021 15:47:52 Executing build phpBB3 - Development Docker Master - PHP 7.1 - SQLite #892 (PHPBB3-DDM-JOB1-892)
27-Feb-2021 15:47:52 Starting task 'Checkout Default Repository' of type 'com.atlassian.bamboo.plugins.vcs:task.vcs.checkout'
27-Feb-2021 15:47:52 Checking out into /home/bamboo/xml-data/build-dir/PHPBB3-DDM-JOB1
27-Feb-2021 15:47:52 Updating source code to revision: febe2c6d2da58b14aff8d15ba57a5cf5f67290cf
27-Feb-2021 15:47:57 Fetching 'refs/heads/master' from 'https://github.com/phpbb/phpbb.git'.
27-Feb-2021 15:47:58 Checking out revision febe2c6d2da58b14aff8d15ba57a5cf5f67290cf.
27-Feb-2021 15:47:58 Creating local git repository in '/home/bamboo/xml-data/build-dir/PHPBB3-DDM-JOB1/.git'.
27-Feb-2021 15:47:58 Cloning into '/home/bamboo/xml-data/build-dir/PHPBB3-DDM-JOB1'...
27-Feb-2021 15:47:58 done.
27-Feb-2021 15:48:02 Already on 'master'
27-Feb-2021 15:48:02 Updated source code to revision: febe2c6d2da58b14aff8d15ba57a5cf5f67290cf
27-Feb-2021 15:48:02 Finished task 'Checkout Default Repository' with result: Success
27-Feb-2021 15:48:02 Running pre-build action: VCS Version Collector
27-Feb-2021 15:48:02
Substituting variable: ${bamboo.working.directory} with /home/bamboo/xml-data/build-dir/PHPBB3-DDM-JOB1
27-Feb-2021 15:48:02 Starting task 'Build image' of type 'com.atlassian.bamboo.plugins.bamboo-docker-plugin:task.docker.cli'
27-Feb-2021 15:48:02
Beginning to execute external process for build 'phpBB3 - Development Docker Master - PHP 7.1 - SQLite #892 (PHPBB3-DDM-JOB1-892)'
... running command line:
/usr/bin/docker build --force-rm=true --tag=phpbb:php-7.1 /home/bamboo/xml-data/build-dir/PHPBB3-DDM-JOB1
... in: /home/bamboo/xml-data/build-dir/PHPBB3-DDM-JOB1
... using extra environment variables:
bamboo_planRepository_1_branch=master
bamboo_repository_75956230_previous_revision_number=389641fa4e7c2fe7623ef4b1ccfbc40f43a9dc77
bamboo_planRepository_1_branchDisplayName=master
bamboo_repository_revision_number=febe2c6d2da58b14aff8d15ba57a5cf5f67290cf
bamboo_resultsUrl=https://bamboo.phpbb.com/browse/PHPBB3-DDM-JOB1-892
bamboo_capability_system_builder_command_Git=/usr/bin/git
bamboo_build_working_directory=/home/bamboo/xml-data/build-dir/PHPBB3-DDM-JOB1
bamboo_planRepository_1_name=phpBB Master
bamboo_buildKey=PHPBB3-DDM-JOB1
bamboo_shortPlanName=Development Docker Master
bamboo_planRepository_name=phpBB Master
bamboo_repository_75956230_git_branch=master
bamboo_buildNumber=892
bamboo_capability_system_builder_phpunit_PHPUnit=/usr/bin/phpunit
bamboo_repository_75956230_name=phpBB Master
bamboo_shortJobName=PHP 7.1 - SQLite
bamboo_buildResultsUrl=https://bamboo.phpbb.com/browse/PHPBB3-DDM-JOB1-892
bamboo_planRepository_repositoryUrl=https://github.com/phpbb/phpbb.git
bamboo_repository_75956230_git_repositoryUrl=https://github.com/phpbb/phpbb.git
bamboo_agentId=65929217
bamboo_planName=phpBB3 - Development Docker Master
bamboo_shortPlanKey=DDM
bamboo_shortJobKey=JOB1
bamboo_capability_system_jdk_JDK_1_7_0_65=/usr/lib/jvm/java-7-openjdk-amd64
bamboo_planRepository_revision=febe2c6d2da58b14aff8d15ba57a5cf5f67290cf
bamboo_buildTimeStamp=2021-02-27T15:47:52.243Z
bamboo_repository_previous_revision_number=389641fa4e7c2fe7623ef4b1ccfbc40f43a9dc77
bamboo_capability_system_jdk_JDK_1_6_0_16=/usr/lib/jvm/java-6-sun-1.6.0.16
bamboo_capability_system_builder_mvn2_Maven_2=/usr/share/maven2
bamboo_planRepository_previousRevision=389641fa4e7c2fe7623ef4b1ccfbc40f43a9dc77
bamboo_repository_git_branch=master
bamboo_buildResultKey=PHPBB3-DDM-JOB1-892
bamboo_repository_branch_name=master
bamboo_buildPlanName=phpBB3 - Development Docker Master - PHP 7.1 - SQLite
bamboo_planRepository_1_revision=febe2c6d2da58b14aff8d15ba57a5cf5f67290cf
bamboo_repository_name=phpBB Master
bamboo_buildFailed=false
bamboo_capability_system_docker_executable=/usr/bin/docker
bamboo_repository_75956230_git_username=
bamboo_planRepository_branch=master
bamboo_agentWorkingDirectory=/home/bamboo/xml-data/build-dir
bamboo_capability_system_git_executable=/usr/bin/git
bamboo_capability_system_builder_phpunit_PHPUnit_3_4=/usr/bin/phpunit
bamboo_repository_git_username=
bamboo_planRepository_1_previousRevision=389641fa4e7c2fe7623ef4b1ccfbc40f43a9dc77
bamboo_repository_75956230_branch_name=master
bamboo_planRepository_branchDisplayName=master
bamboo_planRepository_1_type=gitv2
bamboo_planRepository_branchName=master
bamboo_capability_system_jdk_JDK=/usr/lib/jvm/java-6-sun
bamboo_plan_storageTag=PHPBB3-DDM
bamboo_hg_cache_directory=/home/bamboo/xml-data/build-dir/_hg-repositories-cache
bamboo_planRepository_1_username=
bamboo_planRepository_type=gitv2
bamboo_git_cache_directory=/home/bamboo/xml-data/build-dir/_git-repositories-cache
bamboo_repository_git_repositoryUrl=https://github.com/phpbb/phpbb.git
bamboo_capability_system_builder_ant_Ant=/usr/share/ant
bamboo_repository_75956230_revision_number=febe2c6d2da58b14aff8d15ba57a5cf5f67290cf
bamboo_tmp_directory=/home/bamboo/temp
bamboo_working_directory=/home/bamboo/xml-data/build-dir/PHPBB3-DDM-JOB1
bamboo_planKey=PHPBB3-DDM
bamboo_capability_local=true
bamboo_planRepository_1_repositoryUrl=https://github.com/phpbb/phpbb.git
bamboo_planRepository_username=
bamboo_capability_system_jdk_JDK_1_6=/usr/lib/jvm/java-6-sun
bamboo_capability_system_jdk_JDK_1_7=/usr/lib/jvm/java-7-openjdk-amd64
bamboo_planRepository_1_branchName=master
27-Feb-2021 15:48:03 Sending build context to Docker daemon  25.18MB
27-Feb-2021 15:48:03
27-Feb-2021 15:48:03 Step 1/5 : FROM php:7.1
27-Feb-2021 15:48:03 ---> 060b5298208c
27-Feb-2021 15:48:03 Step 2/5 : RUN apt-get update && apt-get install -y         git         zlib1g-dev         bzip2         zip         && docker-php-ext-install -j$(nproc) zip
27-Feb-2021 15:48:03 ---> Using cache
27-Feb-2021 15:48:03 ---> 91867ed570d0
27-Feb-2021 15:48:03 Step 3/5 : RUN pecl install xdebug-2.6.1
27-Feb-2021 15:48:03 ---> Using cache
27-Feb-2021 15:48:03 ---> 275e56c14141
27-Feb-2021 15:48:03 Step 4/5 : RUN docker-php-ext-enable xdebug
27-Feb-2021 15:48:03 ---> Using cache
27-Feb-2021 15:48:03 ---> 61358c4289e7
27-Feb-2021 15:48:03 Step 5/5 : RUN echo "memory_limit = 1536M" >> /usr/local/etc/php/conf.d/memory.ini
27-Feb-2021 15:48:03 ---> Using cache
27-Feb-2021 15:48:03 ---> 7a771944570e
27-Feb-2021 15:48:03 Successfully built 7a771944570e
27-Feb-2021 15:48:03 Successfully tagged phpbb:php-7.1
27-Feb-2021 15:48:03 Built Docker image 'phpbb:php-7.1'
27-Feb-2021 15:48:03 Finished task 'Build image' with result: Success
27-Feb-2021 15:48:03
Substituting variable: ${bamboo.working.directory} with /home/bamboo/xml-data/build-dir/PHPBB3-DDM-JOB1
27-Feb-2021 15:48:03 Starting task 'Run tests' of type 'com.atlassian.bamboo.plugins.bamboo-docker-plugin:task.docker.cli'
27-Feb-2021 15:48:03 Running image name (phpbb:php-7.1)
27-Feb-2021 15:48:03
Beginning to execute external process for build 'phpBB3 - Development Docker Master - PHP 7.1 - SQLite #892 (PHPBB3-DDM-JOB1-892)'
... running command line:
/usr/bin/docker run --volume /home/bamboo/xml-data/build-dir/PHPBB3-DDM-JOB1:/data --workdir /data/phpBB --rm -u=991 -t phpbb:php-7.1 /bin/bash -c php ../composer.phar install --dev; cd ../build; ../phpBB/vendor/bin/phing build
... in: /home/bamboo/xml-data/build-dir/PHPBB3-DDM-JOB1
... using extra environment variables:
bamboo_planRepository_1_branch=master
bamboo_repository_75956230_previous_revision_number=389641fa4e7c2fe7623ef4b1ccfbc40f43a9dc77
bamboo_planRepository_1_branchDisplayName=master
bamboo_repository_revision_number=febe2c6d2da58b14aff8d15ba57a5cf5f67290cf
bamboo_resultsUrl=https://bamboo.phpbb.com/browse/PHPBB3-DDM-JOB1-892
bamboo_capability_system_builder_command_Git=/usr/bin/git
bamboo_build_working_directory=/home/bamboo/xml-data/build-dir/PHPBB3-DDM-JOB1
bamboo_planRepository_1_name=phpBB Master
bamboo_buildKey=PHPBB3-DDM-JOB1
bamboo_shortPlanName=Development Docker Master
bamboo_planRepository_name=phpBB Master
bamboo_repository_75956230_git_branch=master
bamboo_buildNumber=892
bamboo_capability_system_builder_phpunit_PHPUnit=/usr/bin/phpunit
bamboo_repository_75956230_name=phpBB Master
bamboo_shortJobName=PHP 7.1 - SQLite
bamboo_buildResultsUrl=https://bamboo.phpbb.com/browse/PHPBB3-DDM-JOB1-892
bamboo_planRepository_repositoryUrl=https://github.com/phpbb/phpbb.git
bamboo_repository_75956230_git_repositoryUrl=https://github.com/phpbb/phpbb.git
bamboo_agentId=65929217
bamboo_planName=phpBB3 - Development Docker Master
bamboo_shortPlanKey=DDM
bamboo_shortJobKey=JOB1
bamboo_capability_system_jdk_JDK_1_7_0_65=/usr/lib/jvm/java-7-openjdk-amd64
bamboo_planRepository_revision=febe2c6d2da58b14aff8d15ba57a5cf5f67290cf
bamboo_buildTimeStamp=2021-02-27T15:47:52.243Z
bamboo_repository_previous_revision_number=389641fa4e7c2fe7623ef4b1ccfbc40f43a9dc77
bamboo_capability_system_jdk_JDK_1_6_0_16=/usr/lib/jvm/java-6-sun-1.6.0.16
bamboo_capability_system_builder_mvn2_Maven_2=/usr/share/maven2
bamboo_planRepository_previousRevision=389641fa4e7c2fe7623ef4b1ccfbc40f43a9dc77
bamboo_repository_git_branch=master
bamboo_buildResultKey=PHPBB3-DDM-JOB1-892
bamboo_repository_branch_name=master
bamboo_buildPlanName=phpBB3 - Development Docker Master - PHP 7.1 - SQLite
bamboo_planRepository_1_revision=febe2c6d2da58b14aff8d15ba57a5cf5f67290cf
bamboo_build_commandline_com_atlassian_bamboo_plugins_bamboo_docker_plugin_task_docker_cli_3=/usr/bin/docker build --force-rm=true --tag=phpbb:php-7.1 /home/bamboo/xml-data/build-dir/PHPBB3-DDM-JOB1
bamboo_repository_name=phpBB Master
bamboo_buildFailed=false
bamboo_capability_system_docker_executable=/usr/bin/docker
bamboo_repository_75956230_git_username=
bamboo_planRepository_branch=master
bamboo_agentWorkingDirectory=/home/bamboo/xml-data/build-dir
bamboo_capability_system_git_executable=/usr/bin/git
bamboo_capability_system_builder_phpunit_PHPUnit_3_4=/usr/bin/phpunit
bamboo_repository_git_username=
bamboo_planRepository_1_previousRevision=389641fa4e7c2fe7623ef4b1ccfbc40f43a9dc77
bamboo_repository_75956230_branch_name=master
bamboo_planRepository_branchDisplayName=master
bamboo_planRepository_1_type=gitv2
bamboo_planRepository_branchName=master
bamboo_capability_system_jdk_JDK=/usr/lib/jvm/java-6-sun
bamboo_plan_storageTag=PHPBB3-DDM
bamboo_hg_cache_directory=/home/bamboo/xml-data/build-dir/_hg-repositories-cache
bamboo_planRepository_1_username=
bamboo_planRepository_type=gitv2
bamboo_git_cache_directory=/home/bamboo/xml-data/build-dir/_git-repositories-cache
bamboo_repository_git_repositoryUrl=https://github.com/phpbb/phpbb.git
bamboo_capability_system_builder_ant_Ant=/usr/share/ant
bamboo_repository_75956230_revision_number=febe2c6d2da58b14aff8d15ba57a5cf5f67290cf
bamboo_tmp_directory=/home/bamboo/temp
bamboo_working_directory=/home/bamboo/xml-data/build-dir/PHPBB3-DDM-JOB1
bamboo_planKey=PHPBB3-DDM
bamboo_capability_local=true
bamboo_planRepository_1_repositoryUrl=https://github.com/phpbb/phpbb.git
bamboo_planRepository_username=
bamboo_capability_system_jdk_JDK_1_6=/usr/lib/jvm/java-6-sun
bamboo_capability_system_jdk_JDK_1_7=/usr/lib/jvm/java-7-openjdk-amd64
bamboo_planRepository_1_branchName=master
27-Feb-2021 15:48:04 Cannot create cache directory /.composer/cache/repo/https---repo.packagist.org/, or directory is not writable. Proceeding without cache
27-Feb-2021 15:48:04 Cannot create cache directory /.composer/cache/files/, or directory is not writable. Proceeding without cache
27-Feb-2021 15:48:04 You are using the deprecated option "--dev". It has no effect and will break in Composer 3.
27-Feb-2021 15:48:04 Installing dependencies from lock file (including require-dev)
27-Feb-2021 15:48:04 Verifying lock file contents can be installed on current platform.
27-Feb-2021 15:48:04 Package operations: 108 installs, 0 updates, 0 removals
27-Feb-2021 15:48:04   - Downloading composer/installers (v1.10.0)
27-Feb-2021 15:48:04   - Downloading composer/package-versions-deprecated (1.11.99.1)
27-Feb-2021 15:48:04   - Downloading bantu/ini-get-wrapper (v1.0.1)
27-Feb-2021 15:48:04   - Downloading chita/topological_sort (v3.0.1)
27-Feb-2021 15:48:04   - Downloading symfony/polyfill-php80 (v1.22.1)
27-Feb-2021 15:48:04   - Downloading symfony/process (v5.2.3)
27-Feb-2021 15:48:04   - Downloading symfony/finder (v5.2.3)
27-Feb-2021 15:48:04   - Downloading symfony/polyfill-ctype (v1.22.1)
27-Feb-2021 15:48:04   - Downloading symfony/filesystem (v5.2.3)
27-Feb-2021 15:48:04   - Downloading symfony/polyfill-mbstring (v1.22.1)
27-Feb-2021 15:48:04   - Downloading symfony/polyfill-intl-normalizer (v1.22.1)
27-Feb-2021 15:48:04   - Downloading symfony/polyfill-intl-grapheme (v1.22.1)
27-Feb-2021 15:48:04   - Downloading symfony/string (v5.2.3)
27-Feb-2021 15:48:04   - Downloading psr/container (1.0.0)
27-Feb-2021 15:48:04   - Downloading symfony/service-contracts (v2.2.0)
27-Feb-2021 15:48:04   - Downloading symfony/polyfill-php73 (v1.22.1)
27-Feb-2021 15:48:04   - Downloading symfony/console (v5.2.3)
27-Feb-2021 15:48:04   - Downloading seld/phar-utils (1.1.1)
27-Feb-2021 15:48:04   - Downloading seld/jsonlint (1.8.3)
27-Feb-2021 15:48:04   - Downloading react/promise (v2.8.0)
27-Feb-2021 15:48:04   - Downloading psr/log (1.1.3)
27-Feb-2021 15:48:04   - Downloading justinrainbow/json-schema (5.2.10)
27-Feb-2021 15:48:04   - Downloading composer/xdebug-handler (1.4.5)
27-Feb-2021 15:48:04   - Downloading composer/spdx-licenses (1.5.5)
27-Feb-2021 15:48:04   - Downloading composer/semver (3.2.4)
27-Feb-2021 15:48:04   - Downloading composer/ca-bundle (1.2.9)
27-Feb-2021 15:48:04   - Downloading composer/composer (2.0.11)
27-Feb-2021 15:48:04   - Downloading doctrine/event-manager (1.1.1)
27-Feb-2021 15:48:04   - Downloading doctrine/cache (1.10.2)
27-Feb-2021 15:48:04   - Downloading doctrine/dbal (3.0.0)
27-Feb-2021 15:48:04   - Downloading symfony/dom-crawler (v5.2.3)
27-Feb-2021 15:48:04   - Downloading symfony/css-selector (v5.2.3)
27-Feb-2021 15:48:04   - Downloading symfony/browser-kit (v5.2.3)
27-Feb-2021 15:48:04   - Downloading symfony/polyfill-php72 (v1.22.1)
27-Feb-2021 15:48:04   - Downloading symfony/polyfill-intl-idn (v1.22.1)
27-Feb-2021 15:48:04   - Downloading ralouphie/getallheaders (3.0.3)
27-Feb-2021 15:48:04   - Downloading psr/http-message (1.0.1)
27-Feb-2021 15:48:04   - Downloading guzzlehttp/psr7 (1.7.0)
27-Feb-2021 15:48:04   - Downloading guzzlehttp/promises (1.4.0)
27-Feb-2021 15:48:04   - Downloading guzzlehttp/guzzle (6.5.5)
27-Feb-2021 15:48:04   - Downloading fabpot/goutte (v3.3.1)
27-Feb-2021 15:48:04   - Downloading google/recaptcha (1.2.4)
27-Feb-2021 15:48:04   - Downloading laminas/laminas-zendframework-bridge (1.1.1)
27-Feb-2021 15:48:04   - Downloading laminas/laminas-eventmanager (3.3.0)
27-Feb-2021 15:48:04   - Downloading laminas/laminas-code (3.4.1)
27-Feb-2021 15:48:04   - Downloading symfony/deprecation-contracts (v2.2.0)
27-Feb-2021 15:48:04   - Downloading symfony/yaml (v5.2.3)
27-Feb-2021 15:48:04   - Downloading laravel/homestead (v10.17.0)
27-Feb-2021 15:48:04   - Downloading lusitanian/oauth (v0.8.11)
27-Feb-2021 15:48:04   - Downloading marc1706/fast-image-size (v1.1.6)
27-Feb-2021 15:48:04   - Downloading sebastian/version (3.0.2)
27-Feb-2021 15:48:04   - Downloading sebastian/type (2.3.1)
27-Feb-2021 15:48:04   - Downloading sebastian/resource-operations (3.0.3)
27-Feb-2021 15:48:04   - Downloading sebastian/recursion-context (4.0.4)
27-Feb-2021 15:48:04   - Downloading sebastian/object-reflector (2.0.4)
27-Feb-2021 15:48:04   - Downloading sebastian/object-enumerator (4.0.4)
27-Feb-2021 15:48:04   - Downloading sebastian/global-state (5.0.2)
27-Feb-2021 15:48:04   - Downloading sebastian/exporter (4.0.3)
27-Feb-2021 15:48:04   - Downloading sebastian/environment (5.1.3)
27-Feb-2021 15:48:04   - Downloading sebastian/diff (4.0.4)
27-Feb-2021 15:48:04   - Downloading sebastian/comparator (4.0.6)
27-Feb-2021 15:48:04   - Downloading sebastian/code-unit (1.0.8)
27-Feb-2021 15:48:04   - Downloading sebastian/cli-parser (1.0.1)
27-Feb-2021 15:48:04   - Downloading phpunit/php-timer (5.0.3)
27-Feb-2021 15:48:04   - Downloading phpunit/php-text-template (2.0.4)
27-Feb-2021 15:48:04   - Downloading phpunit/php-invoker (3.1.1)
27-Feb-2021 15:48:04   - Downloading phpunit/php-file-iterator (3.0.5)
27-Feb-2021 15:48:04   - Downloading theseer/tokenizer (1.2.0)
27-Feb-2021 15:48:04   - Downloading nikic/php-parser (v4.10.4)
27-Feb-2021 15:48:04   - Downloading sebastian/lines-of-code (1.0.3)
27-Feb-2021 15:48:04   - Downloading sebastian/complexity (2.0.2)
27-Feb-2021 15:48:04   - Downloading sebastian/code-unit-reverse-lookup (2.0.3)
27-Feb-2021 15:48:04   - Downloading phpunit/php-code-coverage (9.2.5)
27-Feb-2021 15:48:04   - Downloading webmozart/assert (1.9.1)
27-Feb-2021 15:48:04   - Downloading phpdocumentor/reflection-common (2.2.0)
27-Feb-2021 15:48:04   - Downloading phpdocumentor/type-resolver (1.4.0)
27-Feb-2021 15:48:04   - Downloading phpdocumentor/reflection-docblock (5.2.2)
27-Feb-2021 15:48:04   - Downloading doctrine/instantiator (1.4.0)
27-Feb-2021 15:48:04   - Downloading phpspec/prophecy (1.12.2)
27-Feb-2021 15:48:04   - Downloading phar-io/version (3.1.0)
27-Feb-2021 15:48:04   - Downloading phar-io/manifest (2.0.1)
27-Feb-2021 15:48:04   - Downloading myclabs/deep-copy (1.10.2)
27-Feb-2021 15:48:04   - Downloading phpunit/phpunit (9.5.2)
27-Feb-2021 15:48:04   - Downloading misantron/dbunit (5.1.0)
27-Feb-2021 15:48:04   - Downloading patchwork/utf8 (v1.3.3)
27-Feb-2021 15:48:04   - Downloading phing/phing (2.16.4)
27-Feb-2021 15:48:04   - Downloading s9e/sweetdom (2.0.0)
27-Feb-2021 15:48:04   - Downloading s9e/regexp-builder (1.4.4)
27-Feb-2021 15:48:04   - Downloading s9e/text-formatter (2.8.3)
27-Feb-2021 15:48:04   - Downloading squizlabs/php_codesniffer (3.5.8)
27-Feb-2021 15:48:04   - Downloading symfony/config (v5.2.3)
27-Feb-2021 15:48:04   - Downloading symfony/debug (v4.4.19)
27-Feb-2021 15:48:04   - Downloading psr/event-dispatcher (1.0.0)
27-Feb-2021 15:48:04   - Downloading symfony/event-dispatcher-contracts (v2.2.0)
27-Feb-2021 15:48:04   - Downloading symfony/http-foundation (v5.2.3)
27-Feb-2021 15:48:04   - Downloading symfony/http-client-contracts (v2.3.1)
27-Feb-2021 15:48:04   - Downloading symfony/event-dispatcher (v5.2.3)
27-Feb-2021 15:48:04   - Downloading symfony/var-dumper (v5.2.3)
27-Feb-2021 15:48:04   - Downloading symfony/error-handler (v5.2.3)
27-Feb-2021 15:48:04   - Downloading symfony/http-kernel (v5.2.3)
27-Feb-2021 15:48:04   - Downloading symfony/mime (v5.2.3)
27-Feb-2021 15:48:04   - Downloading symfony/dependency-injection (v5.2.3)
27-Feb-2021 15:48:04   - Downloading friendsofphp/proxy-manager-lts (v1.0.3)
27-Feb-2021 15:48:04   - Downloading symfony/proxy-manager-bridge (v5.2.3)
27-Feb-2021 15:48:04   - Downloading symfony/routing (v5.2.3)
27-Feb-2021 15:48:04   - Downloading twig/twig (v2.14.3)
27-Feb-2021 15:48:04   - Downloading symfony/translation-contracts (v2.3.0)
27-Feb-2021 15:48:04   - Downloading symfony/twig-bridge (v5.2.3)
27-Feb-2021 15:48:05    0/108 [>---------------------------]   0%  - Downloading composer/package-versions-deprecated (1.11.99.1)
27-Feb-2021 15:48:06   - Downloading bantu/ini-get-wrapper (v1.0.1)
27-Feb-2021 15:48:06   - Downloading chita/topological_sort (v3.0.1)
27-Feb-2021 15:48:07   - Downloading symfony/polyfill-php80 (v1.22.1)
27-Feb-2021 15:48:07   - Downloading symfony/process (v5.2.3)
27-Feb-2021 15:48:08   - Downloading symfony/finder (v5.2.3)
27-Feb-2021 15:48:08   - Downloading symfony/polyfill-ctype (v1.22.1)
27-Feb-2021 15:48:09   - Downloading symfony/filesystem (v5.2.3)
27-Feb-2021 15:48:10   - Downloading symfony/polyfill-mbstring (v1.22.1)
27-Feb-2021 15:48:10
27-Feb-2021 15:48:10    3/108 [>---------------------------]   2%
27-Feb-2021 15:48:10    5/108 [=>--------------------------]   4%
27-Feb-2021 15:48:10    7/108 [=>--------------------------]   6%
27-Feb-2021 15:48:10    8/108 [==>-------------------------]   7%
27-Feb-2021 15:48:10    9/108 [==>-------------------------]   8%
27-Feb-2021 15:48:10   10/108 [==>-------------------------]   9%
27-Feb-2021 15:48:10   11/108 [==>-------------------------]  10%
27-Feb-2021 15:48:10   12/108 [===>------------------------]  11%
27-Feb-2021 15:48:10   14/108 [===>------------------------]  12%
27-Feb-2021 15:48:10   15/108 [===>------------------------]  13%
27-Feb-2021 15:48:10   16/108 [====>-----------------------]  14%
27-Feb-2021 15:48:10   19/108 [====>-----------------------]  17%
27-Feb-2021 15:48:10   21/108 [=====>----------------------]  19%
27-Feb-2021 15:48:10   23/108 [=====>----------------------]  21%
27-Feb-2021 15:48:10   24/108 [======>---------------------]  22%
27-Feb-2021 15:48:10   25/108 [======>---------------------]  23%
27-Feb-2021 15:48:10   26/108 [======>---------------------]  24%
27-Feb-2021 15:48:10   27/108 [=======>--------------------]  25%
27-Feb-2021 15:48:11   28/108 [=======>--------------------]  25%
27-Feb-2021 15:48:11   29/108 [=======>--------------------]  26%
27-Feb-2021 15:48:11   30/108 [=======>--------------------]  27%
27-Feb-2021 15:48:11   31/108 [========>-------------------]  28%
27-Feb-2021 15:48:11   32/108 [========>-------------------]  29%
27-Feb-2021 15:48:11   33/108 [========>-------------------]  30%
27-Feb-2021 15:48:11   34/108 [========>-------------------]  31%
27-Feb-2021 15:48:11   35/108 [=========>------------------]  32%
27-Feb-2021 15:48:11   36/108 [=========>------------------]  33%
27-Feb-2021 15:48:11   37/108 [=========>------------------]  34%
27-Feb-2021 15:48:11   38/108 [=========>------------------]  35%
27-Feb-2021 15:48:11   39/108 [==========>-----------------]  36%
27-Feb-2021 15:48:11   40/108 [==========>-----------------]  37%
27-Feb-2021 15:48:11   41/108 [==========>-----------------]  37%
27-Feb-2021 15:48:11   42/108 [==========>-----------------]  38%
27-Feb-2021 15:48:12   43/108 [===========>----------------]  39%
27-Feb-2021 15:48:12   44/108 [===========>----------------]  40%
27-Feb-2021 15:48:12   45/108 [===========>----------------]  41%
27-Feb-2021 15:48:12   46/108 [===========>----------------]  42%
27-Feb-2021 15:48:12   47/108 [============>---------------]  43%
27-Feb-2021 15:48:12   48/108 [============>---------------]  44%
27-Feb-2021 15:48:12   50/108 [============>---------------]  46%
27-Feb-2021 15:48:12   52/108 [=============>--------------]  48%
27-Feb-2021 15:48:12   53/108 [=============>--------------]  49%
27-Feb-2021 15:48:12   54/108 [==============>-------------]  50%
27-Feb-2021 15:48:12   55/108 [==============>-------------]  50%
27-Feb-2021 15:48:12   56/108 [==============>-------------]  51%
27-Feb-2021 15:48:12   57/108 [==============>-------------]  52%
27-Feb-2021 15:48:12   58/108 [===============>------------]  53%
27-Feb-2021 15:48:12   60/108 [===============>------------]  55%
27-Feb-2021 15:48:12   62/108 [================>-----------]  57%
27-Feb-2021 15:48:12   67/108 [=================>----------]  62%
27-Feb-2021 15:48:12   68/108 [=================>----------]  62%
27-Feb-2021 15:48:12   69/108 [=================>----------]  63%
27-Feb-2021 15:48:12   73/108 [==================>---------]  67%
27-Feb-2021 15:48:12   74/108 [===================>--------]  68%
27-Feb-2021 15:48:13   76/108 [===================>--------]  70%
27-Feb-2021 15:48:13   77/108 [===================>--------]  71%
27-Feb-2021 15:48:13   79/108 [====================>-------]  73%
27-Feb-2021 15:48:13   80/108 [====================>-------]  74%
27-Feb-2021 15:48:13   81/108 [=====================>------]  75%
27-Feb-2021 15:48:13   82/108 [=====================>------]  75%
27-Feb-2021 15:48:13   83/108 [=====================>------]  76%
27-Feb-2021 15:48:13   84/108 [=====================>------]  77%
27-Feb-2021 15:48:14   86/108 [======================>-----]  79%
27-Feb-2021 15:48:14   87/108 [======================>-----]  80%
27-Feb-2021 15:48:14   88/108 [======================>-----]  81%
27-Feb-2021 15:48:14   89/108 [=======================>----]  82%
27-Feb-2021 15:48:14   90/108 [=======================>----]  83%
27-Feb-2021 15:48:14   91/108 [=======================>----]  84%
27-Feb-2021 15:48:14   92/108 [=======================>----]  85%
27-Feb-2021 15:48:15   93/108 [========================>---]  86%
27-Feb-2021 15:48:15   94/108 [========================>---]  87%
27-Feb-2021 15:48:15   95/108 [========================>---]  87%
27-Feb-2021 15:48:15   96/108 [========================>---]  88%
27-Feb-2021 15:48:15   97/108 [=========================>--]  89%
27-Feb-2021 15:48:15   98/108 [=========================>--]  90%
27-Feb-2021 15:48:15   99/108 [=========================>--]  91%
27-Feb-2021 15:48:16 100/108 [=========================>--]  92%
27-Feb-2021 15:48:16 101/108 [==========================>-]  93%
27-Feb-2021 15:48:16 102/108 [==========================>-]  94%
27-Feb-2021 15:48:16 103/108 [==========================>-]  95%
27-Feb-2021 15:48:16 104/108 [==========================>-]  96%
27-Feb-2021 15:48:16 105/108 [===========================>]  97%
27-Feb-2021 15:48:16 106/108 [===========================>]  98%
27-Feb-2021 15:48:16 107/108 [===========================>]  99%
27-Feb-2021 15:48:16 108/108 [============================] 100%
27-Feb-2021 15:48:16   - Installing composer/installers (v1.10.0): Extracting archive
27-Feb-2021 15:48:16   - Installing composer/package-versions-deprecated (1.11.99.1): Extracting archive
27-Feb-2021 15:48:16   - Installing bantu/ini-get-wrapper (v1.0.1): Extracting archive
27-Feb-2021 15:48:16   - Installing chita/topological_sort (v3.0.1): Extracting archive
27-Feb-2021 15:48:16   - Installing symfony/polyfill-php80 (v1.22.1): Extracting archive
27-Feb-2021 15:48:16   - Installing symfony/process (v5.2.3): Extracting archive
27-Feb-2021 15:48:16   - Installing symfony/finder (v5.2.3): Extracting archive
27-Feb-2021 15:48:16   - Installing symfony/polyfill-ctype (v1.22.1): Extracting archive
27-Feb-2021 15:48:16   - Installing symfony/filesystem (v5.2.3): Extracting archive
27-Feb-2021 15:48:16   - Installing symfony/polyfill-mbstring (v1.22.1): Extracting archive
27-Feb-2021 15:48:16   - Installing symfony/polyfill-intl-normalizer (v1.22.1): Extracting archive
27-Feb-2021 15:48:16   - Installing symfony/polyfill-intl-grapheme (v1.22.1): Extracting archive
27-Feb-2021 15:48:16   - Installing symfony/string (v5.2.3): Extracting archive
27-Feb-2021 15:48:16   - Installing psr/container (1.0.0): Extracting archive
27-Feb-2021 15:48:16   - Installing symfony/service-contracts (v2.2.0): Extracting archive
27-Feb-2021 15:48:16   - Installing symfony/polyfill-php73 (v1.22.1): Extracting archive
27-Feb-2021 15:48:16   - Installing symfony/console (v5.2.3): Extracting archive
27-Feb-2021 15:48:16   - Installing seld/phar-utils (1.1.1): Extracting archive
27-Feb-2021 15:48:16   - Installing seld/jsonlint (1.8.3): Extracting archive
27-Feb-2021 15:48:16   - Installing react/promise (v2.8.0): Extracting archive
27-Feb-2021 15:48:16   - Installing psr/log (1.1.3): Extracting archive
27-Feb-2021 15:48:16   - Installing justinrainbow/json-schema (5.2.10): Extracting archive
27-Feb-2021 15:48:16   - Installing composer/xdebug-handler (1.4.5): Extracting archive
27-Feb-2021 15:48:16   - Installing composer/spdx-licenses (1.5.5): Extracting archive
27-Feb-2021 15:48:16   - Installing composer/semver (3.2.4): Extracting archive
27-Feb-2021 15:48:16   - Installing composer/ca-bundle (1.2.9): Extracting archive
27-Feb-2021 15:48:16   - Installing composer/composer (2.0.11): Extracting archive
27-Feb-2021 15:48:16   - Installing doctrine/event-manager (1.1.1): Extracting archive
27-Feb-2021 15:48:16   - Installing doctrine/cache (1.10.2): Extracting archive
27-Feb-2021 15:48:16   - Installing doctrine/dbal (3.0.0): Extracting archive
27-Feb-2021 15:48:16   - Installing symfony/dom-crawler (v5.2.3): Extracting archive
27-Feb-2021 15:48:16   - Installing symfony/css-selector (v5.2.3): Extracting archive
27-Feb-2021 15:48:16   - Installing symfony/browser-kit (v5.2.3): Extracting archive
27-Feb-2021 15:48:16   - Installing symfony/polyfill-php72 (v1.22.1): Extracting archive
27-Feb-2021 15:48:16   - Installing symfony/polyfill-intl-idn (v1.22.1): Extracting archive
27-Feb-2021 15:48:16   - Installing ralouphie/getallheaders (3.0.3): Extracting archive
27-Feb-2021 15:48:16   - Installing psr/http-message (1.0.1): Extracting archive
27-Feb-2021 15:48:16   - Installing guzzlehttp/psr7 (1.7.0): Extracting archive
27-Feb-2021 15:48:16   - Installing guzzlehttp/promises (1.4.0): Extracting archive
27-Feb-2021 15:48:16   - Installing guzzlehttp/guzzle (6.5.5): Extracting archive
27-Feb-2021 15:48:16   - Installing fabpot/goutte (v3.3.1): Extracting archive
27-Feb-2021 15:48:16   - Installing google/recaptcha (1.2.4): Extracting archive
27-Feb-2021 15:48:16   - Installing laminas/laminas-zendframework-bridge (1.1.1): Extracting archive
27-Feb-2021 15:48:16   - Installing laminas/laminas-eventmanager (3.3.0): Extracting archive
27-Feb-2021 15:48:16   - Installing laminas/laminas-code (3.4.1): Extracting archive
27-Feb-2021 15:48:16   - Installing symfony/deprecation-contracts (v2.2.0): Extracting archive
27-Feb-2021 15:48:16   - Installing symfony/yaml (v5.2.3): Extracting archive
27-Feb-2021 15:48:16   - Installing laravel/homestead (v10.17.0): Extracting archive
27-Feb-2021 15:48:16   - Installing lusitanian/oauth (v0.8.11): Extracting archive
27-Feb-2021 15:48:16   - Installing marc1706/fast-image-size (v1.1.6): Extracting archive
27-Feb-2021 15:48:16   - Installing sebastian/version (3.0.2): Extracting archive
27-Feb-2021 15:48:16   - Installing sebastian/type (2.3.1): Extracting archive
27-Feb-2021 15:48:16   - Installing sebastian/resource-operations (3.0.3): Extracting archive
27-Feb-2021 15:48:16   - Installing sebastian/recursion-context (4.0.4): Extracting archive
27-Feb-2021 15:48:16   - Installing sebastian/object-reflector (2.0.4): Extracting archive
27-Feb-2021 15:48:16   - Installing sebastian/object-enumerator (4.0.4): Extracting archive
27-Feb-2021 15:48:16   - Installing sebastian/global-state (5.0.2): Extracting archive
27-Feb-2021 15:48:16   - Installing sebastian/exporter (4.0.3): Extracting archive
27-Feb-2021 15:48:16   - Installing sebastian/environment (5.1.3): Extracting archive
27-Feb-2021 15:48:16   - Installing sebastian/diff (4.0.4): Extracting archive
27-Feb-2021 15:48:16   - Installing sebastian/comparator (4.0.6): Extracting archive
27-Feb-2021 15:48:16   - Installing sebastian/code-unit (1.0.8): Extracting archive
27-Feb-2021 15:48:16   - Installing sebastian/cli-parser (1.0.1): Extracting archive
27-Feb-2021 15:48:16   - Installing phpunit/php-timer (5.0.3): Extracting archive
27-Feb-2021 15:48:16   - Installing phpunit/php-text-template (2.0.4): Extracting archive
27-Feb-2021 15:48:16   - Installing phpunit/php-invoker (3.1.1): Extracting archive
27-Feb-2021 15:48:17   - Installing phpunit/php-file-iterator (3.0.5): Extracting archive
27-Feb-2021 15:48:17   - Installing theseer/tokenizer (1.2.0): Extracting archive
27-Feb-2021 15:48:17   - Installing nikic/php-parser (v4.10.4): Extracting archive
27-Feb-2021 15:48:17   - Installing sebastian/lines-of-code (1.0.3): Extracting archive
27-Feb-2021 15:48:17   - Installing sebastian/complexity (2.0.2): Extracting archive
27-Feb-2021 15:48:17   - Installing sebastian/code-unit-reverse-lookup (2.0.3): Extracting archive
27-Feb-2021 15:48:17   - Installing phpunit/php-code-coverage (9.2.5): Extracting archive
27-Feb-2021 15:48:17   - Installing webmozart/assert (1.9.1): Extracting archive
27-Feb-2021 15:48:17   - Installing phpdocumentor/reflection-common (2.2.0): Extracting archive
27-Feb-2021 15:48:17   - Installing phpdocumentor/type-resolver (1.4.0): Extracting archive
27-Feb-2021 15:48:17   - Installing phpdocumentor/reflection-docblock (5.2.2): Extracting archive
27-Feb-2021 15:48:17   - Installing doctrine/instantiator (1.4.0): Extracting archive
27-Feb-2021 15:48:17   - Installing phpspec/prophecy (1.12.2): Extracting archive
27-Feb-2021 15:48:17   - Installing phar-io/version (3.1.0): Extracting archive
27-Feb-2021 15:48:17   - Installing phar-io/manifest (2.0.1): Extracting archive
27-Feb-2021 15:48:17   - Installing myclabs/deep-copy (1.10.2): Extracting archive
27-Feb-2021 15:48:17   - Installing phpunit/phpunit (9.5.2): Extracting archive
27-Feb-2021 15:48:17   - Installing misantron/dbunit (5.1.0): Extracting archive
27-Feb-2021 15:48:17   - Installing patchwork/utf8 (v1.3.3): Extracting archive
27-Feb-2021 15:48:17   - Installing phing/phing (2.16.4): Extracting archive
27-Feb-2021 15:48:17   - Installing s9e/sweetdom (2.0.0): Extracting archive
27-Feb-2021 15:48:17   - Installing s9e/regexp-builder (1.4.4): Extracting archive
27-Feb-2021 15:48:17   - Installing s9e/text-formatter (2.8.3): Extracting archive
27-Feb-2021 15:48:17   - Installing squizlabs/php_codesniffer (3.5.8): Extracting archive
27-Feb-2021 15:48:17   - Installing symfony/config (v5.2.3): Extracting archive
27-Feb-2021 15:48:17   - Installing symfony/debug (v4.4.19): Extracting archive
27-Feb-2021 15:48:17   - Installing psr/event-dispatcher (1.0.0): Extracting archive
27-Feb-2021 15:48:17   - Installing symfony/event-dispatcher-contracts (v2.2.0): Extracting archive
27-Feb-2021 15:48:17   - Installing symfony/http-foundation (v5.2.3): Extracting archive
27-Feb-2021 15:48:17   - Installing symfony/http-client-contracts (v2.3.1): Extracting archive
27-Feb-2021 15:48:17   - Installing symfony/event-dispatcher (v5.2.3): Extracting archive
27-Feb-2021 15:48:17   - Installing symfony/var-dumper (v5.2.3): Extracting archive
27-Feb-2021 15:48:17   - Installing symfony/error-handler (v5.2.3): Extracting archive
27-Feb-2021 15:48:17   - Installing symfony/http-kernel (v5.2.3): Extracting archive
27-Feb-2021 15:48:17   - Installing symfony/mime (v5.2.3): Extracting archive
27-Feb-2021 15:48:17   - Installing symfony/dependency-injection (v5.2.3): Extracting archive
27-Feb-2021 15:48:17   - Installing friendsofphp/proxy-manager-lts (v1.0.3): Extracting archive
27-Feb-2021 15:48:17   - Installing symfony/proxy-manager-bridge (v5.2.3): Extracting archive
27-Feb-2021 15:48:17   - Installing symfony/routing (v5.2.3): Extracting archive
27-Feb-2021 15:48:17   - Installing twig/twig (v2.14.3): Extracting archive
27-Feb-2021 15:48:17   - Installing symfony/translation-contracts (v2.3.0): Extracting archive
27-Feb-2021 15:48:17   - Installing symfony/twig-bridge (v5.2.3): Extracting archive
27-Feb-2021 15:48:17   0/96 [>---------------------------]   0%
27-Feb-2021 15:48:17 10/96 [==>-------------------------]  10%
27-Feb-2021 15:48:17 20/96 [=====>----------------------]  20%
27-Feb-2021 15:48:18 30/96 [========>-------------------]  31%
27-Feb-2021 15:48:18 40/96 [===========>----------------]  41%
27-Feb-2021 15:48:18 49/96 [==============>-------------]  51%
27-Feb-2021 15:48:18 59/96 [=================>----------]  61%
27-Feb-2021 15:48:18 69/96 [====================>-------]  71%
27-Feb-2021 15:48:19 74/96 [=====================>------]  77%
27-Feb-2021 15:48:19 83/96 [========================>---]  86%
27-Feb-2021 15:48:19 93/96 [===========================>]  96%
27-Feb-2021 15:48:19 95/96 [===========================>]  98%
27-Feb-2021 15:48:19 96/96 [============================] 100%
27-Feb-2021 15:48:20 Package patchwork/utf8 is abandoned, you should avoid using it. Use symfony/polyfill-mbstring or symfony/string instead.
27-Feb-2021 15:48:20 Generating autoload files
27-Feb-2021 15:48:20 composer/package-versions-deprecated: Generating version class...
27-Feb-2021 15:48:20 composer/package-versions-deprecated: ...done generating version class
27-Feb-2021 15:48:20 76 packages you are using are looking for funding.
27-Feb-2021 15:48:20 Use the `composer fund` command to find out more!
27-Feb-2021 15:48:20
27-Feb-2021 15:48:20 Fatal error: Composer detected issues in your platform: Your Composer dependencies require a PHP version ">= 7.3.0". You are running 7.1.33. in /data/phpBB/vendor/composer/platform_check.php on line 24
27-Feb-2021 15:48:20
27-Feb-2021 15:48:20 Call Stack:
27-Feb-2021 15:48:20     0.0002     351944   1. {main}() /data/phpBB/vendor/phing/phing/bin/phing:0
27-Feb-2021 15:48:20     0.0006     366576   2. require_once('/data/phpBB/vendor/phing/phing/bin/phing.php') /data/phpBB/vendor/phing/phing/bin/phing:14
27-Feb-2021 15:48:20     0.0007     367680   3. require_once('/data/phpBB/vendor/autoload.php') /data/phpBB/vendor/phing/phing/bin/phing.php:14
27-Feb-2021 15:48:20     0.0010     382712   4. ComposerAutoloaderInit0d758af3b8234a56c479900064cb4d2e::getLoader() /data/phpBB/vendor/autoload.php:7
27-Feb-2021 15:48:20     0.0011     388176   5. require('/data/phpBB/vendor/composer/platform_check.php') /data/phpBB/vendor/composer/autoload_real.php:25
27-Feb-2021 15:48:20     0.0011     388752   6. trigger_error() /data/phpBB/vendor/composer/platform_check.php:24
27-Feb-2021 15:48:20
27-Feb-2021 15:48:20 Exit code: 255, output: STDOUT:  93/96 [===========================>]  96%STDOUT:  95/96 [===========================>]  98%STDOUT:  96/96 [============================] 100%STDOUT:  Package patchwork/utf8 is abandoned, you should avoid using it. Use symfony/polyfill-mbstring or symfony/string instead.STDOUT:  Generating autoload filesSTDOUT:  composer/package-versions-deprecated: Generating version class...STDOUT:  composer/package-versions-deprecated: ...done generating version classSTDOUT:  76 packages you are using are looking for funding.STDOUT:  Use the `composer fund` command to find out more!STDOUT:  STDOUT:  Fatal error: Composer detected issues in your platform: Your Composer dependencies require a PHP version ">= 7.3.0". You are running 7.1.33. in /data/phpBB/vendor/composer/platform_check.php on line 24STDOUT:  STDOUT:  Call Stack:STDOUT:      0.0002     351944   1. {main}() /data/phpBB/vendor/phing/phing/bin/phing:0STDOUT:      0.0006     366576   2. require_once('/data/phpBB/vendor/phing/phing/bin/phing.php') /data/phpBB/vendor/phing/phing/bin/phing:14STDOUT:      0.0007     367680   3. require_once('/data/phpBB/vendor/autoload.php') /data/phpBB/vendor/phing/phing/bin/phing.php:14STDOUT:      0.0010     382712   4. ComposerAutoloaderInit0d758af3b8234a56c479900064cb4d2e::getLoader() /data/phpBB/vendor/autoload.php:7STDOUT:      0.0011     388176   5. require('/data/phpBB/vendor/composer/platform_check.php') /data/phpBB/vendor/composer/autoload_real.php:25STDOUT:      0.0011     388752   6. trigger_error() /data/phpBB/vendor/composer/platform_check.php:24STDOUT: 
27-Feb-2021 15:48:21 Error occurred while running Task 'Run tests(2)' of type com.atlassian.bamboo.plugins.bamboo-docker-plugin:task.docker.cli.
27-Feb-2021 15:48:21 com.atlassian.bamboo.task.TaskException: Failed to execute task
27-Feb-2021 15:48:21         at com.atlassian.bamboo.plugins.docker.service.RunService.execute(RunService.java:75)
27-Feb-2021 15:48:21         at com.atlassian.bamboo.plugins.docker.tasks.cli.DockerCliTask.execute(DockerCliTask.java:70)
27-Feb-2021 15:48:21         at com.atlassian.bamboo.task.TaskExecutorImpl.lambda$executeTasks$3(TaskExecutorImpl.java:323)
27-Feb-2021 15:48:21         at com.atlassian.bamboo.task.TaskExecutorImpl.executeTaskWithPrePostActions(TaskExecutorImpl.java:256)
27-Feb-2021 15:48:21         at com.atlassian.bamboo.task.TaskExecutorImpl.executeTasks(TaskExecutorImpl.java:323)
27-Feb-2021 15:48:21         at com.atlassian.bamboo.task.TaskExecutorImpl.execute(TaskExecutorImpl.java:116)
27-Feb-2021 15:48:21         at com.atlassian.bamboo.build.pipeline.tasks.ExecuteBuildTask.call(ExecuteBuildTask.java:73)
27-Feb-2021 15:48:21         at com.atlassian.bamboo.v2.build.agent.DefaultBuildAgent.executeBuildPhase(DefaultBuildAgent.java:184)
27-Feb-2021 15:48:21         at com.atlassian.bamboo.v2.build.agent.DefaultBuildAgent.build(DefaultBuildAgent.java:156)
27-Feb-2021 15:48:21         at com.atlassian.bamboo.v2.build.agent.BuildAgentControllerImpl.lambda$waitAndPerformBuild$0(BuildAgentControllerImpl.java:130)
27-Feb-2021 15:48:21         at com.atlassian.bamboo.variable.CustomVariableContextImpl.withVariableSubstitutor(CustomVariableContextImpl.java:118)
27-Feb-2021 15:48:21         at com.atlassian.bamboo.v2.build.agent.BuildAgentControllerImpl.waitAndPerformBuild(BuildAgentControllerImpl.java:124)
27-Feb-2021 15:48:21         at com.atlassian.bamboo.v2.build.agent.DefaultBuildAgent.lambda$start$0(DefaultBuildAgent.java:108)
27-Feb-2021 15:48:21         at com.atlassian.bamboo.utils.BambooRunnables$1.run(BambooRunnables.java:48)
27-Feb-2021 15:48:21         at com.atlassian.bamboo.security.ImpersonationHelper.runWith(ImpersonationHelper.java:26)
27-Feb-2021 15:48:21         at com.atlassian.bamboo.security.ImpersonationHelper.runWithSystemAuthority(ImpersonationHelper.java:17)
27-Feb-2021 15:48:21         at com.atlassian.bamboo.security.ImpersonationHelper$1.run(ImpersonationHelper.java:41)
27-Feb-2021 15:48:21         at java.lang.Thread.run(Thread.java:748)
27-Feb-2021 15:48:21 Caused by: com.atlassian.bamboo.docker.DockerException: Error running Docker run command
27-Feb-2021 15:48:21         at com.atlassian.bamboo.docker.DockerContainerServiceImpl.run(DockerContainerServiceImpl.java:130)
27-Feb-2021 15:48:21         at sun.reflect.GeneratedMethodAccessor3133.invoke(Unknown Source)
27-Feb-2021 15:48:21         at sun.reflect.DelegatingMethodAccessorImpl.invoke(DelegatingMethodAccessorImpl.java:43)
27-Feb-2021 15:48:21         at java.lang.reflect.Method.invoke(Method.java:498)
27-Feb-2021 15:48:21         at com.atlassian.plugin.util.ContextClassLoaderSettingInvocationHandler.invoke(ContextClassLoaderSettingInvocationHandler.java:26)
27-Feb-2021 15:48:21         at com.sun.proxy.$Proxy446.run(Unknown Source)
27-Feb-2021 15:48:21         at sun.reflect.GeneratedMethodAccessor3133.invoke(Unknown Source)
27-Feb-2021 15:48:21         at sun.reflect.DelegatingMethodAccessorImpl.invoke(DelegatingMethodAccessorImpl.java:43)
27-Feb-2021 15:48:21         at java.lang.reflect.Method.invoke(Method.java:498)
27-Feb-2021 15:48:21         at org.springframework.aop.support.AopUtils.invokeJoinpointUsingReflection(AopUtils.java:343)
27-Feb-2021 15:48:21         at org.eclipse.gemini.blueprint.service.importer.support.internal.aop.ServiceInvoker.doInvoke(ServiceInvoker.java:56)
27-Feb-2021 15:48:21         at org.eclipse.gemini.blueprint.service.importer.support.internal.aop.ServiceInvoker.invoke(ServiceInvoker.java:60)
27-Feb-2021 15:48:21         at org.springframework.aop.framework.ReflectiveMethodInvocation.proceed(ReflectiveMethodInvocation.java:186)
27-Feb-2021 15:48:21         at org.springframework.aop.support.DelegatingIntroductionInterceptor.doProceed(DelegatingIntroductionInterceptor.java:136)
27-Feb-2021 15:48:21         at org.springframework.aop.support.DelegatingIntroductionInterceptor.invoke(DelegatingIntroductionInterceptor.java:124)
27-Feb-2021 15:48:21         at org.springframework.aop.framework.ReflectiveMethodInvocation.proceed(ReflectiveMethodInvocation.java:186)
27-Feb-2021 15:48:21         at org.eclipse.gemini.blueprint.service.util.internal.aop.ServiceTCCLInterceptor.invokeUnprivileged(ServiceTCCLInterceptor.java:70)
27-Feb-2021 15:48:21         at org.eclipse.gemini.blueprint.service.util.internal.aop.ServiceTCCLInterceptor.invoke(ServiceTCCLInterceptor.java:53)
27-Feb-2021 15:48:21         at org.springframework.aop.framework.ReflectiveMethodInvocation.proceed(ReflectiveMethodInvocation.java:186)
27-Feb-2021 15:48:21         at org.eclipse.gemini.blueprint.service.importer.support.LocalBundleContextAdvice.invoke(LocalBundleContextAdvice.java:57)
27-Feb-2021 15:48:21         at org.springframework.aop.framework.ReflectiveMethodInvocation.proceed(ReflectiveMethodInvocation.java:186)
27-Feb-2021 15:48:21         at org.springframework.aop.support.DelegatingIntroductionInterceptor.doProceed(DelegatingIntroductionInterceptor.java:136)
27-Feb-2021 15:48:21         at org.springframework.aop.support.DelegatingIntroductionInterceptor.invoke(DelegatingIntroductionInterceptor.java:124)
27-Feb-2021 15:48:21         at org.springframework.aop.framework.ReflectiveMethodInvocation.proceed(ReflectiveMethodInvocation.java:186)
27-Feb-2021 15:48:21         at org.springframework.aop.framework.JdkDynamicAopProxy.invoke(JdkDynamicAopProxy.java:212)
27-Feb-2021 15:48:21         at com.sun.proxy.$Proxy889.run(Unknown Source)
27-Feb-2021 15:48:21         at com.atlassian.bamboo.plugins.docker.client.DockerCmd.run(DockerCmd.java:47)
27-Feb-2021 15:48:21         at com.atlassian.bamboo.plugins.docker.service.RunService.execute(RunService.java:64)
27-Feb-2021 15:48:21         ... 17 more
27-Feb-2021 15:48:21 Caused by: com.atlassian.utils.process.ProcessException: Error executing /usr/bin/docker run --volume /home/bamboo/xml-data/build-dir/PHPBB3-DDM-JOB1:/data --workdir /data/phpBB --rm -u=991 -t phpbb:php-7.1 /bin/bash -c "php ../composer.phar install --dev; cd ../build; ../phpBB/vendor/bin/phing build"
27-Feb-2021 15:48:21         at com.atlassian.bamboo.docker.DockerContainerServiceImpl.execute(DockerContainerServiceImpl.java:302)
27-Feb-2021 15:48:21         at com.atlassian.bamboo.docker.DockerContainerServiceImpl.execute(DockerContainerServiceImpl.java:273)
27-Feb-2021 15:48:21         at com.atlassian.bamboo.docker.DockerContainerServiceImpl.run(DockerContainerServiceImpl.java:107)
27-Feb-2021 15:48:21         ... 44 more
27-Feb-2021 15:48:21 Starting task 'Parsing test results' of type 'com.atlassian.bamboo.plugins.testresultparser:task.testresultparser.junit'
27-Feb-2021 15:48:21 Parsing test results under /home/bamboo/xml-data/build-dir/PHPBB3-DDM-JOB1...
27-Feb-2021 15:48:21 Failing task since test cases were expected but none were found.
27-Feb-2021 15:48:21 Finished task 'Parsing test results' with result: Failed
27-Feb-2021 15:48:21 Running post build plugin 'NCover Results Collector'
27-Feb-2021 15:48:21 Running post build plugin 'Artifact Copier'
27-Feb-2021 15:48:21 Publishing an artifact: Coverage HTML Report
27-Feb-2021 15:48:21 Unable to publish artifact [Coverage HTML Report]: the source directory /home/bamboo/xml-data/build-dir/PHPBB3-DDM-JOB1/build/coverage does not exist.
27-Feb-2021 15:48:21 The artifact hasn't been successfully published after 218.5 μs
27-Feb-2021 15:48:21 Running post build plugin 'npm Cache Cleanup'
27-Feb-2021 15:48:21 Running post build plugin 'Clover Results Collector'
27-Feb-2021 15:48:21 Running post build plugin 'Docker Container Cleanup'
27-Feb-2021 15:48:21 Successfully removed working directory at '/home/bamboo/xml-data/build-dir/PHPBB3-DDM-JOB1'
27-Feb-2021 15:48:21 Finalising the build...
27-Feb-2021 15:48:21 Stopping timer.
27-Feb-2021 15:48:21 Build PHPBB3-DDM-JOB1-892 completed.
27-Feb-2021 15:48:21 Running on server: post build plugin 'NCover Results Collector'
27-Feb-2021 15:48:21 Running on server: post build plugin 'Build Hanging Detection Configuration'
27-Feb-2021 15:48:21 Running on server: post build plugin 'Clover Delta Calculator'
27-Feb-2021 15:48:21 Running on server: post build plugin 'Maven Dependencies Postprocessor'
27-Feb-2021 15:48:21 All post build plugins have finished
27-Feb-2021 15:48:21 Generating build results summary...
27-Feb-2021 15:48:21 Saving build results to disk...
27-Feb-2021 15:48:21 Store variable context...
27-Feb-2021 15:48:21 Indexing build results...
27-Feb-2021 15:48:21 Finished building PHPBB3-DDM-JOB1-892.