Build: #893 failed

Job: PHP 7.3 - SQLite failed

Stages & jobs

  1. Default Stage

Build log

The build generated 799 lines of output. Download or view full build log

01-Mar-2021 20:41:41 Build phpBB3 - Development Docker Master - PHP 7.1 - SQLite #893 (PHPBB3-DDM-JOB1-893) started building on agent Docker
01-Mar-2021 20:41:41
01-Mar-2021 20:41:41 Build working directory is /home/bamboo/xml-data/build-dir/PHPBB3-DDM-JOB1
01-Mar-2021 20:41:41 Executing build phpBB3 - Development Docker Master - PHP 7.1 - SQLite #893 (PHPBB3-DDM-JOB1-893)
01-Mar-2021 20:41:41 Starting task 'Checkout Default Repository' of type 'com.atlassian.bamboo.plugins.vcs:task.vcs.checkout'
01-Mar-2021 20:41:41 Checking out into /home/bamboo/xml-data/build-dir/PHPBB3-DDM-JOB1
01-Mar-2021 20:41:41 Updating source code to revision: 3629b587fa0a6e0e4c4875e78e93a015062def38
01-Mar-2021 20:41:42 Fetching 'refs/heads/master' from 'https://github.com/phpbb/phpbb.git'.
01-Mar-2021 20:41:42 Checking out revision 3629b587fa0a6e0e4c4875e78e93a015062def38.
01-Mar-2021 20:41:42 Creating local git repository in '/home/bamboo/xml-data/build-dir/PHPBB3-DDM-JOB1/.git'.
01-Mar-2021 20:41:42 Cloning into '/home/bamboo/xml-data/build-dir/PHPBB3-DDM-JOB1'...
01-Mar-2021 20:41:42 done.
01-Mar-2021 20:41:47 Already on 'master'
01-Mar-2021 20:41:47 Updated source code to revision: 3629b587fa0a6e0e4c4875e78e93a015062def38
01-Mar-2021 20:41:47 Finished task 'Checkout Default Repository' with result: Success
01-Mar-2021 20:41:47 Running pre-build action: VCS Version Collector
01-Mar-2021 20:41:47
Substituting variable: ${bamboo.working.directory} with /home/bamboo/xml-data/build-dir/PHPBB3-DDM-JOB1
01-Mar-2021 20:41:47 Starting task 'Build image' of type 'com.atlassian.bamboo.plugins.bamboo-docker-plugin:task.docker.cli'
01-Mar-2021 20:41:47
Beginning to execute external process for build 'phpBB3 - Development Docker Master - PHP 7.1 - SQLite #893 (PHPBB3-DDM-JOB1-893)'
... running command line:
/usr/bin/docker build --force-rm=true --tag=phpbb:php-7.1 /home/bamboo/xml-data/build-dir/PHPBB3-DDM-JOB1
... in: /home/bamboo/xml-data/build-dir/PHPBB3-DDM-JOB1
... using extra environment variables:
bamboo_planRepository_1_branch=master
bamboo_repository_75956230_previous_revision_number=febe2c6d2da58b14aff8d15ba57a5cf5f67290cf
bamboo_planRepository_1_branchDisplayName=master
bamboo_repository_revision_number=3629b587fa0a6e0e4c4875e78e93a015062def38
bamboo_resultsUrl=https://bamboo.phpbb.com/browse/PHPBB3-DDM-JOB1-893
bamboo_capability_system_builder_command_Git=/usr/bin/git
bamboo_build_working_directory=/home/bamboo/xml-data/build-dir/PHPBB3-DDM-JOB1
bamboo_planRepository_1_name=phpBB Master
bamboo_buildKey=PHPBB3-DDM-JOB1
bamboo_shortPlanName=Development Docker Master
bamboo_planRepository_name=phpBB Master
bamboo_repository_75956230_git_branch=master
bamboo_buildNumber=893
bamboo_capability_system_builder_phpunit_PHPUnit=/usr/bin/phpunit
bamboo_repository_75956230_name=phpBB Master
bamboo_shortJobName=PHP 7.1 - SQLite
bamboo_buildResultsUrl=https://bamboo.phpbb.com/browse/PHPBB3-DDM-JOB1-893
bamboo_planRepository_repositoryUrl=https://github.com/phpbb/phpbb.git
bamboo_repository_75956230_git_repositoryUrl=https://github.com/phpbb/phpbb.git
bamboo_agentId=65929217
bamboo_planName=phpBB3 - Development Docker Master
bamboo_shortPlanKey=DDM
bamboo_shortJobKey=JOB1
bamboo_capability_system_jdk_JDK_1_7_0_65=/usr/lib/jvm/java-7-openjdk-amd64
bamboo_planRepository_revision=3629b587fa0a6e0e4c4875e78e93a015062def38
bamboo_buildTimeStamp=2021-03-01T20:23:57.299Z
bamboo_repository_previous_revision_number=febe2c6d2da58b14aff8d15ba57a5cf5f67290cf
bamboo_capability_system_jdk_JDK_1_6_0_16=/usr/lib/jvm/java-6-sun-1.6.0.16
bamboo_capability_system_builder_mvn2_Maven_2=/usr/share/maven2
bamboo_planRepository_previousRevision=febe2c6d2da58b14aff8d15ba57a5cf5f67290cf
bamboo_repository_git_branch=master
bamboo_buildResultKey=PHPBB3-DDM-JOB1-893
bamboo_repository_branch_name=master
bamboo_buildPlanName=phpBB3 - Development Docker Master - PHP 7.1 - SQLite
bamboo_planRepository_1_revision=3629b587fa0a6e0e4c4875e78e93a015062def38
bamboo_repository_name=phpBB Master
bamboo_buildFailed=false
bamboo_capability_system_docker_executable=/usr/bin/docker
bamboo_repository_75956230_git_username=
bamboo_planRepository_branch=master
bamboo_agentWorkingDirectory=/home/bamboo/xml-data/build-dir
bamboo_capability_system_git_executable=/usr/bin/git
bamboo_capability_system_builder_phpunit_PHPUnit_3_4=/usr/bin/phpunit
bamboo_repository_git_username=
bamboo_planRepository_1_previousRevision=febe2c6d2da58b14aff8d15ba57a5cf5f67290cf
bamboo_repository_75956230_branch_name=master
bamboo_planRepository_branchDisplayName=master
bamboo_planRepository_1_type=gitv2
bamboo_planRepository_branchName=master
bamboo_capability_system_jdk_JDK=/usr/lib/jvm/java-6-sun
bamboo_plan_storageTag=PHPBB3-DDM
bamboo_hg_cache_directory=/home/bamboo/xml-data/build-dir/_hg-repositories-cache
bamboo_planRepository_1_username=
bamboo_planRepository_type=gitv2
bamboo_git_cache_directory=/home/bamboo/xml-data/build-dir/_git-repositories-cache
bamboo_repository_git_repositoryUrl=https://github.com/phpbb/phpbb.git
bamboo_capability_system_builder_ant_Ant=/usr/share/ant
bamboo_repository_75956230_revision_number=3629b587fa0a6e0e4c4875e78e93a015062def38
bamboo_tmp_directory=/home/bamboo/temp
bamboo_working_directory=/home/bamboo/xml-data/build-dir/PHPBB3-DDM-JOB1
bamboo_planKey=PHPBB3-DDM
bamboo_capability_local=true
bamboo_planRepository_1_repositoryUrl=https://github.com/phpbb/phpbb.git
bamboo_planRepository_username=
bamboo_capability_system_jdk_JDK_1_6=/usr/lib/jvm/java-6-sun
bamboo_capability_system_jdk_JDK_1_7=/usr/lib/jvm/java-7-openjdk-amd64
bamboo_planRepository_1_branchName=master
01-Mar-2021 20:41:47 Sending build context to Docker daemon  25.18MB
01-Mar-2021 20:41:47
01-Mar-2021 20:41:48 Step 1/5 : FROM php:7.1
01-Mar-2021 20:41:48 ---> 060b5298208c
01-Mar-2021 20:41:48 Step 2/5 : RUN apt-get update && apt-get install -y         git         zlib1g-dev         bzip2         zip         && docker-php-ext-install -j$(nproc) zip
01-Mar-2021 20:41:48 ---> Using cache
01-Mar-2021 20:41:48 ---> b313c14cc11c
01-Mar-2021 20:41:48 Step 3/5 : RUN pecl install xdebug-2.6.1
01-Mar-2021 20:41:48 ---> Using cache
01-Mar-2021 20:41:48 ---> caf4fbb9a34f
01-Mar-2021 20:41:48 Step 4/5 : RUN docker-php-ext-enable xdebug
01-Mar-2021 20:41:48 ---> Using cache
01-Mar-2021 20:41:48 ---> a1f6b2cac05e
01-Mar-2021 20:41:48 Step 5/5 : RUN echo "memory_limit = 1536M" >> /usr/local/etc/php/conf.d/memory.ini
01-Mar-2021 20:41:50 ---> Running in f6216f315b85
01-Mar-2021 20:41:52 Removing intermediate container f6216f315b85
01-Mar-2021 20:41:52 ---> 0c008a582caf
01-Mar-2021 20:41:52 Successfully built 0c008a582caf
01-Mar-2021 20:41:52 Successfully tagged phpbb:php-7.1
01-Mar-2021 20:41:52 Built Docker image 'phpbb:php-7.1'
01-Mar-2021 20:41:52 Finished task 'Build image' with result: Success
01-Mar-2021 20:41:52
Substituting variable: ${bamboo.working.directory} with /home/bamboo/xml-data/build-dir/PHPBB3-DDM-JOB1
01-Mar-2021 20:41:52 Starting task 'Run tests' of type 'com.atlassian.bamboo.plugins.bamboo-docker-plugin:task.docker.cli'
01-Mar-2021 20:41:52 Running image name (phpbb:php-7.1)
01-Mar-2021 20:41:52
Beginning to execute external process for build 'phpBB3 - Development Docker Master - PHP 7.1 - SQLite #893 (PHPBB3-DDM-JOB1-893)'
... running command line:
/usr/bin/docker run --volume /home/bamboo/xml-data/build-dir/PHPBB3-DDM-JOB1:/data --workdir /data/phpBB --rm -u=991 -t phpbb:php-7.1 /bin/bash -c php ../composer.phar install --dev; cd ../build; ../phpBB/vendor/bin/phing build
... in: /home/bamboo/xml-data/build-dir/PHPBB3-DDM-JOB1
... using extra environment variables:
bamboo_planRepository_1_branch=master
bamboo_repository_75956230_previous_revision_number=febe2c6d2da58b14aff8d15ba57a5cf5f67290cf
bamboo_planRepository_1_branchDisplayName=master
bamboo_repository_revision_number=3629b587fa0a6e0e4c4875e78e93a015062def38
bamboo_resultsUrl=https://bamboo.phpbb.com/browse/PHPBB3-DDM-JOB1-893
bamboo_capability_system_builder_command_Git=/usr/bin/git
bamboo_build_working_directory=/home/bamboo/xml-data/build-dir/PHPBB3-DDM-JOB1
bamboo_planRepository_1_name=phpBB Master
bamboo_buildKey=PHPBB3-DDM-JOB1
bamboo_shortPlanName=Development Docker Master
bamboo_planRepository_name=phpBB Master
bamboo_repository_75956230_git_branch=master
bamboo_buildNumber=893
bamboo_capability_system_builder_phpunit_PHPUnit=/usr/bin/phpunit
bamboo_repository_75956230_name=phpBB Master
bamboo_shortJobName=PHP 7.1 - SQLite
bamboo_buildResultsUrl=https://bamboo.phpbb.com/browse/PHPBB3-DDM-JOB1-893
bamboo_planRepository_repositoryUrl=https://github.com/phpbb/phpbb.git
bamboo_repository_75956230_git_repositoryUrl=https://github.com/phpbb/phpbb.git
bamboo_agentId=65929217
bamboo_planName=phpBB3 - Development Docker Master
bamboo_shortPlanKey=DDM
bamboo_shortJobKey=JOB1
bamboo_capability_system_jdk_JDK_1_7_0_65=/usr/lib/jvm/java-7-openjdk-amd64
bamboo_planRepository_revision=3629b587fa0a6e0e4c4875e78e93a015062def38
bamboo_buildTimeStamp=2021-03-01T20:23:57.299Z
bamboo_repository_previous_revision_number=febe2c6d2da58b14aff8d15ba57a5cf5f67290cf
bamboo_capability_system_jdk_JDK_1_6_0_16=/usr/lib/jvm/java-6-sun-1.6.0.16
bamboo_capability_system_builder_mvn2_Maven_2=/usr/share/maven2
bamboo_planRepository_previousRevision=febe2c6d2da58b14aff8d15ba57a5cf5f67290cf
bamboo_repository_git_branch=master
bamboo_buildResultKey=PHPBB3-DDM-JOB1-893
bamboo_repository_branch_name=master
bamboo_buildPlanName=phpBB3 - Development Docker Master - PHP 7.1 - SQLite
bamboo_planRepository_1_revision=3629b587fa0a6e0e4c4875e78e93a015062def38
bamboo_build_commandline_com_atlassian_bamboo_plugins_bamboo_docker_plugin_task_docker_cli_3=/usr/bin/docker build --force-rm=true --tag=phpbb:php-7.1 /home/bamboo/xml-data/build-dir/PHPBB3-DDM-JOB1
bamboo_repository_name=phpBB Master
bamboo_buildFailed=false
bamboo_capability_system_docker_executable=/usr/bin/docker
bamboo_repository_75956230_git_username=
bamboo_planRepository_branch=master
bamboo_agentWorkingDirectory=/home/bamboo/xml-data/build-dir
bamboo_capability_system_git_executable=/usr/bin/git
bamboo_capability_system_builder_phpunit_PHPUnit_3_4=/usr/bin/phpunit
bamboo_repository_git_username=
bamboo_planRepository_1_previousRevision=febe2c6d2da58b14aff8d15ba57a5cf5f67290cf
bamboo_repository_75956230_branch_name=master
bamboo_planRepository_branchDisplayName=master
bamboo_planRepository_1_type=gitv2
bamboo_planRepository_branchName=master
bamboo_capability_system_jdk_JDK=/usr/lib/jvm/java-6-sun
bamboo_plan_storageTag=PHPBB3-DDM
bamboo_hg_cache_directory=/home/bamboo/xml-data/build-dir/_hg-repositories-cache
bamboo_planRepository_1_username=
bamboo_planRepository_type=gitv2
bamboo_git_cache_directory=/home/bamboo/xml-data/build-dir/_git-repositories-cache
bamboo_repository_git_repositoryUrl=https://github.com/phpbb/phpbb.git
bamboo_capability_system_builder_ant_Ant=/usr/share/ant
bamboo_repository_75956230_revision_number=3629b587fa0a6e0e4c4875e78e93a015062def38
bamboo_tmp_directory=/home/bamboo/temp
bamboo_working_directory=/home/bamboo/xml-data/build-dir/PHPBB3-DDM-JOB1
bamboo_planKey=PHPBB3-DDM
bamboo_capability_local=true
bamboo_planRepository_1_repositoryUrl=https://github.com/phpbb/phpbb.git
bamboo_planRepository_username=
bamboo_capability_system_jdk_JDK_1_6=/usr/lib/jvm/java-6-sun
bamboo_capability_system_jdk_JDK_1_7=/usr/lib/jvm/java-7-openjdk-amd64
bamboo_planRepository_1_branchName=master
01-Mar-2021 20:41:53 Cannot create cache directory /.composer/cache/repo/https---repo.packagist.org/, or directory is not writable. Proceeding without cache
01-Mar-2021 20:41:53 Cannot create cache directory /.composer/cache/files/, or directory is not writable. Proceeding without cache
01-Mar-2021 20:41:53 You are using the deprecated option "--dev". It has no effect and will break in Composer 3.
01-Mar-2021 20:41:53 Installing dependencies from lock file (including require-dev)
01-Mar-2021 20:41:53 Verifying lock file contents can be installed on current platform.
01-Mar-2021 20:41:53 Package operations: 108 installs, 0 updates, 0 removals
01-Mar-2021 20:41:53   - Downloading composer/installers (v1.10.0)
01-Mar-2021 20:41:53   - Downloading composer/package-versions-deprecated (1.11.99.1)
01-Mar-2021 20:41:53   - Downloading bantu/ini-get-wrapper (v1.0.1)
01-Mar-2021 20:41:53   - Downloading chita/topological_sort (v3.0.1)
01-Mar-2021 20:41:53   - Downloading symfony/polyfill-php80 (v1.22.1)
01-Mar-2021 20:41:53   - Downloading symfony/process (v5.2.3)
01-Mar-2021 20:41:53   - Downloading symfony/finder (v5.2.3)
01-Mar-2021 20:41:53   - Downloading symfony/polyfill-ctype (v1.22.1)
01-Mar-2021 20:41:53   - Downloading symfony/filesystem (v5.2.3)
01-Mar-2021 20:41:53   - Downloading symfony/polyfill-mbstring (v1.22.1)
01-Mar-2021 20:41:53   - Downloading symfony/polyfill-intl-normalizer (v1.22.1)
01-Mar-2021 20:41:53   - Downloading symfony/polyfill-intl-grapheme (v1.22.1)
01-Mar-2021 20:41:53   - Downloading symfony/string (v5.2.3)
01-Mar-2021 20:41:53   - Downloading psr/container (1.0.0)
01-Mar-2021 20:41:53   - Downloading symfony/service-contracts (v2.2.0)
01-Mar-2021 20:41:53   - Downloading symfony/polyfill-php73 (v1.22.1)
01-Mar-2021 20:41:53   - Downloading symfony/console (v5.2.3)
01-Mar-2021 20:41:53   - Downloading seld/phar-utils (1.1.1)
01-Mar-2021 20:41:53   - Downloading seld/jsonlint (1.8.3)
01-Mar-2021 20:41:53   - Downloading react/promise (v2.8.0)
01-Mar-2021 20:41:53   - Downloading psr/log (1.1.3)
01-Mar-2021 20:41:53   - Downloading justinrainbow/json-schema (5.2.10)
01-Mar-2021 20:41:53   - Downloading composer/xdebug-handler (1.4.5)
01-Mar-2021 20:41:53   - Downloading composer/spdx-licenses (1.5.5)
01-Mar-2021 20:41:53   - Downloading composer/semver (3.2.4)
01-Mar-2021 20:41:53   - Downloading composer/ca-bundle (1.2.9)
01-Mar-2021 20:41:53   - Downloading composer/composer (2.0.11)
01-Mar-2021 20:41:53   - Downloading doctrine/event-manager (1.1.1)
01-Mar-2021 20:41:53   - Downloading doctrine/cache (1.10.2)
01-Mar-2021 20:41:53   - Downloading doctrine/dbal (3.0.0)
01-Mar-2021 20:41:53   - Downloading symfony/dom-crawler (v5.2.3)
01-Mar-2021 20:41:53   - Downloading symfony/css-selector (v5.2.3)
01-Mar-2021 20:41:53   - Downloading symfony/browser-kit (v5.2.3)
01-Mar-2021 20:41:53   - Downloading symfony/polyfill-php72 (v1.22.1)
01-Mar-2021 20:41:53   - Downloading symfony/polyfill-intl-idn (v1.22.1)
01-Mar-2021 20:41:53   - Downloading ralouphie/getallheaders (3.0.3)
01-Mar-2021 20:41:53   - Downloading psr/http-message (1.0.1)
01-Mar-2021 20:41:53   - Downloading guzzlehttp/psr7 (1.7.0)
01-Mar-2021 20:41:53   - Downloading guzzlehttp/promises (1.4.0)
01-Mar-2021 20:41:53   - Downloading guzzlehttp/guzzle (6.5.5)
01-Mar-2021 20:41:53   - Downloading fabpot/goutte (v3.3.1)
01-Mar-2021 20:41:53   - Downloading google/recaptcha (1.2.4)
01-Mar-2021 20:41:53   - Downloading laminas/laminas-zendframework-bridge (1.1.1)
01-Mar-2021 20:41:53   - Downloading laminas/laminas-eventmanager (3.3.0)
01-Mar-2021 20:41:53   - Downloading laminas/laminas-code (3.4.1)
01-Mar-2021 20:41:53   - Downloading symfony/deprecation-contracts (v2.2.0)
01-Mar-2021 20:41:53   - Downloading symfony/yaml (v5.2.3)
01-Mar-2021 20:41:53   - Downloading laravel/homestead (v10.17.0)
01-Mar-2021 20:41:53   - Downloading lusitanian/oauth (v0.8.11)
01-Mar-2021 20:41:53   - Downloading marc1706/fast-image-size (v1.1.6)
01-Mar-2021 20:41:53   - Downloading sebastian/version (3.0.2)
01-Mar-2021 20:41:53   - Downloading sebastian/type (2.3.1)
01-Mar-2021 20:41:53   - Downloading sebastian/resource-operations (3.0.3)
01-Mar-2021 20:41:53   - Downloading sebastian/recursion-context (4.0.4)
01-Mar-2021 20:41:53   - Downloading sebastian/object-reflector (2.0.4)
01-Mar-2021 20:41:53   - Downloading sebastian/object-enumerator (4.0.4)
01-Mar-2021 20:41:53   - Downloading sebastian/global-state (5.0.2)
01-Mar-2021 20:41:53   - Downloading sebastian/exporter (4.0.3)
01-Mar-2021 20:41:53   - Downloading sebastian/environment (5.1.3)
01-Mar-2021 20:41:53   - Downloading sebastian/diff (4.0.4)
01-Mar-2021 20:41:53   - Downloading sebastian/comparator (4.0.6)
01-Mar-2021 20:41:53   - Downloading sebastian/code-unit (1.0.8)
01-Mar-2021 20:41:53   - Downloading sebastian/cli-parser (1.0.1)
01-Mar-2021 20:41:53   - Downloading phpunit/php-timer (5.0.3)
01-Mar-2021 20:41:53   - Downloading phpunit/php-text-template (2.0.4)
01-Mar-2021 20:41:53   - Downloading phpunit/php-invoker (3.1.1)
01-Mar-2021 20:41:53   - Downloading phpunit/php-file-iterator (3.0.5)
01-Mar-2021 20:41:53   - Downloading theseer/tokenizer (1.2.0)
01-Mar-2021 20:41:53   - Downloading nikic/php-parser (v4.10.4)
01-Mar-2021 20:41:53   - Downloading sebastian/lines-of-code (1.0.3)
01-Mar-2021 20:41:53   - Downloading sebastian/complexity (2.0.2)
01-Mar-2021 20:41:53   - Downloading sebastian/code-unit-reverse-lookup (2.0.3)
01-Mar-2021 20:41:53   - Downloading phpunit/php-code-coverage (9.2.5)
01-Mar-2021 20:41:53   - Downloading webmozart/assert (1.9.1)
01-Mar-2021 20:41:53   - Downloading phpdocumentor/reflection-common (2.2.0)
01-Mar-2021 20:41:53   - Downloading phpdocumentor/type-resolver (1.4.0)
01-Mar-2021 20:41:53   - Downloading phpdocumentor/reflection-docblock (5.2.2)
01-Mar-2021 20:41:53   - Downloading doctrine/instantiator (1.4.0)
01-Mar-2021 20:41:53   - Downloading phpspec/prophecy (1.12.2)
01-Mar-2021 20:41:53   - Downloading phar-io/version (3.1.0)
01-Mar-2021 20:41:53   - Downloading phar-io/manifest (2.0.1)
01-Mar-2021 20:41:53   - Downloading myclabs/deep-copy (1.10.2)
01-Mar-2021 20:41:53   - Downloading phpunit/phpunit (9.5.2)
01-Mar-2021 20:41:53   - Downloading misantron/dbunit (5.1.0)
01-Mar-2021 20:41:53   - Downloading patchwork/utf8 (v1.3.3)
01-Mar-2021 20:41:53   - Downloading phing/phing (2.16.4)
01-Mar-2021 20:41:53   - Downloading s9e/sweetdom (2.0.0)
01-Mar-2021 20:41:53   - Downloading s9e/regexp-builder (1.4.4)
01-Mar-2021 20:41:53   - Downloading s9e/text-formatter (2.8.3)
01-Mar-2021 20:41:53   - Downloading squizlabs/php_codesniffer (3.5.8)
01-Mar-2021 20:41:53   - Downloading symfony/config (v5.2.3)
01-Mar-2021 20:41:53   - Downloading symfony/debug (v4.4.19)
01-Mar-2021 20:41:53   - Downloading psr/event-dispatcher (1.0.0)
01-Mar-2021 20:41:53   - Downloading symfony/event-dispatcher-contracts (v2.2.0)
01-Mar-2021 20:41:53   - Downloading symfony/http-foundation (v5.2.3)
01-Mar-2021 20:41:53   - Downloading symfony/http-client-contracts (v2.3.1)
01-Mar-2021 20:41:53   - Downloading symfony/event-dispatcher (v5.2.3)
01-Mar-2021 20:41:53   - Downloading symfony/var-dumper (v5.2.3)
01-Mar-2021 20:41:53   - Downloading symfony/error-handler (v5.2.3)
01-Mar-2021 20:41:53   - Downloading symfony/http-kernel (v5.2.3)
01-Mar-2021 20:41:53   - Downloading symfony/mime (v5.2.3)
01-Mar-2021 20:41:53   - Downloading symfony/dependency-injection (v5.2.3)
01-Mar-2021 20:41:53   - Downloading friendsofphp/proxy-manager-lts (v1.0.3)
01-Mar-2021 20:41:53   - Downloading symfony/proxy-manager-bridge (v5.2.3)
01-Mar-2021 20:41:53   - Downloading symfony/routing (v5.2.3)
01-Mar-2021 20:41:53   - Downloading twig/twig (v2.14.3)
01-Mar-2021 20:41:53   - Downloading symfony/translation-contracts (v2.3.0)
01-Mar-2021 20:41:53   - Downloading symfony/twig-bridge (v5.2.3)
01-Mar-2021 20:41:54    0/108 [>---------------------------]   0%  - Downloading composer/package-versions-deprecated (1.11.99.1)
01-Mar-2021 20:41:54   - Downloading bantu/ini-get-wrapper (v1.0.1)
01-Mar-2021 20:41:55   - Downloading symfony/polyfill-php80 (v1.22.1)
01-Mar-2021 20:41:55   - Downloading chita/topological_sort (v3.0.1)
01-Mar-2021 20:41:56   - Downloading symfony/process (v5.2.3)
01-Mar-2021 20:41:56   - Downloading symfony/finder (v5.2.3)
01-Mar-2021 20:41:57   - Downloading symfony/polyfill-ctype (v1.22.1)
01-Mar-2021 20:41:58   - Downloading symfony/filesystem (v5.2.3)
01-Mar-2021 20:41:58   - Downloading symfony/polyfill-mbstring (v1.22.1)
01-Mar-2021 20:41:58
01-Mar-2021 20:41:58    7/108 [=>--------------------------]   6%
01-Mar-2021 20:41:58    8/108 [==>-------------------------]   7%
01-Mar-2021 20:41:58   10/108 [==>-------------------------]   9%
01-Mar-2021 20:41:58   11/108 [==>-------------------------]  10%
01-Mar-2021 20:41:58   12/108 [===>------------------------]  11%
01-Mar-2021 20:41:58   14/108 [===>------------------------]  12%
01-Mar-2021 20:41:58   16/108 [====>-----------------------]  14%
01-Mar-2021 20:41:58   18/108 [====>-----------------------]  16%
01-Mar-2021 20:41:58   19/108 [====>-----------------------]  17%
01-Mar-2021 20:41:59   21/108 [=====>----------------------]  19%
01-Mar-2021 20:41:59   22/108 [=====>----------------------]  20%
01-Mar-2021 20:41:59   24/108 [======>---------------------]  22%
01-Mar-2021 20:41:59   25/108 [======>---------------------]  23%
01-Mar-2021 20:41:59   27/108 [=======>--------------------]  25%
01-Mar-2021 20:41:59   28/108 [=======>--------------------]  25%
01-Mar-2021 20:41:59   29/108 [=======>--------------------]  26%
01-Mar-2021 20:41:59   30/108 [=======>--------------------]  27%
01-Mar-2021 20:41:59   31/108 [========>-------------------]  28%
01-Mar-2021 20:41:59   32/108 [========>-------------------]  29%
01-Mar-2021 20:41:59   34/108 [========>-------------------]  31%
01-Mar-2021 20:41:59   35/108 [=========>------------------]  32%
01-Mar-2021 20:41:59   36/108 [=========>------------------]  33%
01-Mar-2021 20:41:59   37/108 [=========>------------------]  34%
01-Mar-2021 20:41:59   38/108 [=========>------------------]  35%
01-Mar-2021 20:41:59   39/108 [==========>-----------------]  36%
01-Mar-2021 20:41:59   40/108 [==========>-----------------]  37%
01-Mar-2021 20:41:59   41/108 [==========>-----------------]  37%
01-Mar-2021 20:41:59   42/108 [==========>-----------------]  38%
01-Mar-2021 20:41:59   43/108 [===========>----------------]  39%
01-Mar-2021 20:41:59   45/108 [===========>----------------]  41%
01-Mar-2021 20:41:59   46/108 [===========>----------------]  42%
01-Mar-2021 20:42:00   47/108 [============>---------------]  43%
01-Mar-2021 20:42:00   48/108 [============>---------------]  44%
01-Mar-2021 20:42:00   50/108 [============>---------------]  46%
01-Mar-2021 20:42:00   51/108 [=============>--------------]  47%
01-Mar-2021 20:42:00   52/108 [=============>--------------]  48%
01-Mar-2021 20:42:00   53/108 [=============>--------------]  49%
01-Mar-2021 20:42:00   54/108 [==============>-------------]  50%
01-Mar-2021 20:42:00   55/108 [==============>-------------]  50%
01-Mar-2021 20:42:00   56/108 [==============>-------------]  51%
01-Mar-2021 20:42:00   57/108 [==============>-------------]  52%
01-Mar-2021 20:42:00   58/108 [===============>------------]  53%
01-Mar-2021 20:42:00   59/108 [===============>------------]  54%
01-Mar-2021 20:42:00   60/108 [===============>------------]  55%
01-Mar-2021 20:42:00   61/108 [===============>------------]  56%
01-Mar-2021 20:42:00   63/108 [================>-----------]  58%
01-Mar-2021 20:42:00   66/108 [=================>----------]  61%
01-Mar-2021 20:42:00   67/108 [=================>----------]  62%
01-Mar-2021 20:42:00   68/108 [=================>----------]  62%
01-Mar-2021 20:42:00   69/108 [=================>----------]  63%
01-Mar-2021 20:42:00   70/108 [==================>---------]  64%
01-Mar-2021 20:42:00   72/108 [==================>---------]  66%
01-Mar-2021 20:42:00   76/108 [===================>--------]  70%
01-Mar-2021 20:42:00   77/108 [===================>--------]  71%
01-Mar-2021 20:42:00   79/108 [====================>-------]  73%
01-Mar-2021 20:42:00   81/108 [=====================>------]  75%
01-Mar-2021 20:42:00   82/108 [=====================>------]  75%
01-Mar-2021 20:42:01   83/108 [=====================>------]  76%
01-Mar-2021 20:42:01   84/108 [=====================>------]  77%
01-Mar-2021 20:42:01   86/108 [======================>-----]  79%
01-Mar-2021 20:42:01   87/108 [======================>-----]  80%
01-Mar-2021 20:42:01   88/108 [======================>-----]  81%
01-Mar-2021 20:42:01   89/108 [=======================>----]  82%
01-Mar-2021 20:42:01   90/108 [=======================>----]  83%
01-Mar-2021 20:42:01   91/108 [=======================>----]  84%
01-Mar-2021 20:42:02   92/108 [=======================>----]  85%
01-Mar-2021 20:42:02   93/108 [========================>---]  86%
01-Mar-2021 20:42:02   94/108 [========================>---]  87%
01-Mar-2021 20:42:02   95/108 [========================>---]  87%
01-Mar-2021 20:42:02   96/108 [========================>---]  88%
01-Mar-2021 20:42:02   97/108 [=========================>--]  89%
01-Mar-2021 20:42:02   98/108 [=========================>--]  90%
01-Mar-2021 20:42:02   99/108 [=========================>--]  91%
01-Mar-2021 20:42:02 100/108 [=========================>--]  92%
01-Mar-2021 20:42:02 101/108 [==========================>-]  93%
01-Mar-2021 20:42:02 102/108 [==========================>-]  94%
01-Mar-2021 20:42:02 103/108 [==========================>-]  95%
01-Mar-2021 20:42:03 104/108 [==========================>-]  96%
01-Mar-2021 20:42:03 105/108 [===========================>]  97%
01-Mar-2021 20:42:03 106/108 [===========================>]  98%
01-Mar-2021 20:42:03 107/108 [===========================>]  99%
01-Mar-2021 20:42:03 108/108 [============================] 100%
01-Mar-2021 20:42:03   - Installing composer/installers (v1.10.0): Extracting archive
01-Mar-2021 20:42:03   - Installing composer/package-versions-deprecated (1.11.99.1): Extracting archive
01-Mar-2021 20:42:03   - Installing bantu/ini-get-wrapper (v1.0.1): Extracting archive
01-Mar-2021 20:42:03   - Installing chita/topological_sort (v3.0.1): Extracting archive
01-Mar-2021 20:42:03   - Installing symfony/polyfill-php80 (v1.22.1): Extracting archive
01-Mar-2021 20:42:03   - Installing symfony/process (v5.2.3): Extracting archive
01-Mar-2021 20:42:03   - Installing symfony/finder (v5.2.3): Extracting archive
01-Mar-2021 20:42:03   - Installing symfony/polyfill-ctype (v1.22.1): Extracting archive
01-Mar-2021 20:42:03   - Installing symfony/filesystem (v5.2.3): Extracting archive
01-Mar-2021 20:42:03   - Installing symfony/polyfill-mbstring (v1.22.1): Extracting archive
01-Mar-2021 20:42:03   - Installing symfony/polyfill-intl-normalizer (v1.22.1): Extracting archive
01-Mar-2021 20:42:03   - Installing symfony/polyfill-intl-grapheme (v1.22.1): Extracting archive
01-Mar-2021 20:42:03   - Installing symfony/string (v5.2.3): Extracting archive
01-Mar-2021 20:42:03   - Installing psr/container (1.0.0): Extracting archive
01-Mar-2021 20:42:03   - Installing symfony/service-contracts (v2.2.0): Extracting archive
01-Mar-2021 20:42:03   - Installing symfony/polyfill-php73 (v1.22.1): Extracting archive
01-Mar-2021 20:42:03   - Installing symfony/console (v5.2.3): Extracting archive
01-Mar-2021 20:42:03   - Installing seld/phar-utils (1.1.1): Extracting archive
01-Mar-2021 20:42:03   - Installing seld/jsonlint (1.8.3): Extracting archive
01-Mar-2021 20:42:03   - Installing react/promise (v2.8.0): Extracting archive
01-Mar-2021 20:42:03   - Installing psr/log (1.1.3): Extracting archive
01-Mar-2021 20:42:03   - Installing justinrainbow/json-schema (5.2.10): Extracting archive
01-Mar-2021 20:42:03   - Installing composer/xdebug-handler (1.4.5): Extracting archive
01-Mar-2021 20:42:03   - Installing composer/spdx-licenses (1.5.5): Extracting archive
01-Mar-2021 20:42:03   - Installing composer/semver (3.2.4): Extracting archive
01-Mar-2021 20:42:03   - Installing composer/ca-bundle (1.2.9): Extracting archive
01-Mar-2021 20:42:03   - Installing composer/composer (2.0.11): Extracting archive
01-Mar-2021 20:42:03   - Installing doctrine/event-manager (1.1.1): Extracting archive
01-Mar-2021 20:42:03   - Installing doctrine/cache (1.10.2): Extracting archive
01-Mar-2021 20:42:03   - Installing doctrine/dbal (3.0.0): Extracting archive
01-Mar-2021 20:42:03   - Installing symfony/dom-crawler (v5.2.3): Extracting archive
01-Mar-2021 20:42:03   - Installing symfony/css-selector (v5.2.3): Extracting archive
01-Mar-2021 20:42:03   - Installing symfony/browser-kit (v5.2.3): Extracting archive
01-Mar-2021 20:42:03   - Installing symfony/polyfill-php72 (v1.22.1): Extracting archive
01-Mar-2021 20:42:03   - Installing symfony/polyfill-intl-idn (v1.22.1): Extracting archive
01-Mar-2021 20:42:03   - Installing ralouphie/getallheaders (3.0.3): Extracting archive
01-Mar-2021 20:42:03   - Installing psr/http-message (1.0.1): Extracting archive
01-Mar-2021 20:42:03   - Installing guzzlehttp/psr7 (1.7.0): Extracting archive
01-Mar-2021 20:42:03   - Installing guzzlehttp/promises (1.4.0): Extracting archive
01-Mar-2021 20:42:03   - Installing guzzlehttp/guzzle (6.5.5): Extracting archive
01-Mar-2021 20:42:03   - Installing fabpot/goutte (v3.3.1): Extracting archive
01-Mar-2021 20:42:03   - Installing google/recaptcha (1.2.4): Extracting archive
01-Mar-2021 20:42:03   - Installing laminas/laminas-zendframework-bridge (1.1.1): Extracting archive
01-Mar-2021 20:42:03   - Installing laminas/laminas-eventmanager (3.3.0): Extracting archive
01-Mar-2021 20:42:03   - Installing laminas/laminas-code (3.4.1): Extracting archive
01-Mar-2021 20:42:03   - Installing symfony/deprecation-contracts (v2.2.0): Extracting archive
01-Mar-2021 20:42:03   - Installing symfony/yaml (v5.2.3): Extracting archive
01-Mar-2021 20:42:03   - Installing laravel/homestead (v10.17.0): Extracting archive
01-Mar-2021 20:42:03   - Installing lusitanian/oauth (v0.8.11): Extracting archive
01-Mar-2021 20:42:03   - Installing marc1706/fast-image-size (v1.1.6): Extracting archive
01-Mar-2021 20:42:03   - Installing sebastian/version (3.0.2): Extracting archive
01-Mar-2021 20:42:03   - Installing sebastian/type (2.3.1): Extracting archive
01-Mar-2021 20:42:03   - Installing sebastian/resource-operations (3.0.3): Extracting archive
01-Mar-2021 20:42:03   - Installing sebastian/recursion-context (4.0.4): Extracting archive
01-Mar-2021 20:42:03   - Installing sebastian/object-reflector (2.0.4): Extracting archive
01-Mar-2021 20:42:03   - Installing sebastian/object-enumerator (4.0.4): Extracting archive
01-Mar-2021 20:42:03   - Installing sebastian/global-state (5.0.2): Extracting archive
01-Mar-2021 20:42:03   - Installing sebastian/exporter (4.0.3): Extracting archive
01-Mar-2021 20:42:03   - Installing sebastian/environment (5.1.3): Extracting archive
01-Mar-2021 20:42:03   - Installing sebastian/diff (4.0.4): Extracting archive
01-Mar-2021 20:42:03   - Installing sebastian/comparator (4.0.6): Extracting archive
01-Mar-2021 20:42:03   - Installing sebastian/code-unit (1.0.8): Extracting archive
01-Mar-2021 20:42:03   - Installing sebastian/cli-parser (1.0.1): Extracting archive
01-Mar-2021 20:42:03   - Installing phpunit/php-timer (5.0.3): Extracting archive
01-Mar-2021 20:42:03   - Installing phpunit/php-text-template (2.0.4): Extracting archive
01-Mar-2021 20:42:03   - Installing phpunit/php-invoker (3.1.1): Extracting archive
01-Mar-2021 20:42:03   - Installing phpunit/php-file-iterator (3.0.5): Extracting archive
01-Mar-2021 20:42:03   - Installing theseer/tokenizer (1.2.0): Extracting archive
01-Mar-2021 20:42:03   - Installing nikic/php-parser (v4.10.4): Extracting archive
01-Mar-2021 20:42:03   - Installing sebastian/lines-of-code (1.0.3): Extracting archive
01-Mar-2021 20:42:03   - Installing sebastian/complexity (2.0.2): Extracting archive
01-Mar-2021 20:42:03   - Installing sebastian/code-unit-reverse-lookup (2.0.3): Extracting archive
01-Mar-2021 20:42:03   - Installing phpunit/php-code-coverage (9.2.5): Extracting archive
01-Mar-2021 20:42:03   - Installing webmozart/assert (1.9.1): Extracting archive
01-Mar-2021 20:42:03   - Installing phpdocumentor/reflection-common (2.2.0): Extracting archive
01-Mar-2021 20:42:03   - Installing phpdocumentor/type-resolver (1.4.0): Extracting archive
01-Mar-2021 20:42:03   - Installing phpdocumentor/reflection-docblock (5.2.2): Extracting archive
01-Mar-2021 20:42:03   - Installing doctrine/instantiator (1.4.0): Extracting archive
01-Mar-2021 20:42:03   - Installing phpspec/prophecy (1.12.2): Extracting archive
01-Mar-2021 20:42:03   - Installing phar-io/version (3.1.0): Extracting archive
01-Mar-2021 20:42:03   - Installing phar-io/manifest (2.0.1): Extracting archive
01-Mar-2021 20:42:03   - Installing myclabs/deep-copy (1.10.2): Extracting archive
01-Mar-2021 20:42:03   - Installing phpunit/phpunit (9.5.2): Extracting archive
01-Mar-2021 20:42:03   - Installing misantron/dbunit (5.1.0): Extracting archive
01-Mar-2021 20:42:03   - Installing patchwork/utf8 (v1.3.3): Extracting archive
01-Mar-2021 20:42:03   - Installing phing/phing (2.16.4): Extracting archive
01-Mar-2021 20:42:03   - Installing s9e/sweetdom (2.0.0): Extracting archive
01-Mar-2021 20:42:03   - Installing s9e/regexp-builder (1.4.4): Extracting archive
01-Mar-2021 20:42:03   - Installing s9e/text-formatter (2.8.3): Extracting archive
01-Mar-2021 20:42:03   - Installing squizlabs/php_codesniffer (3.5.8): Extracting archive
01-Mar-2021 20:42:03   - Installing symfony/config (v5.2.3): Extracting archive
01-Mar-2021 20:42:03   - Installing symfony/debug (v4.4.19): Extracting archive
01-Mar-2021 20:42:03   - Installing psr/event-dispatcher (1.0.0): Extracting archive
01-Mar-2021 20:42:03   - Installing symfony/event-dispatcher-contracts (v2.2.0): Extracting archive
01-Mar-2021 20:42:03   - Installing symfony/http-foundation (v5.2.3): Extracting archive
01-Mar-2021 20:42:03   - Installing symfony/http-client-contracts (v2.3.1): Extracting archive
01-Mar-2021 20:42:03   - Installing symfony/event-dispatcher (v5.2.3): Extracting archive
01-Mar-2021 20:42:03   - Installing symfony/var-dumper (v5.2.3): Extracting archive
01-Mar-2021 20:42:03   - Installing symfony/error-handler (v5.2.3): Extracting archive
01-Mar-2021 20:42:03   - Installing symfony/http-kernel (v5.2.3): Extracting archive
01-Mar-2021 20:42:03   - Installing symfony/mime (v5.2.3): Extracting archive
01-Mar-2021 20:42:03   - Installing symfony/dependency-injection (v5.2.3): Extracting archive
01-Mar-2021 20:42:03   - Installing friendsofphp/proxy-manager-lts (v1.0.3): Extracting archive
01-Mar-2021 20:42:03   - Installing symfony/proxy-manager-bridge (v5.2.3): Extracting archive
01-Mar-2021 20:42:03   - Installing symfony/routing (v5.2.3): Extracting archive
01-Mar-2021 20:42:03   - Installing twig/twig (v2.14.3): Extracting archive
01-Mar-2021 20:42:03   - Installing symfony/translation-contracts (v2.3.0): Extracting archive
01-Mar-2021 20:42:03   - Installing symfony/twig-bridge (v5.2.3): Extracting archive
01-Mar-2021 20:42:03   0/96 [>---------------------------]   0%
01-Mar-2021 20:42:04   7/96 [==>-------------------------]   7%
01-Mar-2021 20:42:04 17/96 [====>-----------------------]  17%
01-Mar-2021 20:42:04 23/96 [======>---------------------]  23%
01-Mar-2021 20:42:04 33/96 [=========>------------------]  34%
01-Mar-2021 20:42:04 43/96 [============>---------------]  44%
01-Mar-2021 20:42:05 53/96 [===============>------------]  55%
01-Mar-2021 20:42:05 63/96 [==================>---------]  65%
01-Mar-2021 20:42:05 73/96 [=====================>------]  76%
01-Mar-2021 20:42:05 80/96 [=======================>----]  83%
01-Mar-2021 20:42:06 89/96 [=========================>--]  92%
01-Mar-2021 20:42:06 96/96 [============================] 100%
01-Mar-2021 20:42:06 Package patchwork/utf8 is abandoned, you should avoid using it. Use symfony/polyfill-mbstring or symfony/string instead.
01-Mar-2021 20:42:06 Generating autoload files
01-Mar-2021 20:42:06 composer/package-versions-deprecated: Generating version class...
01-Mar-2021 20:42:06 composer/package-versions-deprecated: ...done generating version class
01-Mar-2021 20:42:06 76 packages you are using are looking for funding.
01-Mar-2021 20:42:06 Use the `composer fund` command to find out more!
01-Mar-2021 20:42:07
01-Mar-2021 20:42:07 Fatal error: Composer detected issues in your platform: Your Composer dependencies require a PHP version ">= 7.3.0". You are running 7.1.33. in /data/phpBB/vendor/composer/platform_check.php on line 24
01-Mar-2021 20:42:07
01-Mar-2021 20:42:07 Call Stack:
01-Mar-2021 20:42:07     0.0003     351944   1. {main}() /data/phpBB/vendor/phing/phing/bin/phing:0
01-Mar-2021 20:42:07     0.0006     366576   2. require_once('/data/phpBB/vendor/phing/phing/bin/phing.php') /data/phpBB/vendor/phing/phing/bin/phing:14
01-Mar-2021 20:42:07     0.0008     367680   3. require_once('/data/phpBB/vendor/autoload.php') /data/phpBB/vendor/phing/phing/bin/phing.php:14
01-Mar-2021 20:42:07     0.0010     382712   4. ComposerAutoloaderInit7b70e1a5e759ce333d8292817e7e8dfa::getLoader() /data/phpBB/vendor/autoload.php:7
01-Mar-2021 20:42:07     0.0011     388176   5. require('/data/phpBB/vendor/composer/platform_check.php') /data/phpBB/vendor/composer/autoload_real.php:25
01-Mar-2021 20:42:07     0.0012     388752   6. trigger_error() /data/phpBB/vendor/composer/platform_check.php:24
01-Mar-2021 20:42:07
01-Mar-2021 20:42:07 Exit code: 255, output: STDOUT:  80/96 [=======================>----]  83%STDOUT:  89/96 [=========================>--]  92%STDOUT:  96/96 [============================] 100%STDOUT:  Package patchwork/utf8 is abandoned, you should avoid using it. Use symfony/polyfill-mbstring or symfony/string instead.STDOUT:  Generating autoload filesSTDOUT:  composer/package-versions-deprecated: Generating version class...STDOUT:  composer/package-versions-deprecated: ...done generating version classSTDOUT:  76 packages you are using are looking for funding.STDOUT:  Use the `composer fund` command to find out more!STDOUT:  STDOUT:  Fatal error: Composer detected issues in your platform: Your Composer dependencies require a PHP version ">= 7.3.0". You are running 7.1.33. in /data/phpBB/vendor/composer/platform_check.php on line 24STDOUT:  STDOUT:  Call Stack:STDOUT:      0.0003     351944   1. {main}() /data/phpBB/vendor/phing/phing/bin/phing:0STDOUT:      0.0006     366576   2. require_once('/data/phpBB/vendor/phing/phing/bin/phing.php') /data/phpBB/vendor/phing/phing/bin/phing:14STDOUT:      0.0008     367680   3. require_once('/data/phpBB/vendor/autoload.php') /data/phpBB/vendor/phing/phing/bin/phing.php:14STDOUT:      0.0010     382712   4. ComposerAutoloaderInit7b70e1a5e759ce333d8292817e7e8dfa::getLoader() /data/phpBB/vendor/autoload.php:7STDOUT:      0.0011     388176   5. require('/data/phpBB/vendor/composer/platform_check.php') /data/phpBB/vendor/composer/autoload_real.php:25STDOUT:      0.0012     388752   6. trigger_error() /data/phpBB/vendor/composer/platform_check.php:24STDOUT: 
01-Mar-2021 20:42:07 Error occurred while running Task 'Run tests(2)' of type com.atlassian.bamboo.plugins.bamboo-docker-plugin:task.docker.cli.
01-Mar-2021 20:42:07 com.atlassian.bamboo.task.TaskException: Failed to execute task
01-Mar-2021 20:42:07         at com.atlassian.bamboo.plugins.docker.service.RunService.execute(RunService.java:75)
01-Mar-2021 20:42:07         at com.atlassian.bamboo.plugins.docker.tasks.cli.DockerCliTask.execute(DockerCliTask.java:70)
01-Mar-2021 20:42:07         at com.atlassian.bamboo.task.TaskExecutorImpl.lambda$executeTasks$3(TaskExecutorImpl.java:323)
01-Mar-2021 20:42:07         at com.atlassian.bamboo.task.TaskExecutorImpl.executeTaskWithPrePostActions(TaskExecutorImpl.java:256)
01-Mar-2021 20:42:07         at com.atlassian.bamboo.task.TaskExecutorImpl.executeTasks(TaskExecutorImpl.java:323)
01-Mar-2021 20:42:07         at com.atlassian.bamboo.task.TaskExecutorImpl.execute(TaskExecutorImpl.java:116)
01-Mar-2021 20:42:07         at com.atlassian.bamboo.build.pipeline.tasks.ExecuteBuildTask.call(ExecuteBuildTask.java:73)
01-Mar-2021 20:42:07         at com.atlassian.bamboo.v2.build.agent.DefaultBuildAgent.executeBuildPhase(DefaultBuildAgent.java:184)
01-Mar-2021 20:42:07         at com.atlassian.bamboo.v2.build.agent.DefaultBuildAgent.build(DefaultBuildAgent.java:156)
01-Mar-2021 20:42:07         at com.atlassian.bamboo.v2.build.agent.BuildAgentControllerImpl.lambda$waitAndPerformBuild$0(BuildAgentControllerImpl.java:130)
01-Mar-2021 20:42:07         at com.atlassian.bamboo.variable.CustomVariableContextImpl.withVariableSubstitutor(CustomVariableContextImpl.java:118)
01-Mar-2021 20:42:07         at com.atlassian.bamboo.v2.build.agent.BuildAgentControllerImpl.waitAndPerformBuild(BuildAgentControllerImpl.java:124)
01-Mar-2021 20:42:07         at com.atlassian.bamboo.v2.build.agent.DefaultBuildAgent.lambda$start$0(DefaultBuildAgent.java:108)
01-Mar-2021 20:42:07         at com.atlassian.bamboo.utils.BambooRunnables$1.run(BambooRunnables.java:48)
01-Mar-2021 20:42:07         at com.atlassian.bamboo.security.ImpersonationHelper.runWith(ImpersonationHelper.java:26)
01-Mar-2021 20:42:07         at com.atlassian.bamboo.security.ImpersonationHelper.runWithSystemAuthority(ImpersonationHelper.java:17)
01-Mar-2021 20:42:07         at com.atlassian.bamboo.security.ImpersonationHelper$1.run(ImpersonationHelper.java:41)
01-Mar-2021 20:42:07         at java.lang.Thread.run(Thread.java:748)
01-Mar-2021 20:42:07 Caused by: com.atlassian.bamboo.docker.DockerException: Error running Docker run command
01-Mar-2021 20:42:07         at com.atlassian.bamboo.docker.DockerContainerServiceImpl.run(DockerContainerServiceImpl.java:130)
01-Mar-2021 20:42:07         at sun.reflect.GeneratedMethodAccessor3133.invoke(Unknown Source)
01-Mar-2021 20:42:07         at sun.reflect.DelegatingMethodAccessorImpl.invoke(DelegatingMethodAccessorImpl.java:43)
01-Mar-2021 20:42:07         at java.lang.reflect.Method.invoke(Method.java:498)
01-Mar-2021 20:42:07         at com.atlassian.plugin.util.ContextClassLoaderSettingInvocationHandler.invoke(ContextClassLoaderSettingInvocationHandler.java:26)
01-Mar-2021 20:42:07         at com.sun.proxy.$Proxy446.run(Unknown Source)
01-Mar-2021 20:42:07         at sun.reflect.GeneratedMethodAccessor3133.invoke(Unknown Source)
01-Mar-2021 20:42:07         at sun.reflect.DelegatingMethodAccessorImpl.invoke(DelegatingMethodAccessorImpl.java:43)
01-Mar-2021 20:42:07         at java.lang.reflect.Method.invoke(Method.java:498)
01-Mar-2021 20:42:07         at org.springframework.aop.support.AopUtils.invokeJoinpointUsingReflection(AopUtils.java:343)
01-Mar-2021 20:42:07         at org.eclipse.gemini.blueprint.service.importer.support.internal.aop.ServiceInvoker.doInvoke(ServiceInvoker.java:56)
01-Mar-2021 20:42:07         at org.eclipse.gemini.blueprint.service.importer.support.internal.aop.ServiceInvoker.invoke(ServiceInvoker.java:60)
01-Mar-2021 20:42:07         at org.springframework.aop.framework.ReflectiveMethodInvocation.proceed(ReflectiveMethodInvocation.java:186)
01-Mar-2021 20:42:07         at org.springframework.aop.support.DelegatingIntroductionInterceptor.doProceed(DelegatingIntroductionInterceptor.java:136)
01-Mar-2021 20:42:07         at org.springframework.aop.support.DelegatingIntroductionInterceptor.invoke(DelegatingIntroductionInterceptor.java:124)
01-Mar-2021 20:42:07         at org.springframework.aop.framework.ReflectiveMethodInvocation.proceed(ReflectiveMethodInvocation.java:186)
01-Mar-2021 20:42:07         at org.eclipse.gemini.blueprint.service.util.internal.aop.ServiceTCCLInterceptor.invokeUnprivileged(ServiceTCCLInterceptor.java:70)
01-Mar-2021 20:42:07         at org.eclipse.gemini.blueprint.service.util.internal.aop.ServiceTCCLInterceptor.invoke(ServiceTCCLInterceptor.java:53)
01-Mar-2021 20:42:07         at org.springframework.aop.framework.ReflectiveMethodInvocation.proceed(ReflectiveMethodInvocation.java:186)
01-Mar-2021 20:42:07         at org.eclipse.gemini.blueprint.service.importer.support.LocalBundleContextAdvice.invoke(LocalBundleContextAdvice.java:57)
01-Mar-2021 20:42:07         at org.springframework.aop.framework.ReflectiveMethodInvocation.proceed(ReflectiveMethodInvocation.java:186)
01-Mar-2021 20:42:07         at org.springframework.aop.support.DelegatingIntroductionInterceptor.doProceed(DelegatingIntroductionInterceptor.java:136)
01-Mar-2021 20:42:07         at org.springframework.aop.support.DelegatingIntroductionInterceptor.invoke(DelegatingIntroductionInterceptor.java:124)
01-Mar-2021 20:42:07         at org.springframework.aop.framework.ReflectiveMethodInvocation.proceed(ReflectiveMethodInvocation.java:186)
01-Mar-2021 20:42:07         at org.springframework.aop.framework.JdkDynamicAopProxy.invoke(JdkDynamicAopProxy.java:212)
01-Mar-2021 20:42:07         at com.sun.proxy.$Proxy889.run(Unknown Source)
01-Mar-2021 20:42:07         at com.atlassian.bamboo.plugins.docker.client.DockerCmd.run(DockerCmd.java:47)
01-Mar-2021 20:42:07         at com.atlassian.bamboo.plugins.docker.service.RunService.execute(RunService.java:64)
01-Mar-2021 20:42:07         ... 17 more
01-Mar-2021 20:42:07 Caused by: com.atlassian.utils.process.ProcessException: Error executing /usr/bin/docker run --volume /home/bamboo/xml-data/build-dir/PHPBB3-DDM-JOB1:/data --workdir /data/phpBB --rm -u=991 -t phpbb:php-7.1 /bin/bash -c "php ../composer.phar install --dev; cd ../build; ../phpBB/vendor/bin/phing build"
01-Mar-2021 20:42:07         at com.atlassian.bamboo.docker.DockerContainerServiceImpl.execute(DockerContainerServiceImpl.java:302)
01-Mar-2021 20:42:07         at com.atlassian.bamboo.docker.DockerContainerServiceImpl.execute(DockerContainerServiceImpl.java:273)
01-Mar-2021 20:42:07         at com.atlassian.bamboo.docker.DockerContainerServiceImpl.run(DockerContainerServiceImpl.java:107)
01-Mar-2021 20:42:07         ... 44 more
01-Mar-2021 20:42:07 Starting task 'Parsing test results' of type 'com.atlassian.bamboo.plugins.testresultparser:task.testresultparser.junit'
01-Mar-2021 20:42:07 Parsing test results under /home/bamboo/xml-data/build-dir/PHPBB3-DDM-JOB1...
01-Mar-2021 20:42:07 Failing task since test cases were expected but none were found.
01-Mar-2021 20:42:07 Finished task 'Parsing test results' with result: Failed
01-Mar-2021 20:42:07 Running post build plugin 'NCover Results Collector'
01-Mar-2021 20:42:07 Running post build plugin 'Artifact Copier'
01-Mar-2021 20:42:07 Publishing an artifact: Coverage HTML Report
01-Mar-2021 20:42:07 Unable to publish artifact [Coverage HTML Report]: the source directory /home/bamboo/xml-data/build-dir/PHPBB3-DDM-JOB1/build/coverage does not exist.
01-Mar-2021 20:42:07 The artifact hasn't been successfully published after 349.0 μs
01-Mar-2021 20:42:07 Running post build plugin 'npm Cache Cleanup'
01-Mar-2021 20:42:07 Running post build plugin 'Clover Results Collector'
01-Mar-2021 20:42:07 Running post build plugin 'Docker Container Cleanup'
01-Mar-2021 20:42:08 Successfully removed working directory at '/home/bamboo/xml-data/build-dir/PHPBB3-DDM-JOB1'
01-Mar-2021 20:42:08 Finalising the build...
01-Mar-2021 20:42:08 Stopping timer.
01-Mar-2021 20:42:08 Build PHPBB3-DDM-JOB1-893 completed.
01-Mar-2021 20:42:08 Running on server: post build plugin 'NCover Results Collector'
01-Mar-2021 20:42:08 Running on server: post build plugin 'Build Hanging Detection Configuration'
01-Mar-2021 20:42:08 Running on server: post build plugin 'Clover Delta Calculator'
01-Mar-2021 20:42:08 Running on server: post build plugin 'Maven Dependencies Postprocessor'
01-Mar-2021 20:42:08 All post build plugins have finished
01-Mar-2021 20:42:08 Generating build results summary...
01-Mar-2021 20:42:08 Saving build results to disk...
01-Mar-2021 20:42:08 Store variable context...
01-Mar-2021 20:42:08 Indexing build results...
01-Mar-2021 20:42:08 Finished building PHPBB3-DDM-JOB1-893.
01-Mar-2021 20:54:12 Build phpBB3 - Development Docker Master - PHP 7.3 - SQLite #893 (PHPBB3-DDM-JOB1-893) started building on agent Docker
01-Mar-2021 20:54:12
01-Mar-2021 20:54:12 Build working directory is /home/bamboo/xml-data/build-dir/PHPBB3-DDM-JOB1
01-Mar-2021 20:54:12 Executing build phpBB3 - Development Docker Master - PHP 7.3 - SQLite #893 (PHPBB3-DDM-JOB1-893)
01-Mar-2021 20:54:12 Starting task 'Checkout Default Repository' of type 'com.atlassian.bamboo.plugins.vcs:task.vcs.checkout'
01-Mar-2021 20:54:12 Checking out into /home/bamboo/xml-data/build-dir/PHPBB3-DDM-JOB1
01-Mar-2021 20:54:12 Updating source code to revision: 3629b587fa0a6e0e4c4875e78e93a015062def38
01-Mar-2021 20:54:13 Fetching 'refs/heads/master' from 'https://github.com/phpbb/phpbb.git'.
01-Mar-2021 20:54:14 Checking out revision 3629b587fa0a6e0e4c4875e78e93a015062def38.
01-Mar-2021 20:54:14 Creating local git repository in '/home/bamboo/xml-data/build-dir/PHPBB3-DDM-JOB1/.git'.
01-Mar-2021 20:54:14 Cloning into '/home/bamboo/xml-data/build-dir/PHPBB3-DDM-JOB1'...
01-Mar-2021 20:54:14 done.
01-Mar-2021 20:54:20 Already on 'master'
01-Mar-2021 20:54:20 Updated source code to revision: 3629b587fa0a6e0e4c4875e78e93a015062def38
01-Mar-2021 20:54:20 Finished task 'Checkout Default Repository' with result: Success
01-Mar-2021 20:54:20 Running pre-build action: VCS Version Collector
01-Mar-2021 20:54:20
Substituting variable: ${bamboo.working.directory} with /home/bamboo/xml-data/build-dir/PHPBB3-DDM-JOB1
01-Mar-2021 20:54:20 Starting task 'Build image' of type 'com.atlassian.bamboo.plugins.bamboo-docker-plugin:task.docker.cli'
01-Mar-2021 20:54:20
Beginning to execute external process for build 'phpBB3 - Development Docker Master - PHP 7.3 - SQLite #893 (PHPBB3-DDM-JOB1-893)'
... running command line:
/usr/bin/docker build --force-rm=true --tag=phpbb:php-7.3 /home/bamboo/xml-data/build-dir/PHPBB3-DDM-JOB1
... in: /home/bamboo/xml-data/build-dir/PHPBB3-DDM-JOB1
... using extra environment variables:
bamboo_planRepository_1_branch=master
bamboo_repository_75956230_previous_revision_number=febe2c6d2da58b14aff8d15ba57a5cf5f67290cf
bamboo_planRepository_1_branchDisplayName=master
bamboo_repository_revision_number=3629b587fa0a6e0e4c4875e78e93a015062def38
bamboo_resultsUrl=https://bamboo.phpbb.com/browse/PHPBB3-DDM-JOB1-893
bamboo_capability_system_builder_command_Git=/usr/bin/git
bamboo_build_working_directory=/home/bamboo/xml-data/build-dir/PHPBB3-DDM-JOB1
bamboo_planRepository_1_name=phpBB Master
bamboo_buildKey=PHPBB3-DDM-JOB1
bamboo_shortPlanName=Development Docker Master
bamboo_planRepository_name=phpBB Master
bamboo_repository_75956230_git_branch=master
bamboo_buildNumber=893
bamboo_capability_system_builder_phpunit_PHPUnit=/usr/bin/phpunit
bamboo_repository_75956230_name=phpBB Master
bamboo_shortJobName=PHP 7.3 - SQLite
bamboo_buildResultsUrl=https://bamboo.phpbb.com/browse/PHPBB3-DDM-JOB1-893
bamboo_planRepository_repositoryUrl=https://github.com/phpbb/phpbb.git
bamboo_repository_75956230_git_repositoryUrl=https://github.com/phpbb/phpbb.git
bamboo_ManualBuildTriggerReason_stageName=Default Stage
bamboo_agentId=65929217
bamboo_planName=phpBB3 - Development Docker Master
bamboo_shortPlanKey=DDM
bamboo_shortJobKey=JOB1
bamboo_capability_system_jdk_JDK_1_7_0_65=/usr/lib/jvm/java-7-openjdk-amd64
bamboo_planRepository_revision=3629b587fa0a6e0e4c4875e78e93a015062def38
bamboo_buildTimeStamp=2021-03-01T20:54:12.355Z
bamboo_repository_previous_revision_number=febe2c6d2da58b14aff8d15ba57a5cf5f67290cf
bamboo_capability_system_jdk_JDK_1_6_0_16=/usr/lib/jvm/java-6-sun-1.6.0.16
bamboo_capability_system_builder_mvn2_Maven_2=/usr/share/maven2
bamboo_planRepository_previousRevision=febe2c6d2da58b14aff8d15ba57a5cf5f67290cf
bamboo_repository_git_branch=master
bamboo_buildResultKey=PHPBB3-DDM-JOB1-893
bamboo_repository_branch_name=master
bamboo_buildPlanName=phpBB3 - Development Docker Master - PHP 7.3 - SQLite
bamboo_build_commandline_com_atlassian_bamboo_plugins_bamboo_docker_plugin_task_docker_cli_2=/usr/bin/docker run --volume /home/bamboo/xml-data/build-dir/PHPBB3-DDM-JOB1:/data --workdir /data/phpBB --rm -u=991 -t phpbb:php-7.1 /bin/bash -c php ../composer.phar install --dev; cd ../build; ../phpBB/vendor/bin/phing build
bamboo_planRepository_1_revision=3629b587fa0a6e0e4c4875e78e93a015062def38
bamboo_build_commandline_com_atlassian_bamboo_plugins_bamboo_docker_plugin_task_docker_cli_3=/usr/bin/docker build --force-rm=true --tag=phpbb:php-7.1 /home/bamboo/xml-data/build-dir/PHPBB3-DDM-JOB1
bamboo_repository_name=phpBB Master
bamboo_buildFailed=false
bamboo_capability_system_docker_executable=/usr/bin/docker
bamboo_repository_75956230_git_username=
bamboo_planRepository_branch=master
bamboo_agentWorkingDirectory=/home/bamboo/xml-data/build-dir
bamboo_capability_system_git_executable=/usr/bin/git
bamboo_capability_system_builder_phpunit_PHPUnit_3_4=/usr/bin/phpunit
bamboo_repository_git_username=
bamboo_planRepository_1_previousRevision=febe2c6d2da58b14aff8d15ba57a5cf5f67290cf
bamboo_repository_75956230_branch_name=master
bamboo_planRepository_branchDisplayName=master
bamboo_planRepository_1_type=gitv2
bamboo_planRepository_branchName=master
bamboo_capability_system_jdk_JDK=/usr/lib/jvm/java-6-sun
bamboo_plan_storageTag=PHPBB3-DDM
bamboo_hg_cache_directory=/home/bamboo/xml-data/build-dir/_hg-repositories-cache
bamboo_planRepository_1_username=
bamboo_planRepository_type=gitv2
bamboo_git_cache_directory=/home/bamboo/xml-data/build-dir/_git-repositories-cache
bamboo_ManualBuildTriggerReason_userName=Marc
bamboo_repository_git_repositoryUrl=https://github.com/phpbb/phpbb.git
bamboo_capability_system_builder_ant_Ant=/usr/share/ant
bamboo_repository_75956230_revision_number=3629b587fa0a6e0e4c4875e78e93a015062def38
bamboo_tmp_directory=/home/bamboo/temp
bamboo_working_directory=/home/bamboo/xml-data/build-dir/PHPBB3-DDM-JOB1
bamboo_planKey=PHPBB3-DDM
bamboo_RerunBuildTriggerReason_noOfRetries=1
bamboo_capability_local=true
bamboo_planRepository_1_repositoryUrl=https://github.com/phpbb/phpbb.git
bamboo_planRepository_username=
bamboo_capability_system_jdk_JDK_1_6=/usr/lib/jvm/java-6-sun
bamboo_capability_system_jdk_JDK_1_7=/usr/lib/jvm/java-7-openjdk-amd64
bamboo_planRepository_1_branchName=master
01-Mar-2021 20:54:20 Sending build context to Docker daemon  25.18MB
01-Mar-2021 20:54:20
01-Mar-2021 20:54:21 Step 1/5 : FROM php:7.3
01-Mar-2021 20:54:22 7.3: Pulling from library/php
01-Mar-2021 20:54:22 45b42c59be33: Pulling fs layer
01-Mar-2021 20:54:22 a48991d6909c: Pulling fs layer
01-Mar-2021 20:54:22 935e2abd2c2c: Pulling fs layer
01-Mar-2021 20:54:22 61ccf45ccdb9: Pulling fs layer
01-Mar-2021 20:54:22 fe74e9a585b2: Pulling fs layer
01-Mar-2021 20:54:22 c6cff9ebfffc: Pulling fs layer
01-Mar-2021 20:54:22 ab21fc23e7da: Pulling fs layer
01-Mar-2021 20:54:22 d32ef2a4f9ca: Pulling fs layer
01-Mar-2021 20:54:22 ba8b8a5eeab3: Pulling fs layer
01-Mar-2021 20:54:22 d82443b2a002: Pulling fs layer
01-Mar-2021 20:54:22 c6cff9ebfffc: Waiting
01-Mar-2021 20:54:22 ab21fc23e7da: Waiting
01-Mar-2021 20:54:22 d32ef2a4f9ca: Waiting
01-Mar-2021 20:54:22 ba8b8a5eeab3: Waiting
01-Mar-2021 20:54:22 61ccf45ccdb9: Waiting
01-Mar-2021 20:54:22 d82443b2a002: Waiting
01-Mar-2021 20:54:22 fe74e9a585b2: Waiting
01-Mar-2021 20:54:23 a48991d6909c: Verifying Checksum
01-Mar-2021 20:54:23 a48991d6909c: Download complete
01-Mar-2021 20:54:23 61ccf45ccdb9: Verifying Checksum
01-Mar-2021 20:54:23 61ccf45ccdb9: Download complete
01-Mar-2021 20:54:24 45b42c59be33: Verifying Checksum
01-Mar-2021 20:54:24 45b42c59be33: Download complete
01-Mar-2021 20:54:24 c6cff9ebfffc: Verifying Checksum
01-Mar-2021 20:54:24 c6cff9ebfffc: Download complete
01-Mar-2021 20:54:24 fe74e9a585b2: Verifying Checksum
01-Mar-2021 20:54:24 fe74e9a585b2: Download complete
01-Mar-2021 20:54:25 d32ef2a4f9ca: Verifying Checksum
01-Mar-2021 20:54:25 d32ef2a4f9ca: Download complete
01-Mar-2021 20:54:25 ba8b8a5eeab3: Verifying Checksum
01-Mar-2021 20:54:25 ba8b8a5eeab3: Download complete
01-Mar-2021 20:54:25 935e2abd2c2c: Download complete
01-Mar-2021 20:54:26 d82443b2a002: Verifying Checksum
01-Mar-2021 20:54:26 d82443b2a002: Download complete
01-Mar-2021 20:54:26 ab21fc23e7da: Verifying Checksum
01-Mar-2021 20:54:26 ab21fc23e7da: Download complete
01-Mar-2021 20:54:28 45b42c59be33: Pull complete
01-Mar-2021 20:54:28 a48991d6909c: Pull complete
01-Mar-2021 20:54:32 935e2abd2c2c: Pull complete
01-Mar-2021 20:54:35 61ccf45ccdb9: Pull complete
01-Mar-2021 20:54:39 fe74e9a585b2: Pull complete
01-Mar-2021 20:54:40 c6cff9ebfffc: Pull complete
01-Mar-2021 20:54:41 ab21fc23e7da: Pull complete
01-Mar-2021 20:54:42 d32ef2a4f9ca: Pull complete
01-Mar-2021 20:54:43 ba8b8a5eeab3: Pull complete
01-Mar-2021 20:54:44 d82443b2a002: Pull complete
01-Mar-2021 20:54:44 Digest: sha256:dd25587d4ee7200bc5c63fa95b897d18dc3c9656716f1e2ed3b93c00d046da08
01-Mar-2021 20:54:44 Status: Image is up to date for php:7.3
01-Mar-2021 20:54:44 ---> 3f7dde016e9f
01-Mar-2021 20:54:44 Step 2/5 : RUN apt-get update && apt-get install -y         git         zlib1g-dev         bzip2         zip         && docker-php-ext-install -j$(nproc) zip
01-Mar-2021 20:54:45 ---> Running in 5099d12c9166
01-Mar-2021 20:54:46 Get:1 http://deb.debian.org/debian buster InRelease [122 kB]
01-Mar-2021 20:54:46 Get:2 http://security.debian.org/debian-security buster/updates InRelease [65.4 kB]
01-Mar-2021 20:54:46 Get:3 http://deb.debian.org/debian buster-updates InRelease [51.9 kB]
01-Mar-2021 20:54:46 Get:4 http://deb.debian.org/debian buster/main amd64 Packages [7907 kB]
01-Mar-2021 20:54:46 Get:5 http://deb.debian.org/debian buster-updates/main amd64 Packages [9504 B]
01-Mar-2021 20:54:47 Get:6 http://security.debian.org/debian-security buster/updates/main amd64 Packages [268 kB]
01-Mar-2021 20:54:48 Fetched 8423 kB in 2s (4994 kB/s)
01-Mar-2021 20:54:49 Reading package lists...
01-Mar-2021 20:54:50 Reading package lists...
01-Mar-2021 20:54:50 Building dependency tree...
01-Mar-2021 20:54:50 Reading state information...
01-Mar-2021 20:54:50 bzip2 is already the newest version (1.0.6-9.2~deb10u1).
01-Mar-2021 20:54:50 bzip2 set to manually installed.
01-Mar-2021 20:54:50 The following package was automatically installed and is no longer required:
01-Mar-2021 20:54:50   lsb-base
01-Mar-2021 20:54:50 Use 'apt autoremove' to remove it.
01-Mar-2021 20:54:50 The following additional packages will be installed:
01-Mar-2021 20:54:50   git-man less libcurl3-gnutls liberror-perl libexpat1 libpcre2-8-0 libx11-6
01-Mar-2021 20:54:50   libx11-data libxau6 libxcb1 libxdmcp6 libxext6 libxmuu1 openssh-client unzip
01-Mar-2021 20:54:50   xauth
01-Mar-2021 20:54:50 Suggested packages:
01-Mar-2021 20:54:50   gettext-base git-daemon-run | git-daemon-sysvinit git-doc git-el git-email
01-Mar-2021 20:54:50   git-gui gitk gitweb git-cvs git-mediawiki git-svn keychain libpam-ssh
01-Mar-2021 20:54:50   monkeysphere ssh-askpass
01-Mar-2021 20:54:50 The following NEW packages will be installed:
01-Mar-2021 20:54:50   git git-man less libcurl3-gnutls liberror-perl libexpat1 libpcre2-8-0
01-Mar-2021 20:54:50   libx11-6 libx11-data libxau6 libxcb1 libxdmcp6 libxext6 libxmuu1
01-Mar-2021 20:54:50   openssh-client unzip xauth zip zlib1g-dev
01-Mar-2021 20:54:51 0 upgraded, 19 newly installed, 0 to remove and 5 not upgraded.
01-Mar-2021 20:54:51 Need to get 10.8 MB of archives.
01-Mar-2021 20:54:51 After this operation, 49.4 MB of additional disk space will be used.
01-Mar-2021 20:54:51 Get:1 http://deb.debian.org/debian buster/main amd64 less amd64 487-0.1+b1 [129 kB]
01-Mar-2021 20:54:51 Get:2 http://deb.debian.org/debian buster/main amd64 openssh-client amd64 1:7.9p1-10+deb10u2 [782 kB]
01-Mar-2021 20:54:51 Get:3 http://deb.debian.org/debian buster/main amd64 libcurl3-gnutls amd64 7.64.0-4+deb10u1 [330 kB]
01-Mar-2021 20:54:51 Get:4 http://deb.debian.org/debian buster/main amd64 libexpat1 amd64 2.2.6-2+deb10u1 [106 kB]
01-Mar-2021 20:54:51 Get:5 http://deb.debian.org/debian buster/main amd64 libpcre2-8-0 amd64 10.32-5 [213 kB]
01-Mar-2021 20:54:51 Get:6 http://deb.debian.org/debian buster/main amd64 liberror-perl all 0.17027-2 [30.9 kB]
01-Mar-2021 20:54:51 Get:7 http://deb.debian.org/debian buster/main amd64 git-man all 1:2.20.1-2+deb10u3 [1620 kB]
01-Mar-2021 20:54:51 Get:8 http://deb.debian.org/debian buster/main amd64 git amd64 1:2.20.1-2+deb10u3 [5633 kB]
01-Mar-2021 20:54:52 Get:9 http://deb.debian.org/debian buster/main amd64 libxau6 amd64 1:1.0.8-1+b2 [19.9 kB]
01-Mar-2021 20:54:52 Get:10 http://deb.debian.org/debian buster/main amd64 libxdmcp6 amd64 1:1.1.2-3 [26.3 kB]
01-Mar-2021 20:54:52 Get:11 http://deb.debian.org/debian buster/main amd64 libxcb1 amd64 1.13.1-2 [137 kB]
01-Mar-2021 20:54:52 Get:12 http://deb.debian.org/debian buster/main amd64 libx11-data all 2:1.6.7-1+deb10u1 [294 kB]
01-Mar-2021 20:54:52 Get:13 http://deb.debian.org/debian buster/main amd64 libx11-6 amd64 2:1.6.7-1+deb10u1 [757 kB]
01-Mar-2021 20:54:52 Get:14 http://deb.debian.org/debian buster/main amd64 libxext6 amd64 2:1.3.3-1+b2 [52.5 kB]
01-Mar-2021 20:54:52 Get:15 http://deb.debian.org/debian buster/main amd64 libxmuu1 amd64 2:1.1.2-2+b3 [23.9 kB]
01-Mar-2021 20:54:52 Get:16 http://deb.debian.org/debian buster/main amd64 unzip amd64 6.0-23+deb10u2 [172 kB]
01-Mar-2021 20:54:52 Get:17 http://deb.debian.org/debian buster/main amd64 xauth amd64 1:1.0.10-1 [40.3 kB]
01-Mar-2021 20:54:52 Get:18 http://deb.debian.org/debian buster/main amd64 zip amd64 3.0-11+b1 [234 kB]
01-Mar-2021 20:54:52 Get:19 http://deb.debian.org/debian buster/main amd64 zlib1g-dev amd64 1:1.2.11.dfsg-1 [214 kB]
01-Mar-2021 20:54:53 debconf: delaying package configuration, since apt-utils is not installed
01-Mar-2021 20:54:53 Fetched 10.8 MB in 2s (5057 kB/s)
01-Mar-2021 20:54:53 Selecting previously unselected package less.
01-Mar-2021 20:54:53 (Reading database ...
01-Mar-2021 20:54:53 (Reading database ... 5%
01-Mar-2021 20:54:53 (Reading database ... 10%
01-Mar-2021 20:54:53 (Reading database ... 15%
01-Mar-2021 20:54:53 (Reading database ... 20%
01-Mar-2021 20:54:53 (Reading database ... 25%
01-Mar-2021 20:54:53 (Reading database ... 30%
01-Mar-2021 20:54:53 (Reading database ... 35%
01-Mar-2021 20:54:53 (Reading database ... 40%
01-Mar-2021 20:54:53 (Reading database ... 45%
01-Mar-2021 20:54:53 (Reading database ... 50%
01-Mar-2021 20:54:53 (Reading database ... 55%
01-Mar-2021 20:54:53 (Reading database ... 60%
01-Mar-2021 20:54:53 (Reading database ... 65%
01-Mar-2021 20:54:53 (Reading database ... 70%
01-Mar-2021 20:54:53 (Reading database ... 75%
01-Mar-2021 20:54:53 (Reading database ... 80%
01-Mar-2021 20:54:53 (Reading database ... 85%
01-Mar-2021 20:54:53 (Reading database ... 90%
01-Mar-2021 20:54:53 (Reading database ... 95%
01-Mar-2021 20:54:53 (Reading database ... 100%
01-Mar-2021 20:54:53 (Reading database ... 12684 files and directories currently installed.)
01-Mar-2021 20:54:53 Preparing to unpack .../00-less_487-0.1+b1_amd64.deb ...
01-Mar-2021 20:54:53 Unpacking less (487-0.1+b1) ...
01-Mar-2021 20:54:53 Selecting previously unselected package openssh-client.
01-Mar-2021 20:54:53 Preparing to unpack .../01-openssh-client_1%3a7.9p1-10+deb10u2_amd64.deb ...
01-Mar-2021 20:54:53 Unpacking openssh-client (1:7.9p1-10+deb10u2) ...
01-Mar-2021 20:54:53 Selecting previously unselected package libcurl3-gnutls:amd64.
01-Mar-2021 20:54:53 Preparing to unpack .../02-libcurl3-gnutls_7.64.0-4+deb10u1_amd64.deb ...
01-Mar-2021 20:54:53 Unpacking libcurl3-gnutls:amd64 (7.64.0-4+deb10u1) ...
01-Mar-2021 20:54:53 Selecting previously unselected package libexpat1:amd64.
01-Mar-2021 20:54:53 Preparing to unpack .../03-libexpat1_2.2.6-2+deb10u1_amd64.deb ...
01-Mar-2021 20:54:53 Unpacking libexpat1:amd64 (2.2.6-2+deb10u1) ...
01-Mar-2021 20:54:53 Selecting previously unselected package libpcre2-8-0:amd64.
01-Mar-2021 20:54:53 Preparing to unpack .../04-libpcre2-8-0_10.32-5_amd64.deb ...
01-Mar-2021 20:54:53 Unpacking libpcre2-8-0:amd64 (10.32-5) ...
01-Mar-2021 20:54:53 Selecting previously unselected package liberror-perl.
01-Mar-2021 20:54:53 Preparing to unpack .../05-liberror-perl_0.17027-2_all.deb ...
01-Mar-2021 20:54:53 Unpacking liberror-perl (0.17027-2) ...
01-Mar-2021 20:54:53 Selecting previously unselected package git-man.
01-Mar-2021 20:54:53 Preparing to unpack .../06-git-man_1%3a2.20.1-2+deb10u3_all.deb ...
01-Mar-2021 20:54:53 Unpacking git-man (1:2.20.1-2+deb10u3) ...
01-Mar-2021 20:54:54 Selecting previously unselected package git.
01-Mar-2021 20:54:54 Preparing to unpack .../07-git_1%3a2.20.1-2+deb10u3_amd64.deb ...
01-Mar-2021 20:54:54 Unpacking git (1:2.20.1-2+deb10u3) ...
01-Mar-2021 20:54:54 Selecting previously unselected package libxau6:amd64.
01-Mar-2021 20:54:54 Preparing to unpack .../08-libxau6_1%3a1.0.8-1+b2_amd64.deb ...
01-Mar-2021 20:54:54 Unpacking libxau6:amd64 (1:1.0.8-1+b2) ...
01-Mar-2021 20:54:54 Selecting previously unselected package libxdmcp6:amd64.
01-Mar-2021 20:54:54 Preparing to unpack .../09-libxdmcp6_1%3a1.1.2-3_amd64.deb ...
01-Mar-2021 20:54:54 Unpacking libxdmcp6:amd64 (1:1.1.2-3) ...
01-Mar-2021 20:54:54 Selecting previously unselected package libxcb1:amd64.
01-Mar-2021 20:54:54 Preparing to unpack .../10-libxcb1_1.13.1-2_amd64.deb ...
01-Mar-2021 20:54:54 Unpacking libxcb1:amd64 (1.13.1-2) ...
01-Mar-2021 20:54:54 Selecting previously unselected package libx11-data.
01-Mar-2021 20:54:54 Preparing to unpack .../11-libx11-data_2%3a1.6.7-1+deb10u1_all.deb ...
01-Mar-2021 20:54:55 Unpacking libx11-data (2:1.6.7-1+deb10u1) ...
01-Mar-2021 20:54:55 Selecting previously unselected package libx11-6:amd64.
01-Mar-2021 20:54:55 Preparing to unpack .../12-libx11-6_2%3a1.6.7-1+deb10u1_amd64.deb ...
01-Mar-2021 20:54:55 Unpacking libx11-6:amd64 (2:1.6.7-1+deb10u1) ...
01-Mar-2021 20:54:55 Selecting previously unselected package libxext6:amd64.
01-Mar-2021 20:54:55 Preparing to unpack .../13-libxext6_2%3a1.3.3-1+b2_amd64.deb ...
01-Mar-2021 20:54:55 Unpacking libxext6:amd64 (2:1.3.3-1+b2) ...
01-Mar-2021 20:54:55 Selecting previously unselected package libxmuu1:amd64.
01-Mar-2021 20:54:55 Preparing to unpack .../14-libxmuu1_2%3a1.1.2-2+b3_amd64.deb ...
01-Mar-2021 20:54:55 Unpacking libxmuu1:amd64 (2:1.1.2-2+b3) ...
01-Mar-2021 20:54:55 Selecting previously unselected package unzip.
01-Mar-2021 20:54:55 Preparing to unpack .../15-unzip_6.0-23+deb10u2_amd64.deb ...
01-Mar-2021 20:54:55 Unpacking unzip (6.0-23+deb10u2) ...
01-Mar-2021 20:54:55 Selecting previously unselected package xauth.
01-Mar-2021 20:54:55 Preparing to unpack .../16-xauth_1%3a1.0.10-1_amd64.deb ...
01-Mar-2021 20:54:55 Unpacking xauth (1:1.0.10-1) ...
01-Mar-2021 20:54:55 Selecting previously unselected package zip.
01-Mar-2021 20:54:55 Preparing to unpack .../17-zip_3.0-11+b1_amd64.deb ...
01-Mar-2021 20:54:55 Unpacking zip (3.0-11+b1) ...
01-Mar-2021 20:54:55 Selecting previously unselected package zlib1g-dev:amd64.
01-Mar-2021 20:54:55 Preparing to unpack .../18-zlib1g-dev_1%3a1.2.11.dfsg-1_amd64.deb ...
01-Mar-2021 20:54:55 Unpacking zlib1g-dev:amd64 (1:1.2.11.dfsg-1) ...
01-Mar-2021 20:54:55 Setting up libexpat1:amd64 (2.2.6-2+deb10u1) ...
01-Mar-2021 20:54:55 Setting up libxau6:amd64 (1:1.0.8-1+b2) ...
01-Mar-2021 20:54:55 Setting up libxdmcp6:amd64 (1:1.1.2-3) ...
01-Mar-2021 20:54:55 Setting up libxcb1:amd64 (1.13.1-2) ...
01-Mar-2021 20:54:55 Setting up openssh-client (1:7.9p1-10+deb10u2) ...
01-Mar-2021 20:54:55 Setting up unzip (6.0-23+deb10u2) ...
01-Mar-2021 20:54:56 Setting up less (487-0.1+b1) ...
01-Mar-2021 20:54:56 debconf: unable to initialize frontend: Dialog
01-Mar-2021 20:54:56 debconf: (TERM is not set, so the dialog frontend is not usable.)
01-Mar-2021 20:54:56 debconf: falling back to frontend: Readline
01-Mar-2021 20:54:56 Setting up libcurl3-gnutls:amd64 (7.64.0-4+deb10u1) ...
01-Mar-2021 20:54:56 Setting up liberror-perl (0.17027-2) ...
01-Mar-2021 20:54:56 Setting up zip (3.0-11+b1) ...
01-Mar-2021 20:54:56 Setting up libx11-data (2:1.6.7-1+deb10u1) ...
01-Mar-2021 20:54:56 Setting up libpcre2-8-0:amd64 (10.32-5) ...
01-Mar-2021 20:54:56 Setting up zlib1g-dev:amd64 (1:1.2.11.dfsg-1) ...
01-Mar-2021 20:54:56 Setting up git-man (1:2.20.1-2+deb10u3) ...
01-Mar-2021 20:54:56 Setting up libx11-6:amd64 (2:1.6.7-1+deb10u1) ...
01-Mar-2021 20:54:56 Setting up libxmuu1:amd64 (2:1.1.2-2+b3) ...
01-Mar-2021 20:54:56 Setting up libxext6:amd64 (2:1.3.3-1+b2) ...
01-Mar-2021 20:54:56 Setting up git (1:2.20.1-2+deb10u3) ...
01-Mar-2021 20:54:56 Setting up xauth (1:1.0.10-1) ...
01-Mar-2021 20:54:56 Processing triggers for libc-bin (2.28-10) ...
01-Mar-2021 20:55:01 Configuring for:
01-Mar-2021 20:55:01 PHP Api Version:         20180731
01-Mar-2021 20:55:01 Zend Module Api No:      20180731
01-Mar-2021 20:55:01 Zend Extension Api No:   320180731
01-Mar-2021 20:55:02 checking for grep that handles long lines and -e... /bin/grep
01-Mar-2021 20:55:02 checking for egrep... /bin/grep -E
01-Mar-2021 20:55:02 checking for a sed that does not truncate output... /bin/sed
01-Mar-2021 20:55:02 checking for cc... cc
01-Mar-2021 20:55:03 checking whether the C compiler works... yes
01-Mar-2021 20:55:03 checking for C compiler default output file name... a.out
01-Mar-2021 20:55:03 checking for suffix of executables...
01-Mar-2021 20:55:03 checking whether we are cross compiling... no
01-Mar-2021 20:55:03 checking for suffix of object files... o
01-Mar-2021 20:55:03 checking whether we are using the GNU C compiler... yes
01-Mar-2021 20:55:04 checking whether cc accepts -g... yes
01-Mar-2021 20:55:04 checking for cc option to accept ISO C89... none needed
01-Mar-2021 20:55:04 checking how to run the C preprocessor... cc -E
01-Mar-2021 20:55:04 checking for icc... no
01-Mar-2021 20:55:04 checking for suncc... no
01-Mar-2021 20:55:04 checking whether cc understands -c and -o together... yes
01-Mar-2021 20:55:04 checking for system library directory... lib
01-Mar-2021 20:55:04 checking if compiler supports -R... no
01-Mar-2021 20:55:04 checking if compiler supports -Wl,-rpath,... yes
01-Mar-2021 20:55:05 checking build system type... x86_64-pc-linux-gnu
01-Mar-2021 20:55:05 checking host system type... x86_64-pc-linux-gnu
01-Mar-2021 20:55:05 checking target system type... x86_64-pc-linux-gnu
01-Mar-2021 20:55:05 checking for PHP prefix... /usr/local
01-Mar-2021 20:55:05 checking for PHP includes... -I/usr/local/include/php -I/usr/local/include/php/main -I/usr/local/include/php/TSRM -I/usr/local/include/php/Zend -I/usr/local/include/php/ext -I/usr/local/include/php/ext/date/lib
01-Mar-2021 20:55:05 checking for PHP extension directory... /usr/local/lib/php/extensions/no-debug-non-zts-20180731
01-Mar-2021 20:55:05 checking for PHP installed headers prefix... /usr/local/include/php
01-Mar-2021 20:55:05 checking if debug is enabled... no
01-Mar-2021 20:55:05 checking if zts is enabled... no
01-Mar-2021 20:55:05 checking for re2c... re2c
01-Mar-2021 20:55:05 checking for re2c version... 1.1.1 (ok)
01-Mar-2021 20:55:05 checking for gawk... no
01-Mar-2021 20:55:05 checking for nawk... nawk
01-Mar-2021 20:55:05 checking if nawk is broken... no
01-Mar-2021 20:55:05 checking for zip archive read/writesupport... yes, shared
01-Mar-2021 20:55:05 checking for the location of libz... no
01-Mar-2021 20:55:05 checking pcre install prefix... no
01-Mar-2021 20:55:05 checking libzip... yes
01-Mar-2021 20:55:05 checking for the location of zlib... /usr
01-Mar-2021 20:55:05 checking for pkg-config... /usr/bin/pkg-config
01-Mar-2021 20:55:05 checking for libzip... not found
01-Mar-2021 20:55:05 configure: error: Please reinstall the libzip distribution
01-Mar-2021 20:55:06 Removing intermediate container 5099d12c9166
01-Mar-2021 20:55:06 The command '/bin/sh -c apt-get update && apt-get install -y         git         zlib1g-dev         bzip2         zip         && docker-php-ext-install -j$(nproc) zip' returned a non-zero code: 1
01-Mar-2021 20:55:06 Failing task since return code of [/usr/bin/docker build --force-rm=true --tag=phpbb:php-7.3 /home/bamboo/xml-data/build-dir/PHPBB3-DDM-JOB1] was 1 while expected 0
01-Mar-2021 20:55:06 Error occurred while running Task 'Build image(3)' of type com.atlassian.bamboo.plugins.bamboo-docker-plugin:task.docker.cli.
01-Mar-2021 20:55:06 com.atlassian.bamboo.task.TaskException: Failed to execute task
01-Mar-2021 20:55:06         at com.atlassian.bamboo.plugins.docker.service.BuildService.execute(BuildService.java:57)
01-Mar-2021 20:55:06         at com.atlassian.bamboo.plugins.docker.tasks.cli.DockerCliTask.execute(DockerCliTask.java:70)
01-Mar-2021 20:55:06         at com.atlassian.bamboo.task.TaskExecutorImpl.lambda$executeTasks$3(TaskExecutorImpl.java:323)
01-Mar-2021 20:55:06         at com.atlassian.bamboo.task.TaskExecutorImpl.executeTaskWithPrePostActions(TaskExecutorImpl.java:256)
01-Mar-2021 20:55:06         at com.atlassian.bamboo.task.TaskExecutorImpl.executeTasks(TaskExecutorImpl.java:323)
01-Mar-2021 20:55:06         at com.atlassian.bamboo.task.TaskExecutorImpl.execute(TaskExecutorImpl.java:116)
01-Mar-2021 20:55:06         at com.atlassian.bamboo.build.pipeline.tasks.ExecuteBuildTask.call(ExecuteBuildTask.java:73)
01-Mar-2021 20:55:06         at com.atlassian.bamboo.v2.build.agent.DefaultBuildAgent.executeBuildPhase(DefaultBuildAgent.java:184)
01-Mar-2021 20:55:06         at com.atlassian.bamboo.v2.build.agent.DefaultBuildAgent.build(DefaultBuildAgent.java:156)
01-Mar-2021 20:55:06         at com.atlassian.bamboo.v2.build.agent.BuildAgentControllerImpl.lambda$waitAndPerformBuild$0(BuildAgentControllerImpl.java:130)
01-Mar-2021 20:55:06         at com.atlassian.bamboo.variable.CustomVariableContextImpl.withVariableSubstitutor(CustomVariableContextImpl.java:118)
01-Mar-2021 20:55:06         at com.atlassian.bamboo.v2.build.agent.BuildAgentControllerImpl.waitAndPerformBuild(BuildAgentControllerImpl.java:124)
01-Mar-2021 20:55:06         at com.atlassian.bamboo.v2.build.agent.DefaultBuildAgent.lambda$start$0(DefaultBuildAgent.java:108)
01-Mar-2021 20:55:06         at com.atlassian.bamboo.utils.BambooRunnables$1.run(BambooRunnables.java:48)
01-Mar-2021 20:55:06         at com.atlassian.bamboo.security.ImpersonationHelper.runWith(ImpersonationHelper.java:26)
01-Mar-2021 20:55:06         at com.atlassian.bamboo.security.ImpersonationHelper.runWithSystemAuthority(ImpersonationHelper.java:17)
01-Mar-2021 20:55:06         at com.atlassian.bamboo.security.ImpersonationHelper$1.run(ImpersonationHelper.java:41)
01-Mar-2021 20:55:06         at java.lang.Thread.run(Thread.java:748)
01-Mar-2021 20:55:06 Caused by: com.atlassian.bamboo.docker.DockerException: Error running Docker build command
01-Mar-2021 20:55:06         at com.atlassian.bamboo.plugins.docker.client.DockerCmd.build(DockerCmd.java:113)
01-Mar-2021 20:55:06         at com.atlassian.bamboo.plugins.docker.service.BuildService.execute(BuildService.java:44)
01-Mar-2021 20:55:06         ... 17 more
01-Mar-2021 20:55:06 Caused by: com.atlassian.utils.process.ProcessException: Error executing /usr/bin/docker build --force-rm=true --tag=phpbb:php-7.3 /home/bamboo/xml-data/build-dir/PHPBB3-DDM-JOB1
01-Mar-2021 20:55:06         at com.atlassian.bamboo.plugins.docker.process.DockerTaskProcessService.execute(DockerTaskProcessService.java:64)
01-Mar-2021 20:55:06         at com.atlassian.bamboo.plugins.docker.client.DockerCmd.build(DockerCmd.java:111)
01-Mar-2021 20:55:06         ... 18 more
01-Mar-2021 20:55:06 Starting task 'Parsing test results' of type 'com.atlassian.bamboo.plugins.testresultparser:task.testresultparser.junit'
01-Mar-2021 20:55:06 Parsing test results under /home/bamboo/xml-data/build-dir/PHPBB3-DDM-JOB1...
01-Mar-2021 20:55:06 Failing task since test cases were expected but none were found.
01-Mar-2021 20:55:06 Finished task 'Parsing test results' with result: Failed
01-Mar-2021 20:55:06 Running post build plugin 'NCover Results Collector'
01-Mar-2021 20:55:06 Running post build plugin 'Artifact Copier'
01-Mar-2021 20:55:06 Publishing an artifact: Coverage HTML Report
01-Mar-2021 20:55:06 Unable to publish artifact [Coverage HTML Report]: the source directory /home/bamboo/xml-data/build-dir/PHPBB3-DDM-JOB1/build/coverage does not exist.
01-Mar-2021 20:55:06 The artifact hasn't been successfully published after 194.0 μs
01-Mar-2021 20:55:06 Running post build plugin 'npm Cache Cleanup'
01-Mar-2021 20:55:06 Running post build plugin 'Clover Results Collector'
01-Mar-2021 20:55:06 Running post build plugin 'Docker Container Cleanup'
01-Mar-2021 20:55:07 Successfully removed working directory at '/home/bamboo/xml-data/build-dir/PHPBB3-DDM-JOB1'
01-Mar-2021 20:55:07 Finalising the build...
01-Mar-2021 20:55:07 Stopping timer.
01-Mar-2021 20:55:07 Build PHPBB3-DDM-JOB1-893 completed.
01-Mar-2021 20:55:07 Running on server: post build plugin 'NCover Results Collector'
01-Mar-2021 20:55:07 Running on server: post build plugin 'Build Hanging Detection Configuration'
01-Mar-2021 20:55:07 Running on server: post build plugin 'Clover Delta Calculator'
01-Mar-2021 20:55:07 Running on server: post build plugin 'Maven Dependencies Postprocessor'
01-Mar-2021 20:55:07 All post build plugins have finished
01-Mar-2021 20:55:07 Generating build results summary...
01-Mar-2021 20:55:07 Saving build results to disk...
01-Mar-2021 20:55:07 Store variable context...
01-Mar-2021 20:55:07 Indexing build results...
01-Mar-2021 20:55:07 Finished building PHPBB3-DDM-JOB1-893.