Performs unit tests on SQL Server 2012 using the MSSQL Native driver

Build: #26 failed Manual run by Patrick Webster

Build result summary

Details

Completed
Duration
5 minutes
Flags
Custom build
Labels
pr_2689 Edit labels
Revision
589cf732021374e02c193bcc3d0f16429fd4ee67 589cf732021374e02c193bcc3d0f16429fd4ee67
Total tests
3397
Failing since
#21 (Rebuilt by Patrick Webster)

Responsible

This build has been failing since #21
No one has taken responsibility

Custom variables

Name Value
PRnumber 2689

Code commits

Author Commit Message Commit date
Marc Marc 589cf732021374e02c193bcc3d0f16429fd4ee67 589cf732021374e02c193bcc3d0f16429fd4ee67 Merge branch 'develop-ascraeus' into develop
Marc Marc 89557f5cac284e5b59eefdae1af496c7227aa408 m 89557f5cac284e5b59eefdae1af496c7227aa408 Merge remote-tracking branch 'VSE/ticket/12864' into develop-ascraeus
Joas Schilling <nickvergessen@gmx.de> Joas Schilling <nickvergessen@gmx.de> b9bb22e009907a2ee2914c24d3a51876f3649d25 b9bb22e009907a2ee2914c24d3a51876f3649d25 Merge branch 'develop-ascraeus' into develop
* develop-ascraeus:
  [ticket/12882] Use a new migration
  [ticket/12882] Update search_type when it's not prefixed by phpbb_search
Joas Schilling <nickvergessen@gmx.de> Joas Schilling <nickvergessen@gmx.de> f4fc1bde03f3026b80fcb9da2cd332ce57ba54a9 m f4fc1bde03f3026b80fcb9da2cd332ce57ba54a9 Merge pull request #2767 from Nicofuma/ticket/12882
[ticket/12882] Update search_type when it's not prefixed by phpbb_search

* Nicofuma/ticket/12882:
  [ticket/12882] Use a new migration
  [ticket/12882] Update search_type when it's not prefixed by phpbb_search
Joas Schilling <nickvergessen@gmx.de> Joas Schilling <nickvergessen@gmx.de> c068da7353b0d3dc0827a89ac01b274f9e6e7ce6 c068da7353b0d3dc0827a89ac01b274f9e6e7ce6 Merge branch 'develop-ascraeus' into develop
* develop-ascraeus:
  [ticket/12492] Add support of special chars

Tests

Existing test failures 200
Status Test Failing since View job Duration
phpbb_auth_provider_oauth_token_storage_test::test_hasAccessToken with data set #1 (OAuth\OAuth2\Token\StdOAuth2Token, true)
PHPUnit_Extensions_Database_Operation_Exception: COMPOSITE[INSERT] operation failed on query: 
                INSERT INTO phpbb_oauth_tokens
                (user_id, session_id, provider, oauth_token)
                VALUES
                (?, ?, ?, ?)
             using args: Array
(
(9 more lines...)
phpbb_auth_provider_oauth_token_storage_test::test_hasAccessToken with data set #0 (NULL, false)
PHPUnit_Extensions_Database_Operation_Exception: COMPOSITE[INSERT] operation failed on query: 
                INSERT INTO phpbb_oauth_tokens
                (user_id, session_id, provider, oauth_token)
                VALUES
                (?, ?, ?, ?)
             using args: Array
(
(9 more lines...)
phpbb_auth_provider_oauth_token_storage_test::test_clearToken
PHPUnit_Extensions_Database_Operation_Exception: COMPOSITE[INSERT] operation failed on query: 
                INSERT INTO phpbb_oauth_tokens
                (user_id, session_id, provider, oauth_token)
                VALUES
                (?, ?, ?, ?)
             using args: Array
(
(9 more lines...)
phpbb_auth_provider_oauth_token_storage_test::test_set_user_id
PHPUnit_Extensions_Database_Operation_Exception: COMPOSITE[INSERT] operation failed on query: 
                INSERT INTO phpbb_oauth_tokens
                (user_id, session_id, provider, oauth_token)
                VALUES
                (?, ?, ?, ?)
             using args: Array
(
(9 more lines...)
phpbb_auth_provider_oauth_token_storage_test::test_has_access_token_by_session with data set #0 (NULL, false)
PHPUnit_Extensions_Database_Operation_Exception: COMPOSITE[INSERT] operation failed on query: 
                INSERT INTO phpbb_oauth_tokens
                (user_id, session_id, provider, oauth_token)
                VALUES
                (?, ?, ?, ?)
             using args: Array
(
(9 more lines...)
phpbb_auth_provider_oauth_token_storage_test::test_has_access_token_by_session with data set #1 (OAuth\OAuth2\Token\StdOAuth2Token, true)
PHPUnit_Extensions_Database_Operation_Exception: COMPOSITE[INSERT] operation failed on query: 
                INSERT INTO phpbb_oauth_tokens
                (user_id, session_id, provider, oauth_token)
                VALUES
                (?, ?, ?, ?)
             using args: Array
(
(9 more lines...)
phpbb_auth_provider_oauth_token_storage_test::test_retrieveAccessToken_from_db
PHPUnit_Extensions_Database_Operation_Exception: COMPOSITE[INSERT] operation failed on query: 
                INSERT INTO phpbb_oauth_tokens
                (user_id, session_id, provider, oauth_token)
                VALUES
                (?, ?, ?, ?)
             using args: Array
(
(9 more lines...)
phpbb_auth_provider_oauth_token_storage_test::test_retrieveAccessToken with data set #1 (NULL, 'OAuth\\Common\\Storage\\Exception\\TokenNotFoundException')
PHPUnit_Extensions_Database_Operation_Exception: COMPOSITE[INSERT] operation failed on query: 
                INSERT INTO phpbb_oauth_tokens
                (user_id, session_id, provider, oauth_token)
                VALUES
                (?, ?, ?, ?)
             using args: Array
(
(9 more lines...)
phpbb_auth_provider_oauth_token_storage_test::test_retrieveAccessToken_wrong_token
PHPUnit_Extensions_Database_Operation_Exception: COMPOSITE[INSERT] operation failed on query: 
                INSERT INTO phpbb_oauth_tokens
                (user_id, session_id, provider, oauth_token)
                VALUES
                (?, ?, ?, ?)
             using args: Array
(
(9 more lines...)
phpbb_auth_provider_oauth_token_storage_test::test_retrieveAccessToken with data set #0 (OAuth\OAuth2\Token\StdOAuth2Token, NULL)
PHPUnit_Extensions_Database_Operation_Exception: COMPOSITE[INSERT] operation failed on query: 
                INSERT INTO phpbb_oauth_tokens
                (user_id, session_id, provider, oauth_token)
                VALUES
                (?, ?, ?, ?)
             using args: Array
(
(9 more lines...)
phpbb_auth_provider_oauth_token_storage_test::test_retrieve_access_token_by_session with data set #0 (OAuth\OAuth2\Token\StdOAuth2Token, NULL)
PHPUnit_Extensions_Database_Operation_Exception: COMPOSITE[INSERT] operation failed on query: 
                INSERT INTO phpbb_oauth_tokens
                (user_id, session_id, provider, oauth_token)
                VALUES
                (?, ?, ?, ?)
             using args: Array
(
(9 more lines...)
phpbb_auth_provider_oauth_token_storage_test::test_retrieve_access_token_by_session with data set #1 (NULL, 'OAuth\\Common\\Storage\\Exception\\TokenNotFoundException')
PHPUnit_Extensions_Database_Operation_Exception: COMPOSITE[INSERT] operation failed on query: 
                INSERT INTO phpbb_oauth_tokens
                (user_id, session_id, provider, oauth_token)
                VALUES
                (?, ?, ?, ?)
             using args: Array
(
(9 more lines...)
phpbb_auth_provider_oauth_token_storage_test::test_storeAccessToken
PHPUnit_Extensions_Database_Operation_Exception: COMPOSITE[INSERT] operation failed on query: 
                INSERT INTO phpbb_oauth_tokens
                (user_id, session_id, provider, oauth_token)
                VALUES
                (?, ?, ?, ?)
             using args: Array
(
(9 more lines...)
phpbb_auth_provider_oauth_token_storage_test::test_retrieve_access_token_by_session_from_db
PHPUnit_Extensions_Database_Operation_Exception: COMPOSITE[INSERT] operation failed on query: 
                INSERT INTO phpbb_oauth_tokens
                (user_id, session_id, provider, oauth_token)
                VALUES
                (?, ?, ?, ?)
             using args: Array
(
(9 more lines...)
phpbb_dbal_cross_join_test::test_cross_join
PHPUnit_Extensions_Database_Operation_Exception: COMPOSITE[INSERT] operation failed on query: 
                INSERT INTO phpbb_user_group
                (user_id, group_id)
                VALUES
                (?, ?)
             using args: Array
(
(6 more lines...)
phpbb_dbal_db_tools_test::test_column_remove_primary
SQL ERROR [ mssqlnative ]<br /><br />SQLSTATE: 42000
code: 3723
message: [Microsoft][SQL Server Native Client 11.0][SQL Server]An explicit DROP INDEX is not allowed on index 'prefix_table_name.PK_prefix_table_name'. It is being used for PRIMARY KEY constraint enforcement.
 [3723]<br /><br />An sql error occurred while fetching this page. Please contact an administrator if this problem persists.

C:\Users\Administrator\bamboo-agent-home\xml-data\build-dir\PHPBB3-MSSQLNATIVE-BUILD\phpBB\phpbb\db\driver\driver.php:844
C:\Users\Administrator\bamboo-agent-home\xml-data\build-dir\PHPBB3-MSSQLNATIVE-BUILD\phpBB\phpbb\db\driver\mssqlnative.php:143
(3 more lines...)
phpbb_dbal_db_tools_test::test_created_column with data set #16 ('c_stext_uni', 'ÄÄÄÄÄÄÄÄÄÄÄÄÄÄÄÄÄÄÄÄÄÄÄÄÄÄÄÄÄÄÄÄÄÄÄÄÄÄÄÄÄÄÄÄÄÄÄÄÄÄÄÄÄÄÄÄÄÄÄÄÄÄÄÄÄÄÄÄÄÄÄÄÄÄÄÄÄÄÄÄÄÄÄÄÄÄÄÄÄÄÄÄÄÄÄÄÄÄÄÄÄÄÄÄÄÄÄÄÄÄÄÄÄÄÄÄÄÄÄÄÄÄÄÄÄÄÄÄÄÄÄÄÄÄÄÄÄÄÄÄÄÄÄÄÄÄÄÄÄÄÄÄÄÄÄÄÄÄÄÄÄÄÄÄÄÄÄÄÄÄÄÄÄÄÄÄÄÄÄÄÄÄÄÄÄÄÄÄÄÄÄÄÄÄÄÄÄÄÄÄÄÄÄÄÄÄÄÄÄÄÄÄÄÄÄÄÄÄÄÄÄÄÄÄÄÄÄÄÄÄÄÄÄÄÄÄÄÄÄÄÄÄÄÄÄÄÄÄÄÄÄÄÄÄÄ')
SQL ERROR [ mssqlnative ]<br /><br />SQLSTATE: 22001
code: 8152
message: [Microsoft][SQL Server Native Client 11.0][SQL Server]String or binary data would be truncated.
SQLSTATE: 01000
code: 3621
message: [Microsoft][SQL Server Native Client 11.0][SQL Server]The statement has been terminated.
 [3621]<br /><br />An sql error occurred while fetching this page. Please contact an administrator if this problem persists.
(4 more lines...)
phpbb_dbal_db_tools_test::test_created_column with data set #15 ('c_xstext_uni', 'ÄÄÄÄÄÄÄÄÄÄÄÄÄÄÄÄÄÄÄÄÄÄÄÄÄÄÄÄÄÄÄÄÄÄÄÄÄÄÄÄÄÄÄÄÄÄÄÄÄÄÄÄÄÄÄÄÄÄÄÄÄÄÄÄÄÄÄÄÄÄÄÄÄÄÄÄÄÄÄÄÄÄÄÄÄÄÄÄÄÄÄÄÄÄÄÄÄÄÄÄ')
SQL ERROR [ mssqlnative ]<br /><br />SQLSTATE: 22001
code: 8152
message: [Microsoft][SQL Server Native Client 11.0][SQL Server]String or binary data would be truncated.
SQLSTATE: 01000
code: 3621
message: [Microsoft][SQL Server Native Client 11.0][SQL Server]The statement has been terminated.
 [3621]<br /><br />An sql error occurred while fetching this page. Please contact an administrator if this problem persists.
(4 more lines...)
phpbb_dbal_db_tools_test::test_created_column with data set #17 ('c_text_uni', 'ÄÄÄÄÄÄÄÄÄÄÄÄÄÄÄÄÄÄÄÄÄÄÄÄÄÄÄÄÄÄÄÄÄÄÄÄÄÄÄÄÄÄÄÄÄÄÄÄÄÄÄÄÄÄÄÄÄÄÄÄÄÄÄÄÄÄÄÄÄÄÄÄÄÄÄÄÄÄÄÄÄÄÄÄÄÄÄÄÄÄÄÄÄÄÄÄÄÄÄÄÄÄÄÄÄÄÄÄÄÄÄÄÄÄÄÄÄÄÄÄÄÄÄÄÄÄÄÄÄÄÄÄÄÄÄÄÄÄÄÄÄÄÄÄÄÄÄÄÄÄÄÄÄÄÄÄÄÄÄÄÄÄÄÄÄÄÄÄÄÄÄÄÄÄÄÄÄÄÄÄÄÄÄÄÄÄÄÄÄÄÄÄÄÄÄÄÄÄÄÄÄÄÄÄÄÄÄÄÄÄÄÄÄÄÄÄÄÄÄÄÄÄÄÄÄÄÄÄÄÄÄÄÄÄÄÄÄÄÄÄÄÄÄÄÄÄÄÄÄÄÄÄÄÄÄÄÄÄÄÄÄÄÄÄÄÄÄÄÄÄÄÄÄÄÄÄÄÄÄÄÄÄÄÄÄÄÄÄÄÄÄÄÄÄÄÄÄÄÄÄÄÄÄÄÄÄÄÄÄÄÄÄÄÄÄÄÄÄÄÄÄÄÄÄÄÄÄÄÄÄÄÄÄÄÄÄÄÄÄÄÄÄÄÄÄÄÄÄÄÄÄÄÄÄÄÄÄÄÄÄÄÄÄÄÄÄÄÄÄÄÄÄÄÄÄÄÄÄÄÄÄÄÄÄÄÄÄÄÄÄÄÄÄÄÄÄÄÄÄÄÄÄÄÄÄÄÄÄÄÄÄÄÄÄÄÄÄÄÄÄÄÄÄÄÄÄÄÄÄÄÄÄÄÄÄÄÄÄÄÄÄÄÄÄÄÄÄÄÄÄÄÄÄÄÄÄÄÄÄÄÄÄÄÄÄÄÄÄÄÄÄÄÄÄÄÄÄÄÄÄÄÄÄÄÄÄÄÄÄÄÄÄÄÄÄÄÄÄÄÄÄÄÄÄÄÄÄÄÄÄÄÄÄÄÄÄÄÄÄÄÄÄÄÄÄÄÄÄÄÄÄÄÄÄÄÄÄÄÄÄÄÄÄÄÄÄÄÄÄÄÄÄÄÄÄÄÄÄÄÄÄÄÄÄÄÄÄÄÄÄÄÄÄÄÄÄÄÄÄÄÄÄÄÄÄÄÄÄÄÄÄÄÄÄÄÄÄÄÄÄÄÄÄÄÄÄÄÄÄÄÄÄÄÄÄÄÄÄÄÄÄÄÄÄÄÄÄÄÄÄÄÄÄÄÄÄÄÄÄÄÄÄÄÄÄÄÄÄÄÄÄÄÄÄÄÄÄÄÄÄÄÄÄÄÄÄÄÄÄÄÄÄÄÄÄÄÄÄÄÄÄÄÄÄÄÄÄÄÄÄÄÄÄÄÄÄÄÄÄÄÄÄÄÄÄÄÄÄÄÄÄÄÄÄÄÄÄÄÄÄÄÄÄÄÄÄÄÄÄÄÄÄÄÄÄÄÄÄÄÄÄÄÄÄÄÄÄÄÄÄÄÄÄÄÄÄÄÄÄÄÄÄÄÄÄÄÄÄÄÄÄÄÄÄÄÄÄÄÄÄÄÄÄÄÄÄÄÄÄÄÄÄÄÄÄÄÄÄÄÄÄÄÄÄÄÄÄÄÄÄÄÄÄÄÄÄÄÄÄÄÄÄÄÄÄÄÄÄÄÄÄÄÄÄÄÄÄÄÄÄÄÄÄÄÄÄÄÄÄÄÄÄÄÄÄÄÄÄÄÄÄÄÄÄÄÄÄÄÄÄÄÄÄÄÄÄÄÄÄÄÄÄÄÄÄÄÄÄÄÄÄÄÄÄÄÄÄÄÄÄÄÄÄÄÄÄÄÄÄÄÄÄÄÄÄÄÄÄÄÄÄÄÄÄÄÄÄÄÄÄÄÄÄÄÄÄÄÄÄÄÄÄÄÄÄÄÄÄÄÄÄÄÄÄÄÄÄÄÄÄÄÄÄÄÄÄÄÄÄÄÄÄÄÄÄÄÄÄÄÄÄÄÄÄÄÄÄÄÄÄÄÄÄÄÄÄÄÄÄÄÄÄÄÄÄÄÄÄÄÄÄÄÄÄÄÄÄÄÄÄÄÄÄÄÄÄÄÄÄÄÄÄÄÄÄÄÄÄÄÄÄÄÄÄÄÄÄÄÄÄÄÄÄÄÄÄÄÄÄÄÄÄÄÄÄÄÄÄÄÄÄÄÄÄÄÄÄÄÄÄÄÄÄÄÄÄÄÄÄÄÄÄÄÄÄÄÄÄÄÄÄÄÄÄÄÄÄÄÄÄÄÄÄÄÄÄÄÄÄÄÄÄÄÄÄÄÄÄÄÄÄÄÄÄÄÄÄÄÄÄÄÄÄÄÄÄÄÄÄÄÄÄÄÄÄÄÄÄÄÄÄÄÄÄÄÄÄÄÄÄÄÄÄÄÄÄÄÄÄÄÄÄÄÄÄÄÄÄÄÄÄÄÄÄÄÄÄÄÄÄÄÄÄÄÄÄÄÄÄÄÄÄÄÄÄÄÄÄÄÄÄÄÄÄÄÄÄÄÄÄÄÄÄÄÄÄÄÄÄÄÄÄÄÄÄÄÄÄÄÄÄÄÄÄÄÄÄÄÄÄÄÄÄÄÄÄÄÄÄÄÄÄÄÄÄÄÄÄÄÄÄÄÄÄÄÄÄÄÄÄÄÄÄÄÄÄÄÄÄÄÄÄÄÄÄÄÄÄÄÄÄÄÄÄÄÄÄÄÄÄÄÄÄÄÄÄÄÄÄÄÄÄÄÄÄÄÄÄÄÄÄÄÄÄÄÄÄÄÄÄÄÄÄÄÄÄÄÄÄÄÄÄÄÄÄÄÄÄÄÄÄÄÄÄÄÄÄÄÄÄÄÄÄÄÄÄÄÄÄÄÄÄÄÄÄÄÄÄÄÄÄÄÄÄÄÄÄÄÄÄÄÄÄÄÄÄÄÄÄÄÄÄÄÄÄÄÄÄÄÄÄÄÄÄÄÄÄÄÄÄÄÄÄÄÄÄÄÄÄÄÄÄÄÄÄÄÄÄÄÄÄÄÄÄÄÄÄÄÄÄÄÄÄÄÄÄÄÄÄÄÄÄÄÄÄÄÄÄÄÄÄÄÄÄÄÄÄÄÄÄÄÄÄÄÄÄÄÄÄÄÄÄÄÄÄÄÄÄÄÄÄÄÄÄÄÄÄÄÄÄÄÄÄÄÄÄÄÄÄÄÄÄÄÄÄÄÄÄÄÄÄÄÄÄÄÄÄÄÄÄÄÄÄÄÄÄÄÄÄÄÄÄÄÄÄÄÄÄÄÄÄÄÄÄÄÄÄÄÄÄÄÄÄÄÄÄÄÄÄÄÄÄÄÄÄÄÄÄÄÄÄÄÄÄÄÄÄÄÄÄÄÄÄÄÄÄÄÄÄÄÄÄÄÄÄÄÄÄÄÄÄÄÄÄÄÄÄÄÄÄÄÄÄÄÄÄÄÄÄÄÄÄÄÄÄÄÄÄÄÄÄÄÄÄÄÄÄÄÄÄÄÄÄÄÄÄÄÄÄÄÄÄÄÄÄÄÄÄÄÄÄÄÄÄÄÄÄÄÄÄÄÄÄÄÄÄÄÄÄÄÄÄÄÄÄÄÄÄÄÄÄÄÄÄÄÄÄÄÄÄÄÄÄÄÄÄÄÄÄÄÄÄÄÄÄÄÄÄÄÄÄÄÄÄÄÄÄÄÄÄÄÄÄÄÄÄÄÄÄÄÄÄÄÄÄÄÄÄÄÄÄÄÄÄÄÄÄÄÄÄÄÄÄÄÄÄÄÄÄÄÄÄÄÄÄÄÄÄÄÄÄÄÄÄÄÄÄÄÄÄÄÄÄÄÄÄÄÄÄÄÄÄÄÄÄÄÄÄÄÄÄÄÄÄÄÄÄÄÄÄÄÄÄÄÄÄÄÄÄÄÄÄÄÄÄÄÄÄÄÄÄÄÄÄÄÄÄÄÄÄÄÄÄÄÄÄÄÄÄÄÄÄÄÄÄÄÄÄÄÄÄÄÄÄÄÄÄÄÄÄÄÄÄÄÄÄÄÄÄÄÄÄÄÄÄÄÄÄÄÄÄÄÄÄÄÄÄÄÄÄÄÄÄÄÄÄÄÄÄÄÄÄÄÄÄÄÄÄÄÄÄÄÄÄÄÄÄÄÄÄÄÄÄÄÄÄÄÄÄÄÄÄÄÄÄÄÄÄÄÄÄÄÄÄÄÄÄÄÄÄÄÄÄÄÄÄÄÄÄÄÄÄÄÄÄÄÄÄÄÄÄÄÄÄÄÄÄÄÄÄÄÄÄÄÄÄÄÄÄÄÄÄÄÄÄÄÄÄÄÄÄÄÄÄÄÄÄÄÄÄÄÄÄÄÄÄÄÄÄÄÄÄÄÄÄÄÄÄÄÄÄÄÄÄÄÄÄÄÄÄÄÄÄÄÄÄÄÄÄÄÄÄÄÄÄÄÄÄÄÄÄÄÄÄÄÄÄÄÄÄÄÄÄÄÄÄÄÄÄÄÄÄÄÄÄÄÄÄÄÄÄÄÄÄÄÄÄÄÄÄÄÄÄÄÄÄÄÄÄÄÄÄÄÄÄÄÄÄÄÄÄÄÄÄÄÄÄÄÄÄÄÄÄÄÄÄÄÄÄÄÄÄÄÄÄÄÄÄÄÄÄÄÄÄÄÄÄÄÄÄÄÄÄÄÄÄÄÄÄÄÄÄÄÄÄÄÄÄÄÄÄÄÄÄÄÄÄÄÄÄÄÄÄÄÄÄÄÄÄÄÄÄÄÄÄÄÄÄÄÄÄÄÄÄÄÄÄÄÄÄÄÄÄÄÄÄÄÄÄÄÄÄÄÄÄÄÄÄÄÄÄÄÄÄÄÄÄÄÄÄÄÄÄÄÄÄÄÄÄÄÄÄÄÄÄÄÄÄÄÄÄÄÄÄÄÄÄÄÄÄÄÄÄÄÄÄÄÄÄÄÄÄÄÄÄÄÄÄÄÄÄÄÄÄÄÄÄÄÄÄÄÄÄÄÄÄÄÄÄÄÄÄÄÄÄÄÄÄÄÄÄÄÄÄÄÄÄÄÄÄÄÄÄÄÄÄÄÄÄÄÄÄÄÄÄÄÄÄÄÄÄÄÄÄÄÄÄÄÄÄÄÄÄÄÄÄÄÄÄÄÄÄÄÄÄÄÄÄÄÄÄÄÄÄÄÄÄÄÄÄÄÄÄÄÄÄÄÄÄÄÄÄÄÄÄÄÄÄÄÄÄÄÄÄÄÄÄÄÄÄÄÄÄÄÄÄÄÄÄÄÄÄÄÄÄÄÄÄÄÄÄÄÄÄÄÄÄÄÄÄÄÄÄÄÄÄÄÄÄÄÄÄÄÄÄÄÄÄÄÄÄÄÄÄÄÄÄÄÄÄÄÄÄÄÄÄÄÄÄÄÄÄÄÄÄÄÄÄÄÄÄÄÄÄÄÄÄÄÄÄÄÄÄÄÄÄÄÄÄÄÄÄÄÄÄÄÄÄÄÄÄÄÄÄÄÄÄÄÄÄÄÄÄÄÄÄÄÄÄÄÄÄÄÄÄÄÄÄÄÄÄÄÄÄÄÄÄÄÄÄÄÄÄÄÄÄÄÄÄÄÄÄÄÄÄÄÄÄÄÄÄÄÄÄÄÄÄÄÄÄÄÄÄÄÄÄÄÄÄÄÄÄÄÄÄÄÄÄÄÄÄÄÄÄÄÄÄÄÄÄÄÄÄÄÄÄÄÄÄÄÄÄÄÄÄÄÄÄÄÄÄÄÄÄÄÄÄÄÄÄÄÄÄÄÄÄÄÄÄÄÄÄÄÄÄÄÄÄÄÄÄÄÄÄÄÄÄÄÄÄÄÄÄÄÄÄÄÄÄÄÄÄÄÄÄÄÄÄÄÄÄÄÄÄÄÄÄÄÄÄÄÄÄÄÄÄÄÄÄÄÄÄÄÄÄÄÄÄÄÄÄÄÄÄÄÄÄÄÄÄÄÄÄÄÄÄÄÄÄÄÄÄÄÄÄÄÄÄÄÄÄÄÄÄÄÄÄÄÄÄÄÄÄÄÄÄÄÄÄÄÄÄÄÄÄÄÄÄÄÄÄÄÄÄÄÄÄÄÄÄÄÄÄÄÄÄÄÄÄÄÄÄÄÄÄÄÄÄÄÄÄÄÄÄÄÄÄÄÄÄÄÄÄÄÄÄÄÄÄÄÄÄÄÄÄÄÄÄÄÄÄÄÄÄÄÄÄÄÄÄÄÄÄÄÄÄÄÄÄÄÄÄÄÄÄÄÄÄÄÄÄÄÄÄÄÄÄÄÄÄÄÄÄÄÄÄÄÄÄÄÄÄÄÄÄÄÄÄÄÄÄÄÄÄÄÄÄÄÄÄÄÄÄÄÄÄÄÄÄÄÄÄÄÄÄÄÄÄÄÄÄÄÄÄÄÄÄÄÄÄÄÄÄÄÄÄÄÄÄÄÄÄÄÄÄÄÄÄÄÄÄÄÄÄÄÄÄÄÄÄÄÄÄÄÄÄÄÄÄÄÄÄÄÄÄÄÄÄÄÄÄÄÄÄÄÄÄÄÄÄÄÄÄÄÄÄÄÄÄÄÄÄÄÄÄÄÄÄÄÄÄÄÄÄÄÄÄÄÄÄÄÄÄÄÄÄÄÄÄÄÄÄÄÄÄÄÄÄÄÄÄÄÄÄÄÄÄÄÄÄÄÄÄÄÄÄÄÄÄÄÄÄÄÄÄÄÄÄÄÄÄÄÄÄÄÄÄÄÄÄÄÄÄÄÄÄÄÄÄÄÄÄÄÄÄÄÄÄÄÄÄÄÄÄÄÄÄÄÄÄÄÄÄÄÄÄÄÄÄÄÄÄÄÄÄÄÄÄÄÄÄÄÄÄÄÄÄÄÄÄÄÄÄÄÄÄÄÄÄÄÄÄÄÄÄÄÄÄÄÄÄÄÄÄÄÄÄÄÄÄÄÄÄÄÄÄÄÄÄÄÄÄÄÄÄÄÄÄÄÄÄÄÄÄÄÄÄÄÄÄÄÄÄÄÄÄÄÄÄÄÄÄÄÄÄÄÄÄÄÄÄÄÄÄÄÄÄÄÄÄÄÄÄÄÄÄÄÄÄÄÄÄÄÄÄÄÄÄÄÄÄÄÄÄÄÄÄÄÄÄÄÄÄÄÄÄÄÄÄÄÄÄÄÄÄÄÄÄÄÄÄÄÄÄÄÄÄÄÄÄÄÄÄÄÄÄÄÄÄÄÄÄÄÄÄÄÄÄÄÄÄÄÄÄÄÄÄÄÄÄÄÄÄÄÄÄÄÄÄÄÄÄÄÄÄÄÄÄÄÄÄÄÄÄÄÄÄÄÄÄÄÄÄÄÄÄÄÄÄÄÄÄÄÄÄÄÄÄÄÄÄÄÄÄÄÄÄÄÄÄÄÄÄÄÄÄÄÄÄÄÄÄÄÄÄÄÄÄÄÄÄÄÄÄÄÄÄÄÄÄÄÄÄÄÄÄÄÄÄÄÄÄÄÄÄÄÄÄÄÄÄÄÄÄÄÄÄÄÄÄÄÄÄÄÄÄÄÄÄÄÄÄÄÄÄÄÄÄÄÄÄÄÄÄÄÄÄÄÄÄÄÄÄÄÄÄÄÄÄÄÄÄÄÄÄÄÄÄÄÄÄÄÄÄÄÄÄÄÄÄÄÄÄÄÄÄÄÄÄÄÄÄÄÄÄÄÄÄÄÄÄÄÄÄÄÄÄÄÄÄÄÄÄÄÄÄÄÄÄÄÄÄÄÄÄÄÄÄÄÄÄÄÄÄÄÄÄÄÄÄÄÄÄÄÄÄÄÄÄÄÄÄÄÄÄÄÄÄÄÄÄÄÄÄÄÄÄÄÄÄÄÄÄÄÄÄÄÄÄÄÄÄÄÄÄÄÄÄÄÄÄÄÄÄÄÄÄÄÄÄÄÄÄÄÄÄÄÄÄÄÄÄÄÄÄÄÄÄÄÄÄÄÄÄÄÄÄÄÄÄÄÄÄÄÄÄÄÄÄÄÄÄÄÄÄÄÄÄÄÄÄÄÄÄÄÄÄÄÄÄÄÄÄÄÄÄÄÄÄÄÄÄÄÄÄÄÄÄÄÄÄÄÄÄÄÄÄÄÄÄÄÄÄÄÄÄÄÄÄÄÄÄÄÄÄÄÄÄÄÄÄÄÄÄÄÄÄÄÄÄÄÄÄÄÄÄÄÄÄÄÄÄÄÄÄÄÄÄÄÄÄÄÄÄÄÄÄÄÄÄÄÄÄÄÄÄÄÄÄÄÄÄÄÄÄÄÄÄÄÄÄÄÄÄÄÄÄÄÄÄÄÄÄÄÄÄÄÄÄÄÄÄÄÄÄÄÄÄÄÄÄÄÄÄÄÄÄÄÄÄÄÄÄÄÄÄÄÄÄÄÄÄÄÄÄÄÄÄÄÄÄÄÄÄÄÄÄÄÄÄÄÄÄÄÄÄÄÄÄÄÄÄÄÄÄÄÄÄÄÄÄÄÄÄÄÄÄÄÄÄÄÄÄÄÄÄÄÄÄÄ')
SQL ERROR [ mssqlnative ]<br /><br />SQLSTATE: 22001
code: 8152
message: [Microsoft][SQL Server Native Client 11.0][SQL Server]String or binary data would be truncated.
SQLSTATE: 01000
code: 3621
message: [Microsoft][SQL Server Native Client 11.0][SQL Server]The statement has been terminated.
 [3621]<br /><br />An sql error occurred while fetching this page. Please contact an administrator if this problem persists.
(4 more lines...)
phpbb_dbal_db_tools_test::test_created_column with data set #26 ('c_vchar_ci', 'ÄÄÄÄÄÄÄÄÄÄÄÄÄÄÄÄÄÄÄÄÄÄÄÄÄÄÄÄÄÄÄÄÄÄÄÄÄÄÄÄÄÄÄÄÄÄÄÄÄÄÄÄÄÄÄÄÄÄÄÄÄÄÄÄÄÄÄÄÄÄÄÄÄÄÄÄÄÄÄÄÄÄÄÄÄÄÄÄÄÄÄÄÄÄÄÄÄÄÄÄÄÄÄÄÄÄÄÄÄÄÄÄÄÄÄÄÄÄÄÄÄÄÄÄÄÄÄÄÄÄÄÄÄÄÄÄÄÄÄÄÄÄÄÄÄÄÄÄÄÄÄÄÄÄÄÄÄÄÄÄÄÄÄÄÄÄÄÄÄÄÄÄÄÄÄÄÄÄÄÄÄÄÄÄÄÄÄÄÄÄÄÄÄÄÄÄÄÄÄÄÄÄÄÄÄÄÄÄÄÄÄÄÄÄÄÄÄÄÄÄÄÄÄÄÄÄÄÄÄÄÄÄÄÄÄÄÄÄÄÄÄÄÄÄÄÄÄÄÄÄÄÄÄÄÄ')
SQL ERROR [ mssqlnative ]<br /><br />SQLSTATE: 22001
code: 8152
message: [Microsoft][SQL Server Native Client 11.0][SQL Server]String or binary data would be truncated.
SQLSTATE: 01000
code: 3621
message: [Microsoft][SQL Server Native Client 11.0][SQL Server]The statement has been terminated.
 [3621]<br /><br />An sql error occurred while fetching this page. Please contact an administrator if this problem persists.
(4 more lines...)
phpbb_dbal_db_tools_test::test_created_column with data set #25 ('c_vchar_uni_size', 'ÄÄÄÄ')
SQL ERROR [ mssqlnative ]<br /><br />SQLSTATE: 22001
code: 8152
message: [Microsoft][SQL Server Native Client 11.0][SQL Server]String or binary data would be truncated.
SQLSTATE: 01000
code: 3621
message: [Microsoft][SQL Server Native Client 11.0][SQL Server]The statement has been terminated.
 [3621]<br /><br />An sql error occurred while fetching this page. Please contact an administrator if this problem persists.
(4 more lines...)
phpbb_dbal_db_tools_test::test_created_column with data set #24 ('c_vchar_uni', 'ÄÄÄÄÄÄÄÄÄÄÄÄÄÄÄÄÄÄÄÄÄÄÄÄÄÄÄÄÄÄÄÄÄÄÄÄÄÄÄÄÄÄÄÄÄÄÄÄÄÄÄÄÄÄÄÄÄÄÄÄÄÄÄÄÄÄÄÄÄÄÄÄÄÄÄÄÄÄÄÄÄÄÄÄÄÄÄÄÄÄÄÄÄÄÄÄÄÄÄÄÄÄÄÄÄÄÄÄÄÄÄÄÄÄÄÄÄÄÄÄÄÄÄÄÄÄÄÄÄÄÄÄÄÄÄÄÄÄÄÄÄÄÄÄÄÄÄÄÄÄÄÄÄÄÄÄÄÄÄÄÄÄÄÄÄÄÄÄÄÄÄÄÄÄÄÄÄÄÄÄÄÄÄÄÄÄÄÄÄÄÄÄÄÄÄÄÄÄÄÄÄÄÄÄÄÄÄÄÄÄÄÄÄÄÄÄÄÄÄÄÄÄÄÄÄÄÄÄÄÄÄÄÄÄÄÄÄÄÄÄÄÄÄÄÄÄÄÄÄÄÄÄÄÄÄ')
SQL ERROR [ mssqlnative ]<br /><br />SQLSTATE: 22001
code: 8152
message: [Microsoft][SQL Server Native Client 11.0][SQL Server]String or binary data would be truncated.
SQLSTATE: 01000
code: 3621
message: [Microsoft][SQL Server Native Client 11.0][SQL Server]The statement has been terminated.
 [3621]<br /><br />An sql error occurred while fetching this page. Please contact an administrator if this problem persists.
(4 more lines...)
phpbb_dbal_db_tools_test::test_column_change_with_composite_primary
SQL ERROR [ mssqlnative ]<br /><br />SQLSTATE: 42000
code: 3723
message: [Microsoft][SQL Server Native Client 11.0][SQL Server]An explicit DROP INDEX is not allowed on index 'prefix_table_name.PK_prefix_table_name'. It is being used for PRIMARY KEY constraint enforcement.
 [3723]<br /><br />An sql error occurred while fetching this page. Please contact an administrator if this problem persists.

C:\Users\Administrator\bamboo-agent-home\xml-data\build-dir\PHPBB3-MSSQLNATIVE-BUILD\phpBB\phpbb\db\driver\driver.php:844
C:\Users\Administrator\bamboo-agent-home\xml-data\build-dir\PHPBB3-MSSQLNATIVE-BUILD\phpBB\phpbb\db\driver\mssqlnative.php:143
(3 more lines...)
phpbb_dbal_db_tools_test::test_list_columns
Failed asserting that two arrays are equal.
--- Expected
+++ Actual
@@ @@
 Array (
-    0 => 'c_id'
-    1 => 'c_int_size'
(57 more lines...)
phpbb_dbal_schema_test::test_config_value_multibyte
SQL ERROR [ mssqlnative ]<br /><br />SQLSTATE: 22001
code: 8152
message: [Microsoft][SQL Server Native Client 11.0][SQL Server]String or binary data would be truncated.
SQLSTATE: 01000
code: 3621
message: [Microsoft][SQL Server Native Client 11.0][SQL Server]The statement has been terminated.
 [3621]<br /><br />An sql error occurred while fetching this page. Please contact an administrator if this problem persists.
(4 more lines...)
phpbb_extension_manager_test::test_disable
PHPUnit_Extensions_Database_Operation_Exception: COMPOSITE[INSERT] operation failed on query: 
                INSERT INTO phpbb_ext
                (ext_name, ext_active, ext_state)
                VALUES
                (?, ?, ?)
             using args: Array
(
(8 more lines...)
phpbb_extension_manager_test::test_all_available
PHPUnit_Extensions_Database_Operation_Exception: COMPOSITE[INSERT] operation failed on query: 
                INSERT INTO phpbb_ext
                (ext_name, ext_active, ext_state)
                VALUES
                (?, ?, ?)
             using args: Array
(
(8 more lines...)
phpbb_extension_manager_test::test_all_enabled
PHPUnit_Extensions_Database_Operation_Exception: COMPOSITE[INSERT] operation failed on query: 
                INSERT INTO phpbb_ext
                (ext_name, ext_active, ext_state)
                VALUES
                (?, ?, ?)
             using args: Array
(
(8 more lines...)
phpbb_extension_manager_test::test_is_available
PHPUnit_Extensions_Database_Operation_Exception: COMPOSITE[INSERT] operation failed on query: 
                INSERT INTO phpbb_ext
                (ext_name, ext_active, ext_state)
                VALUES
                (?, ?, ?)
             using args: Array
(
(8 more lines...)
phpbb_extension_manager_test::test_is_purged
PHPUnit_Extensions_Database_Operation_Exception: COMPOSITE[INSERT] operation failed on query: 
                INSERT INTO phpbb_ext
                (ext_name, ext_active, ext_state)
                VALUES
                (?, ?, ?)
             using args: Array
(
(8 more lines...)
phpbb_extension_manager_test::test_enable
PHPUnit_Extensions_Database_Operation_Exception: COMPOSITE[INSERT] operation failed on query: 
                INSERT INTO phpbb_ext
                (ext_name, ext_active, ext_state)
                VALUES
                (?, ?, ?)
             using args: Array
(
(8 more lines...)
phpbb_extension_manager_test::test_is_configured
PHPUnit_Extensions_Database_Operation_Exception: COMPOSITE[INSERT] operation failed on query: 
                INSERT INTO phpbb_ext
                (ext_name, ext_active, ext_state)
                VALUES
                (?, ?, ?)
             using args: Array
(
(8 more lines...)
phpbb_extension_manager_test::test_purge
PHPUnit_Extensions_Database_Operation_Exception: COMPOSITE[INSERT] operation failed on query: 
                INSERT INTO phpbb_ext
                (ext_name, ext_active, ext_state)
                VALUES
                (?, ?, ?)
             using args: Array
(
(8 more lines...)
phpbb_extension_manager_test::test_is_disabled
PHPUnit_Extensions_Database_Operation_Exception: COMPOSITE[INSERT] operation failed on query: 
                INSERT INTO phpbb_ext
                (ext_name, ext_active, ext_state)
                VALUES
                (?, ?, ?)
             using args: Array
(
(8 more lines...)
phpbb_extension_manager_test::test_is_enabled
PHPUnit_Extensions_Database_Operation_Exception: COMPOSITE[INSERT] operation failed on query: 
                INSERT INTO phpbb_ext
                (ext_name, ext_active, ext_state)
                VALUES
                (?, ?, ?)
             using args: Array
(
(8 more lines...)
phpbb_extension_manager_test::test_enabled_no_cache
PHPUnit_Extensions_Database_Operation_Exception: COMPOSITE[INSERT] operation failed on query: 
                INSERT INTO phpbb_ext
                (ext_name, ext_active, ext_state)
                VALUES
                (?, ?, ?)
             using args: Array
(
(8 more lines...)
phpbb_extension_manager_test::test_all_configured
PHPUnit_Extensions_Database_Operation_Exception: COMPOSITE[INSERT] operation failed on query: 
                INSERT INTO phpbb_ext
                (ext_name, ext_active, ext_state)
                VALUES
                (?, ?, ?)
             using args: Array
(
(8 more lines...)
phpbb_extension_metadata_manager_test::test_foo
PHPUnit_Extensions_Database_Operation_Exception: COMPOSITE[INSERT] operation failed on query: 
                INSERT INTO phpbb_ext
                (ext_name, ext_active, ext_state)
                VALUES
                (?, ?, ?)
             using args: Array
(
(8 more lines...)
phpbb_extension_metadata_manager_test::test_bar
PHPUnit_Extensions_Database_Operation_Exception: COMPOSITE[INSERT] operation failed on query: 
                INSERT INTO phpbb_ext
                (ext_name, ext_active, ext_state)
                VALUES
                (?, ?, ?)
             using args: Array
(
(8 more lines...)
phpbb_extension_metadata_manager_test::test_validator_valid
PHPUnit_Extensions_Database_Operation_Exception: COMPOSITE[INSERT] operation failed on query: 
                INSERT INTO phpbb_ext
                (ext_name, ext_active, ext_state)
                VALUES
                (?, ?, ?)
             using args: Array
(
(8 more lines...)
phpbb_extension_metadata_manager_test::test_validator_invalid with data set #1 ('type', 'asdf')
PHPUnit_Extensions_Database_Operation_Exception: COMPOSITE[INSERT] operation failed on query: 
                INSERT INTO phpbb_ext
                (ext_name, ext_active, ext_state)
                VALUES
                (?, ?, ?)
             using args: Array
(
(8 more lines...)
phpbb_extension_metadata_manager_test::test_validator_invalid with data set #2 ('license', '')
PHPUnit_Extensions_Database_Operation_Exception: COMPOSITE[INSERT] operation failed on query: 
                INSERT INTO phpbb_ext
                (ext_name, ext_active, ext_state)
                VALUES
                (?, ?, ?)
             using args: Array
(
(8 more lines...)
phpbb_extension_metadata_manager_test::test_validator_invalid with data set #0 ('name', 'asdf')
PHPUnit_Extensions_Database_Operation_Exception: COMPOSITE[INSERT] operation failed on query: 
                INSERT INTO phpbb_ext
                (ext_name, ext_active, ext_state)
                VALUES
                (?, ?, ?)
             using args: Array
(
(8 more lines...)
phpbb_extension_metadata_manager_test::test_validator_invalid with data set #3 ('version', '')
PHPUnit_Extensions_Database_Operation_Exception: COMPOSITE[INSERT] operation failed on query: 
                INSERT INTO phpbb_ext
                (ext_name, ext_active, ext_state)
                VALUES
                (?, ?, ?)
             using args: Array
(
(8 more lines...)
phpbb_extension_metadata_manager_test::test_validator_non_existing with data set #0 ('name')
PHPUnit_Extensions_Database_Operation_Exception: COMPOSITE[INSERT] operation failed on query: 
                INSERT INTO phpbb_ext
                (ext_name, ext_active, ext_state)
                VALUES
                (?, ?, ?)
             using args: Array
(
(8 more lines...)
phpbb_extension_metadata_manager_test::test_validator_non_existing with data set #2 ('license')
PHPUnit_Extensions_Database_Operation_Exception: COMPOSITE[INSERT] operation failed on query: 
                INSERT INTO phpbb_ext
                (ext_name, ext_active, ext_state)
                VALUES
                (?, ?, ?)
             using args: Array
(
(8 more lines...)
phpbb_extension_metadata_manager_test::test_validator_non_existing with data set #1 ('type')
PHPUnit_Extensions_Database_Operation_Exception: COMPOSITE[INSERT] operation failed on query: 
                INSERT INTO phpbb_ext
                (ext_name, ext_active, ext_state)
                VALUES
                (?, ?, ?)
             using args: Array
(
(8 more lines...)
phpbb_extension_metadata_manager_test::test_validator_non_existing with data set #3 ('version')
PHPUnit_Extensions_Database_Operation_Exception: COMPOSITE[INSERT] operation failed on query: 
                INSERT INTO phpbb_ext
                (ext_name, ext_active, ext_state)
                VALUES
                (?, ?, ?)
             using args: Array
(
(8 more lines...)
phpbb_extension_metadata_manager_test::test_validator_non_existing_authors
PHPUnit_Extensions_Database_Operation_Exception: COMPOSITE[INSERT] operation failed on query: 
                INSERT INTO phpbb_ext
                (ext_name, ext_active, ext_state)
                VALUES
                (?, ?, ?)
             using args: Array
(
(8 more lines...)
phpbb_extension_metadata_manager_test::test_validator_requirements with data set #3 ('<5.4.17', '<3.1.0', false, false, 'Versions are not compared at the moment')
PHPUnit_Extensions_Database_Operation_Exception: COMPOSITE[INSERT] operation failed on query: 
                INSERT INTO phpbb_ext
                (ext_name, ext_active, ext_state)
                VALUES
                (?, ?, ?)
             using args: Array
(
(8 more lines...)

JIRA issues

IssueDescriptionStatus
17 more issues…
Unknown Issue TypePHPBB3-12448Could not obtain issue details from JIRA
Unknown Issue TypePHPBB3-12492Could not obtain issue details from JIRA
Unknown Issue TypePHPBB3-12560Could not obtain issue details from JIRA
Unknown Issue TypePHPBB3-12656Could not obtain issue details from JIRA
Unknown Issue TypePHPBB3-12791Could not obtain issue details from JIRA