Performs unit tests on SQL Server 2012 using the MSSQL Native driver

Build: #30 failed Rebuilt by Marc

Build result summary

Details

Completed
Duration
5 minutes
Flags
Custom build
Labels
pr_2851 Edit labels
Revision
73bd77809ed0acfb19b9124f08d5ec044a911299 73bd77809ed0acfb19b9124f08d5ec044a911299
Total tests
3417
Failing since
#21 (Rebuilt by Patrick Webster)
Number of retries
3

Responsible

This build has been failing since #21
No one has taken responsibility

Custom variables

Name Value
PRnumber 2851

Tests

New test failures 24
Status Test View job Duration
Collapse Failed phpbb_dbal_db_tools_test::test_created_column test_column_remove_similar_name History
Build and Test < 1 sec
phpbb_dbal_db_tools_test::test_column_remove_similar_name
SQL ERROR [ mssqlnative ]<br /><br />SQLSTATE: 42000
code: 102
message: [Microsoft][SQL Server Native Client 11.0][SQL Server]Incorrect syntax near '1'.
 [102]<br /><br />An sql error occurred while fetching this page. Please contact an administrator if this problem persists.

C:\Users\Administrator\bamboo-agent-home\xml-data\build-dir\PHPBB3-MSSQLNATIVE-BUILD\phpBB\phpbb\db\driver\driver.php:844
C:\Users\Administrator\bamboo-agent-home\xml-data\build-dir\PHPBB3-MSSQLNATIVE-BUILD\phpBB\phpbb\db\driver\mssqlnative.php:143
(3 more lines...)
Collapse Failed phpbb_dbal_db_tools_test::test_created_column test_column_change_with_index History
Build and Test < 1 sec
phpbb_dbal_db_tools_test::test_column_change_with_index
SQL ERROR [ mssqlnative ]<br /><br />SQLSTATE: 42000
code: 102
message: [Microsoft][SQL Server Native Client 11.0][SQL Server]Incorrect syntax near '1'.
 [102]<br /><br />An sql error occurred while fetching this page. Please contact an administrator if this problem persists.

C:\Users\Administrator\bamboo-agent-home\xml-data\build-dir\PHPBB3-MSSQLNATIVE-BUILD\phpBB\phpbb\db\driver\driver.php:844
C:\Users\Administrator\bamboo-agent-home\xml-data\build-dir\PHPBB3-MSSQLNATIVE-BUILD\phpBB\phpbb\db\driver\mssqlnative.php:143
(3 more lines...)
Collapse Failed phpbb_dbal_db_tools_test::test_created_column test_column_remove History
Build and Test < 1 sec
phpbb_dbal_db_tools_test::test_column_remove
SQL ERROR [ mssqlnative ]<br /><br />SQLSTATE: 42000
code: 102
message: [Microsoft][SQL Server Native Client 11.0][SQL Server]Incorrect syntax near '1'.
 [102]<br /><br />An sql error occurred while fetching this page. Please contact an administrator if this problem persists.

C:\Users\Administrator\bamboo-agent-home\xml-data\build-dir\PHPBB3-MSSQLNATIVE-BUILD\phpBB\phpbb\db\driver\driver.php:844
C:\Users\Administrator\bamboo-agent-home\xml-data\build-dir\PHPBB3-MSSQLNATIVE-BUILD\phpBB\phpbb\db\driver\mssqlnative.php:143
(3 more lines...)
Collapse Failed phpbb_dbal_db_tools_test::test_created_column test_column_remove_with_index History
Build and Test < 1 sec
phpbb_dbal_db_tools_test::test_column_remove_with_index
SQL ERROR [ mssqlnative ]<br /><br />SQLSTATE: 42000
code: 102
message: [Microsoft][SQL Server Native Client 11.0][SQL Server]Incorrect syntax near '1'.
 [102]<br /><br />An sql error occurred while fetching this page. Please contact an administrator if this problem persists.

C:\Users\Administrator\bamboo-agent-home\xml-data\build-dir\PHPBB3-MSSQLNATIVE-BUILD\phpBB\phpbb\db\driver\driver.php:844
C:\Users\Administrator\bamboo-agent-home\xml-data\build-dir\PHPBB3-MSSQLNATIVE-BUILD\phpBB\phpbb\db\driver\mssqlnative.php:143
(3 more lines...)
Collapse Failed phpbb_dbal_migrator_test test_update History
Build and Test < 1 sec
phpbb_dbal_migrator_test::test_update
SQL ERROR [ mssqlnative ]<br /><br />SQLSTATE: 42000
code: 102
message: [Microsoft][SQL Server Native Client 11.0][SQL Server]Incorrect syntax near '1'.
 [102]<br /><br />An sql error occurred while fetching this page. Please contact an administrator if this problem persists.

C:\Users\Administrator\bamboo-agent-home\xml-data\build-dir\PHPBB3-MSSQLNATIVE-BUILD\phpBB\phpbb\db\driver\driver.php:844
C:\Users\Administrator\bamboo-agent-home\xml-data\build-dir\PHPBB3-MSSQLNATIVE-BUILD\phpBB\phpbb\db\driver\mssqlnative.php:143
(3 more lines...)
Collapse Failed phpbb_dbal_migrator_test test_revert History
Build and Test < 1 sec
phpbb_dbal_migrator_test::test_revert
SQL ERROR [ mssqlnative ]<br /><br />SQLSTATE: 42000
code: 102
message: [Microsoft][SQL Server Native Client 11.0][SQL Server]Incorrect syntax near '1'.
 [102]<br /><br />An sql error occurred while fetching this page. Please contact an administrator if this problem persists.

C:\Users\Administrator\bamboo-agent-home\xml-data\build-dir\PHPBB3-MSSQLNATIVE-BUILD\phpBB\phpbb\db\driver\driver.php:844
C:\Users\Administrator\bamboo-agent-home\xml-data\build-dir\PHPBB3-MSSQLNATIVE-BUILD\phpBB\phpbb\db\driver\mssqlnative.php:143
(8 more lines...)
Collapse Failed phpbb_dbal_migrator_test test_unfulfillable History
Build and Test < 1 sec
phpbb_dbal_migrator_test::test_unfulfillable
SQL ERROR [ mssqlnative ]<br /><br />SQLSTATE: 42000
code: 102
message: [Microsoft][SQL Server Native Client 11.0][SQL Server]Incorrect syntax near '1'.
 [102]<br /><br />An sql error occurred while fetching this page. Please contact an administrator if this problem persists.

C:\Users\Administrator\bamboo-agent-home\xml-data\build-dir\PHPBB3-MSSQLNATIVE-BUILD\phpBB\phpbb\db\driver\driver.php:844
C:\Users\Administrator\bamboo-agent-home\xml-data\build-dir\PHPBB3-MSSQLNATIVE-BUILD\phpBB\phpbb\db\driver\mssqlnative.php:143
(3 more lines...)
Collapse Failed phpbb_dbal_migrator_test test_fail History
Build and Test < 1 sec
phpbb_dbal_migrator_test::test_fail
SQL ERROR [ mssqlnative ]<br /><br />SQLSTATE: 42000
code: 102
message: [Microsoft][SQL Server Native Client 11.0][SQL Server]Incorrect syntax near '1'.
 [102]<br /><br />An sql error occurred while fetching this page. Please contact an administrator if this problem persists.

C:\Users\Administrator\bamboo-agent-home\xml-data\build-dir\PHPBB3-MSSQLNATIVE-BUILD\phpBB\phpbb\db\driver\driver.php:844
C:\Users\Administrator\bamboo-agent-home\xml-data\build-dir\PHPBB3-MSSQLNATIVE-BUILD\phpBB\phpbb\db\driver\mssqlnative.php:143
(10 more lines...)
Collapse Failed phpbb_dbal_migrator_test test_schema History
Build and Test < 1 sec
phpbb_dbal_migrator_test::test_schema
SQL ERROR [ mssqlnative ]<br /><br />SQLSTATE: 42000
code: 102
message: [Microsoft][SQL Server Native Client 11.0][SQL Server]Incorrect syntax near '1'.
 [102]<br /><br />An sql error occurred while fetching this page. Please contact an administrator if this problem persists.

C:\Users\Administrator\bamboo-agent-home\xml-data\build-dir\PHPBB3-MSSQLNATIVE-BUILD\phpBB\phpbb\db\driver\driver.php:844
C:\Users\Administrator\bamboo-agent-home\xml-data\build-dir\PHPBB3-MSSQLNATIVE-BUILD\phpBB\phpbb\db\driver\mssqlnative.php:143
(8 more lines...)
Collapse Failed phpbb_dbal_write_test::test_build_array_insert test_build_array_insert with data set #0 History
Build and Test < 1 sec
phpbb_dbal_write_test::test_build_array_insert with data set #0 (array('test_version', '0.0.0', 1))
Failed asserting that two arrays are equal.
--- Expected
+++ Actual
@@ @@
 Array (
     'config_name' => 'test_version'
     'config_value' => '0.0.0'
(8 more lines...)
Collapse Failed phpbb_dbal_write_test::test_build_array_insert test_build_array_insert with data set #1 History
Build and Test < 1 sec
phpbb_dbal_write_test::test_build_array_insert with data set #1 (array('second config', '10', 0))
Failed asserting that two arrays are equal.
--- Expected
+++ Actual
@@ @@
 Array (
     'config_name' => 'second config'
     'config_value' => '10'
(8 more lines...)
Collapse Failed phpbb_dbal_write_test::test_build_array_insert test_multiple_insert History
Build and Test < 1 sec
phpbb_dbal_write_test::test_multiple_insert
Failed asserting that two arrays are equal.
--- Expected
+++ Actual
@@ @@
 Array (
     0 => Array (
         'config_name' => 'batch one'
(19 more lines...)
Collapse Failed phpbb_dbal_write_test::test_update test_update with data set #1 History
Build and Test < 1 sec
phpbb_dbal_write_test::test_update with data set #1 (array('0', 1), '', array(array('config1', '0', 1), array('config2', '0', 1)))
Failed asserting that two arrays are equal.
--- Expected
+++ Actual
@@ @@
 Array (
     0 => Array (
         'config_name' => 'config1'
(19 more lines...)
Collapse Failed phpbb_dbal_write_test::test_update test_update with data set #0 History
Build and Test < 1 sec
phpbb_dbal_write_test::test_update with data set #0 (array('23', 0), ' WHERE config_name = \'config1\'', array(array('config1', '23', 0), array('config2', 'bar', 1)))
Failed asserting that two arrays are equal.
--- Expected
+++ Actual
@@ @@
 Array (
     0 => Array (
         'config_name' => 'config1'
(19 more lines...)
Collapse Failed phpbb_extension_manager_test test_enable_not_enableable History
Build and Test < 1 sec
phpbb_extension_manager_test::test_enable_not_enableable
PHPUnit_Extensions_Database_Operation_Exception: COMPOSITE[INSERT] operation failed on query: 
                INSERT INTO phpbb_ext
                (ext_name, ext_active, ext_state)
                VALUES
                (?, ?, ?)
             using args: Array
(
(8 more lines...)
Collapse Failed phpbb_filespec_test::test_is_image_get_mimetype test_is_image_get_mimetype with data set #2 History
Build and Test < 1 sec
phpbb_filespec_test::test_is_image_get_mimetype with data set #2 ('png', 'image/png', true)
Failed asserting that false matches expected true.

C:\Users\Administrator\bamboo-agent-home\xml-data\build-dir\PHPBB3-MSSQLNATIVE-BUILD\tests\upload\filespec_test.php:271
Collapse Failed phpbb_filespec_test::test_is_image_get_mimetype test_is_image_get_mimetype with data set #1 History
Build and Test < 1 sec
phpbb_filespec_test::test_is_image_get_mimetype with data set #1 ('jpg', 'image/jpg', true)
Failed asserting that false matches expected true.

C:\Users\Administrator\bamboo-agent-home\xml-data\build-dir\PHPBB3-MSSQLNATIVE-BUILD\tests\upload\filespec_test.php:271
Collapse Failed phpbb_filespec_test::test_is_image_get_mimetype test_is_image_get_mimetype with data set #3 History
Build and Test < 1 sec
phpbb_filespec_test::test_is_image_get_mimetype with data set #3 ('tif', 'image/tif', true)
Failed asserting that false matches expected true.

C:\Users\Administrator\bamboo-agent-home\xml-data\build-dir\PHPBB3-MSSQLNATIVE-BUILD\tests\upload\filespec_test.php:271
Collapse Failed phpbb_filespec_test::test_is_image_get_mimetype test_is_image_get_mimetype with data set #6 History
Build and Test < 1 sec
phpbb_filespec_test::test_is_image_get_mimetype with data set #6 ('gif', 'application/octetstream', true)
Failed asserting that false matches expected true.

C:\Users\Administrator\bamboo-agent-home\xml-data\build-dir\PHPBB3-MSSQLNATIVE-BUILD\tests\upload\filespec_test.php:271
Collapse Failed phpbb_filespec_test::test_is_image_get_mimetype test_is_image_get_mimetype with data set #5 History
Build and Test < 1 sec
phpbb_filespec_test::test_is_image_get_mimetype with data set #5 ('jpg', 'application/octet-stream', true)
Failed asserting that false matches expected true.

C:\Users\Administrator\bamboo-agent-home\xml-data\build-dir\PHPBB3-MSSQLNATIVE-BUILD\tests\upload\filespec_test.php:271
Collapse Failed phpbb_filespec_test::test_is_image_get_mimetype test_is_image_get_mimetype with data set #7 History
Build and Test < 1 sec
phpbb_filespec_test::test_is_image_get_mimetype with data set #7 ('png', 'application/mime', true)
Failed asserting that false matches expected true.

C:\Users\Administrator\bamboo-agent-home\xml-data\build-dir\PHPBB3-MSSQLNATIVE-BUILD\tests\upload\filespec_test.php:271
Collapse Failed phpbb_filespec_test::test_is_image_get_mimetype test_is_image_get_mimetype with data set #0 History
Build and Test < 1 sec
phpbb_filespec_test::test_is_image_get_mimetype with data set #0 ('gif', 'image/gif', true)
Failed asserting that false matches expected true.

C:\Users\Administrator\bamboo-agent-home\xml-data\build-dir\PHPBB3-MSSQLNATIVE-BUILD\tests\upload\filespec_test.php:271
Collapse Failed phpbb_filespec_test::test_move_file test_move_file with data set #5 History
Build and Test < 1 sec
phpbb_filespec_test::test_move_file with data set #5 ('png_copy', 'png_moved', 'image/png', 'jpg', 'IMAGE_FILETYPE_MISMATCH', true)
Failed asserting that null matches expected 'IMAGE_FILETYPE_MISMATCH'.

C:\Users\Administrator\bamboo-agent-home\xml-data\build-dir\PHPBB3-MSSQLNATIVE-BUILD\tests\upload\filespec_test.php:312
Collapse Failed phpbb_migrator_convert_timezones_test test_convert History
Build and Test < 1 sec
phpbb_migrator_convert_timezones_test::test_convert
SQL ERROR [ mssqlnative ]<br /><br />SQLSTATE: 42000
code: 102
message: [Microsoft][SQL Server Native Client 11.0][SQL Server]Incorrect syntax near '1'.
 [102]<br /><br />An sql error occurred while fetching this page. Please contact an administrator if this problem persists.

C:\Users\Administrator\bamboo-agent-home\xml-data\build-dir\PHPBB3-MSSQLNATIVE-BUILD\phpBB\phpbb\db\driver\driver.php:844
C:\Users\Administrator\bamboo-agent-home\xml-data\build-dir\PHPBB3-MSSQLNATIVE-BUILD\phpBB\phpbb\db\driver\mssqlnative.php:143
(3 more lines...)
Existing test failures 200
Status Test Failing since View job Duration
phpbb_auth_provider_oauth_token_storage_test::test_hasAccessToken with data set #1 (OAuth\OAuth2\Token\StdOAuth2Token, true)
PHPUnit_Extensions_Database_Operation_Exception: COMPOSITE[INSERT] operation failed on query: 
                INSERT INTO phpbb_oauth_tokens
                (user_id, session_id, provider, oauth_token)
                VALUES
                (?, ?, ?, ?)
             using args: Array
(
(9 more lines...)
phpbb_auth_provider_oauth_token_storage_test::test_hasAccessToken with data set #0 (NULL, false)
PHPUnit_Extensions_Database_Operation_Exception: COMPOSITE[INSERT] operation failed on query: 
                INSERT INTO phpbb_oauth_tokens
                (user_id, session_id, provider, oauth_token)
                VALUES
                (?, ?, ?, ?)
             using args: Array
(
(9 more lines...)
phpbb_auth_provider_oauth_token_storage_test::test_clearToken
PHPUnit_Extensions_Database_Operation_Exception: COMPOSITE[INSERT] operation failed on query: 
                INSERT INTO phpbb_oauth_tokens
                (user_id, session_id, provider, oauth_token)
                VALUES
                (?, ?, ?, ?)
             using args: Array
(
(9 more lines...)
phpbb_auth_provider_oauth_token_storage_test::test_set_user_id
PHPUnit_Extensions_Database_Operation_Exception: COMPOSITE[INSERT] operation failed on query: 
                INSERT INTO phpbb_oauth_tokens
                (user_id, session_id, provider, oauth_token)
                VALUES
                (?, ?, ?, ?)
             using args: Array
(
(9 more lines...)
phpbb_auth_provider_oauth_token_storage_test::test_has_access_token_by_session with data set #0 (NULL, false)
PHPUnit_Extensions_Database_Operation_Exception: COMPOSITE[INSERT] operation failed on query: 
                INSERT INTO phpbb_oauth_tokens
                (user_id, session_id, provider, oauth_token)
                VALUES
                (?, ?, ?, ?)
             using args: Array
(
(9 more lines...)
phpbb_auth_provider_oauth_token_storage_test::test_has_access_token_by_session with data set #1 (OAuth\OAuth2\Token\StdOAuth2Token, true)
PHPUnit_Extensions_Database_Operation_Exception: COMPOSITE[INSERT] operation failed on query: 
                INSERT INTO phpbb_oauth_tokens
                (user_id, session_id, provider, oauth_token)
                VALUES
                (?, ?, ?, ?)
             using args: Array
(
(9 more lines...)
phpbb_auth_provider_oauth_token_storage_test::test_retrieveAccessToken_from_db
PHPUnit_Extensions_Database_Operation_Exception: COMPOSITE[INSERT] operation failed on query: 
                INSERT INTO phpbb_oauth_tokens
                (user_id, session_id, provider, oauth_token)
                VALUES
                (?, ?, ?, ?)
             using args: Array
(
(9 more lines...)
phpbb_auth_provider_oauth_token_storage_test::test_retrieveAccessToken with data set #1 (NULL, 'OAuth\\Common\\Storage\\Exception\\TokenNotFoundException')
PHPUnit_Extensions_Database_Operation_Exception: COMPOSITE[INSERT] operation failed on query: 
                INSERT INTO phpbb_oauth_tokens
                (user_id, session_id, provider, oauth_token)
                VALUES
                (?, ?, ?, ?)
             using args: Array
(
(9 more lines...)
phpbb_auth_provider_oauth_token_storage_test::test_retrieveAccessToken_wrong_token
PHPUnit_Extensions_Database_Operation_Exception: COMPOSITE[INSERT] operation failed on query: 
                INSERT INTO phpbb_oauth_tokens
                (user_id, session_id, provider, oauth_token)
                VALUES
                (?, ?, ?, ?)
             using args: Array
(
(9 more lines...)
phpbb_auth_provider_oauth_token_storage_test::test_retrieveAccessToken with data set #0 (OAuth\OAuth2\Token\StdOAuth2Token, NULL)
PHPUnit_Extensions_Database_Operation_Exception: COMPOSITE[INSERT] operation failed on query: 
                INSERT INTO phpbb_oauth_tokens
                (user_id, session_id, provider, oauth_token)
                VALUES
                (?, ?, ?, ?)
             using args: Array
(
(9 more lines...)
phpbb_auth_provider_oauth_token_storage_test::test_retrieve_access_token_by_session with data set #0 (OAuth\OAuth2\Token\StdOAuth2Token, NULL)
PHPUnit_Extensions_Database_Operation_Exception: COMPOSITE[INSERT] operation failed on query: 
                INSERT INTO phpbb_oauth_tokens
                (user_id, session_id, provider, oauth_token)
                VALUES
                (?, ?, ?, ?)
             using args: Array
(
(9 more lines...)
phpbb_auth_provider_oauth_token_storage_test::test_retrieve_access_token_by_session with data set #1 (NULL, 'OAuth\\Common\\Storage\\Exception\\TokenNotFoundException')
PHPUnit_Extensions_Database_Operation_Exception: COMPOSITE[INSERT] operation failed on query: 
                INSERT INTO phpbb_oauth_tokens
                (user_id, session_id, provider, oauth_token)
                VALUES
                (?, ?, ?, ?)
             using args: Array
(
(9 more lines...)
phpbb_auth_provider_oauth_token_storage_test::test_storeAccessToken
PHPUnit_Extensions_Database_Operation_Exception: COMPOSITE[INSERT] operation failed on query: 
                INSERT INTO phpbb_oauth_tokens
                (user_id, session_id, provider, oauth_token)
                VALUES
                (?, ?, ?, ?)
             using args: Array
(
(9 more lines...)
phpbb_auth_provider_oauth_token_storage_test::test_retrieve_access_token_by_session_from_db
PHPUnit_Extensions_Database_Operation_Exception: COMPOSITE[INSERT] operation failed on query: 
                INSERT INTO phpbb_oauth_tokens
                (user_id, session_id, provider, oauth_token)
                VALUES
                (?, ?, ?, ?)
             using args: Array
(
(9 more lines...)
phpbb_dbal_cross_join_test::test_cross_join
PHPUnit_Extensions_Database_Operation_Exception: COMPOSITE[INSERT] operation failed on query: 
                INSERT INTO phpbb_user_group
                (user_id, group_id)
                VALUES
                (?, ?)
             using args: Array
(
(6 more lines...)
phpbb_dbal_db_tools_test::test_column_remove_primary
SQL ERROR [ mssqlnative ]<br /><br />SQLSTATE: 42000
code: 102
message: [Microsoft][SQL Server Native Client 11.0][SQL Server]Incorrect syntax near '1'.
 [102]<br /><br />An sql error occurred while fetching this page. Please contact an administrator if this problem persists.

C:\Users\Administrator\bamboo-agent-home\xml-data\build-dir\PHPBB3-MSSQLNATIVE-BUILD\phpBB\phpbb\db\driver\driver.php:844
C:\Users\Administrator\bamboo-agent-home\xml-data\build-dir\PHPBB3-MSSQLNATIVE-BUILD\phpBB\phpbb\db\driver\mssqlnative.php:143
(3 more lines...)
phpbb_dbal_db_tools_test::test_created_column with data set #16 ('c_stext_uni', 'ÄÄÄÄÄÄÄÄÄÄÄÄÄÄÄÄÄÄÄÄÄÄÄÄÄÄÄÄÄÄÄÄÄÄÄÄÄÄÄÄÄÄÄÄÄÄÄÄÄÄÄÄÄÄÄÄÄÄÄÄÄÄÄÄÄÄÄÄÄÄÄÄÄÄÄÄÄÄÄÄÄÄÄÄÄÄÄÄÄÄÄÄÄÄÄÄÄÄÄÄÄÄÄÄÄÄÄÄÄÄÄÄÄÄÄÄÄÄÄÄÄÄÄÄÄÄÄÄÄÄÄÄÄÄÄÄÄÄÄÄÄÄÄÄÄÄÄÄÄÄÄÄÄÄÄÄÄÄÄÄÄÄÄÄÄÄÄÄÄÄÄÄÄÄÄÄÄÄÄÄÄÄÄÄÄÄÄÄÄÄÄÄÄÄÄÄÄÄÄÄÄÄÄÄÄÄÄÄÄÄÄÄÄÄÄÄÄÄÄÄÄÄÄÄÄÄÄÄÄÄÄÄÄÄÄÄÄÄÄÄÄÄÄÄÄÄÄÄÄÄÄÄÄÄÄ')
SQL ERROR [ mssqlnative ]<br /><br />SQLSTATE: 22001
code: 8152
message: [Microsoft][SQL Server Native Client 11.0][SQL Server]String or binary data would be truncated.
SQLSTATE: 01000
code: 3621
message: [Microsoft][SQL Server Native Client 11.0][SQL Server]The statement has been terminated.
 [3621]<br /><br />An sql error occurred while fetching this page. Please contact an administrator if this problem persists.
(4 more lines...)
phpbb_dbal_db_tools_test::test_created_column with data set #15 ('c_xstext_uni', 'ÄÄÄÄÄÄÄÄÄÄÄÄÄÄÄÄÄÄÄÄÄÄÄÄÄÄÄÄÄÄÄÄÄÄÄÄÄÄÄÄÄÄÄÄÄÄÄÄÄÄÄÄÄÄÄÄÄÄÄÄÄÄÄÄÄÄÄÄÄÄÄÄÄÄÄÄÄÄÄÄÄÄÄÄÄÄÄÄÄÄÄÄÄÄÄÄÄÄÄÄ')
SQL ERROR [ mssqlnative ]<br /><br />SQLSTATE: 22001
code: 8152
message: [Microsoft][SQL Server Native Client 11.0][SQL Server]String or binary data would be truncated.
SQLSTATE: 01000
code: 3621
message: [Microsoft][SQL Server Native Client 11.0][SQL Server]The statement has been terminated.
 [3621]<br /><br />An sql error occurred while fetching this page. Please contact an administrator if this problem persists.
(4 more lines...)
phpbb_dbal_db_tools_test::test_created_column with data set #17 ('c_text_uni', 'ÄÄÄÄÄÄÄÄÄÄÄÄÄÄÄÄÄÄÄÄÄÄÄÄÄÄÄÄÄÄÄÄÄÄÄÄÄÄÄÄÄÄÄÄÄÄÄÄÄÄÄÄÄÄÄÄÄÄÄÄÄÄÄÄÄÄÄÄÄÄÄÄÄÄÄÄÄÄÄÄÄÄÄÄÄÄÄÄÄÄÄÄÄÄÄÄÄÄÄÄÄÄÄÄÄÄÄÄÄÄÄÄÄÄÄÄÄÄÄÄÄÄÄÄÄÄÄÄÄÄÄÄÄÄÄÄÄÄÄÄÄÄÄÄÄÄÄÄÄÄÄÄÄÄÄÄÄÄÄÄÄÄÄÄÄÄÄÄÄÄÄÄÄÄÄÄÄÄÄÄÄÄÄÄÄÄÄÄÄÄÄÄÄÄÄÄÄÄÄÄÄÄÄÄÄÄÄÄÄÄÄÄÄÄÄÄÄÄÄÄÄÄÄÄÄÄÄÄÄÄÄÄÄÄÄÄÄÄÄÄÄÄÄÄÄÄÄÄÄÄÄÄÄÄÄÄÄÄÄÄÄÄÄÄÄÄÄÄÄÄÄÄÄÄÄÄÄÄÄÄÄÄÄÄÄÄÄÄÄÄÄÄÄÄÄÄÄÄÄÄÄÄÄÄÄÄÄÄÄÄÄÄÄÄÄÄÄÄÄÄÄÄÄÄÄÄÄÄÄÄÄÄÄÄÄÄÄÄÄÄÄÄÄÄÄÄÄÄÄÄÄÄÄÄÄÄÄÄÄÄÄÄÄÄÄÄÄÄÄÄÄÄÄÄÄÄÄÄÄÄÄÄÄÄÄÄÄÄÄÄÄÄÄÄÄÄÄÄÄÄÄÄÄÄÄÄÄÄÄÄÄÄÄÄÄÄÄÄÄÄÄÄÄÄÄÄÄÄÄÄÄÄÄÄÄÄÄÄÄÄÄÄÄÄÄÄÄÄÄÄÄÄÄÄÄÄÄÄÄÄÄÄÄÄÄÄÄÄÄÄÄÄÄÄÄÄÄÄÄÄÄÄÄÄÄÄÄÄÄÄÄÄÄÄÄÄÄÄÄÄÄÄÄÄÄÄÄÄÄÄÄÄÄÄÄÄÄÄÄÄÄÄÄÄÄÄÄÄÄÄÄÄÄÄÄÄÄÄÄÄÄÄÄÄÄÄÄÄÄÄÄÄÄÄÄÄÄÄÄÄÄÄÄÄÄÄÄÄÄÄÄÄÄÄÄÄÄÄÄÄÄÄÄÄÄÄÄÄÄÄÄÄÄÄÄÄÄÄÄÄÄÄÄÄÄÄÄÄÄÄÄÄÄÄÄÄÄÄÄÄÄÄÄÄÄÄÄÄÄÄÄÄÄÄÄÄÄÄÄÄÄÄÄÄÄÄÄÄÄÄÄÄÄÄÄÄÄÄÄÄÄÄÄÄÄÄÄÄÄÄÄÄÄÄÄÄÄÄÄÄÄÄÄÄÄÄÄÄÄÄÄÄÄÄÄÄÄÄÄÄÄÄÄÄÄÄÄÄÄÄÄÄÄÄÄÄÄÄÄÄÄÄÄÄÄÄÄÄÄÄÄÄÄÄÄÄÄÄÄÄÄÄÄÄÄÄÄÄÄÄÄÄÄÄÄÄÄÄÄÄÄÄÄÄÄÄÄÄÄÄÄÄÄÄÄÄÄÄÄÄÄÄÄÄÄÄÄÄÄÄÄÄÄÄÄÄÄÄÄÄÄÄÄÄÄÄÄÄÄÄÄÄÄÄÄÄÄÄÄÄÄÄÄÄÄÄÄÄÄÄÄÄÄÄÄÄÄÄÄÄÄÄÄÄÄÄÄÄÄÄÄÄÄÄÄÄÄÄÄÄÄÄÄÄÄÄÄÄÄÄÄÄÄÄÄÄÄÄÄÄÄÄÄÄÄÄÄÄÄÄÄÄÄÄÄÄÄÄÄÄÄÄÄÄÄÄÄÄÄÄÄÄÄÄÄÄÄÄÄÄÄÄÄÄÄÄÄÄÄÄÄÄÄÄÄÄÄÄÄÄÄÄÄÄÄÄÄÄÄÄÄÄÄÄÄÄÄÄÄÄÄÄÄÄÄÄÄÄÄÄÄÄÄÄÄÄÄÄÄÄÄÄÄÄÄÄÄÄÄÄÄÄÄÄÄÄÄÄÄÄÄÄÄÄÄÄÄÄÄÄÄÄÄÄÄÄÄÄÄÄÄÄÄÄÄÄÄÄÄÄÄÄÄÄÄÄÄÄÄÄÄÄÄÄÄÄÄÄÄÄÄÄÄÄÄÄÄÄÄÄÄÄÄÄÄÄÄÄÄÄÄÄÄÄÄÄÄÄÄÄÄÄÄÄÄÄÄÄÄÄÄÄÄÄÄÄÄÄÄÄÄÄÄÄÄÄÄÄÄÄÄÄÄÄÄÄÄÄÄÄÄÄÄÄÄÄÄÄÄÄÄÄÄÄÄÄÄÄÄÄÄÄÄÄÄÄÄÄÄÄÄÄÄÄÄÄÄÄÄÄÄÄÄÄÄÄÄÄÄÄÄÄÄÄÄÄÄÄÄÄÄÄÄÄÄÄÄÄÄÄÄÄÄÄÄÄÄÄÄÄÄÄÄÄÄÄÄÄÄÄÄÄÄÄÄÄÄÄÄÄÄÄÄÄÄÄÄÄÄÄÄÄÄÄÄÄÄÄÄÄÄÄÄÄÄÄÄÄÄÄÄÄÄÄÄÄÄÄÄÄÄÄÄÄÄÄÄÄÄÄÄÄÄÄÄÄÄÄÄÄÄÄÄÄÄÄÄÄÄÄÄÄÄÄÄÄÄÄÄÄÄÄÄÄÄÄÄÄÄÄÄÄÄÄÄÄÄÄÄÄÄÄÄÄÄÄÄÄÄÄÄÄÄÄÄÄÄÄÄÄÄÄÄÄÄÄÄÄÄÄÄÄÄÄÄÄÄÄÄÄÄÄÄÄÄÄÄÄÄÄÄÄÄÄÄÄÄÄÄÄÄÄÄÄÄÄÄÄÄÄÄÄÄÄÄÄÄÄÄÄÄÄÄÄÄÄÄÄÄÄÄÄÄÄÄÄÄÄÄÄÄÄÄÄÄÄÄÄÄÄÄÄÄÄÄÄÄÄÄÄÄÄÄÄÄÄÄÄÄÄÄÄÄÄÄÄÄÄÄÄÄÄÄÄÄÄÄÄÄÄÄÄÄÄÄÄÄÄÄÄÄÄÄÄÄÄÄÄÄÄÄÄÄÄÄÄÄÄÄÄÄÄÄÄÄÄÄÄÄÄÄÄÄÄÄÄÄÄÄÄÄÄÄÄÄÄÄÄÄÄÄÄÄÄÄÄÄÄÄÄÄÄÄÄÄÄÄÄÄÄÄÄÄÄÄÄÄÄÄÄÄÄÄÄÄÄÄÄÄÄÄÄÄÄÄÄÄÄÄÄÄÄÄÄÄÄÄÄÄÄÄÄÄÄÄÄÄÄÄÄÄÄÄÄÄÄÄÄÄÄÄÄÄÄÄÄÄÄÄÄÄÄÄÄÄÄÄÄÄÄÄÄÄÄÄÄÄÄÄÄÄÄÄÄÄÄÄÄÄÄÄÄÄÄÄÄÄÄÄÄÄÄÄÄÄÄÄÄÄÄÄÄÄÄÄÄÄÄÄÄÄÄÄÄÄÄÄÄÄÄÄÄÄÄÄÄÄÄÄÄÄÄÄÄÄÄÄÄÄÄÄÄÄÄÄÄÄÄÄÄÄÄÄÄÄÄÄÄÄÄÄÄÄÄÄÄÄÄÄÄÄÄÄÄÄÄÄÄÄÄÄÄÄÄÄÄÄÄÄÄÄÄÄÄÄÄÄÄÄÄÄÄÄÄÄÄÄÄÄÄÄÄÄÄÄÄÄÄÄÄÄÄÄÄÄÄÄÄÄÄÄÄÄÄÄÄÄÄÄÄÄÄÄÄÄÄÄÄÄÄÄÄÄÄÄÄÄÄÄÄÄÄÄÄÄÄÄÄÄÄÄÄÄÄÄÄÄÄÄÄÄÄÄÄÄÄÄÄÄÄÄÄÄÄÄÄÄÄÄÄÄÄÄÄÄÄÄÄÄÄÄÄÄÄÄÄÄÄÄÄÄÄÄÄÄÄÄÄÄÄÄÄÄÄÄÄÄÄÄÄÄÄÄÄÄÄÄÄÄÄÄÄÄÄÄÄÄÄÄÄÄÄÄÄÄÄÄÄÄÄÄÄÄÄÄÄÄÄÄÄÄÄÄÄÄÄÄÄÄÄÄÄÄÄÄÄÄÄÄÄÄÄÄÄÄÄÄÄÄÄÄÄÄÄÄÄÄÄÄÄÄÄÄÄÄÄÄÄÄÄÄÄÄÄÄÄÄÄÄÄÄÄÄÄÄÄÄÄÄÄÄÄÄÄÄÄÄÄÄÄÄÄÄÄÄÄÄÄÄÄÄÄÄÄÄÄÄÄÄÄÄÄÄÄÄÄÄÄÄÄÄÄÄÄÄÄÄÄÄÄÄÄÄÄÄÄÄÄÄÄÄÄÄÄÄÄÄÄÄÄÄÄÄÄÄÄÄÄÄÄÄÄÄÄÄÄÄÄÄÄÄÄÄÄÄÄÄÄÄÄÄÄÄÄÄÄÄÄÄÄÄÄÄÄÄÄÄÄÄÄÄÄÄÄÄÄÄÄÄÄÄÄÄÄÄÄÄÄÄÄÄÄÄÄÄÄÄÄÄÄÄÄÄÄÄÄÄÄÄÄÄÄÄÄÄÄÄÄÄÄÄÄÄÄÄÄÄÄÄÄÄÄÄÄÄÄÄÄÄÄÄÄÄÄÄÄÄÄÄÄÄÄÄÄÄÄÄÄÄÄÄÄÄÄÄÄÄÄÄÄÄÄÄÄÄÄÄÄÄÄÄÄÄÄÄÄÄÄÄÄÄÄÄÄÄÄÄÄÄÄÄÄÄÄÄÄÄÄÄÄÄÄÄÄÄÄÄÄÄÄÄÄÄÄÄÄÄÄÄÄÄÄÄÄÄÄÄÄÄÄÄÄÄÄÄÄÄÄÄÄÄÄÄÄÄÄÄÄÄÄÄÄÄÄÄÄÄÄÄÄÄÄÄÄÄÄÄÄÄÄÄÄÄÄÄÄÄÄÄÄÄÄÄÄÄÄÄÄÄÄÄÄÄÄÄÄÄÄÄÄÄÄÄÄÄÄÄÄÄÄÄÄÄÄÄÄÄÄÄÄÄÄÄÄÄÄÄÄÄÄÄÄÄÄÄÄÄÄÄÄÄÄÄÄÄÄÄÄÄÄÄÄÄÄÄÄÄÄÄÄÄÄÄÄÄÄÄÄÄÄÄÄÄÄÄÄÄÄÄÄÄÄÄÄÄÄÄÄÄÄÄÄÄÄÄÄÄÄÄÄÄÄÄÄÄÄÄÄÄÄÄÄÄÄÄÄÄÄÄÄÄÄÄÄÄÄÄÄÄÄÄÄÄÄÄÄÄÄÄÄÄÄÄÄÄÄÄÄÄÄÄÄÄÄÄÄÄÄÄÄÄÄÄÄÄÄÄÄÄÄÄÄÄÄÄÄÄÄÄÄÄÄÄÄÄÄÄÄÄÄÄÄÄÄÄÄÄÄÄÄÄÄÄÄÄÄÄÄÄÄÄÄÄÄÄÄÄÄÄÄÄÄÄÄÄÄÄÄÄÄÄÄÄÄÄÄÄÄÄÄÄÄÄÄÄÄÄÄÄÄÄÄÄÄÄÄÄÄÄÄÄÄÄÄÄÄÄÄÄÄÄÄÄÄÄÄÄÄÄÄÄÄÄÄÄÄÄÄÄÄÄÄÄÄÄÄÄÄÄÄÄÄÄÄÄÄÄÄÄÄÄÄÄÄÄÄÄÄÄÄÄÄÄÄÄÄÄÄÄÄÄÄÄÄÄÄÄÄÄÄÄÄÄÄÄÄÄÄÄÄÄÄÄÄÄÄÄÄÄÄÄÄÄÄÄÄÄÄÄÄÄÄÄÄÄÄÄÄÄÄÄÄÄÄÄÄÄÄÄÄÄÄÄÄÄÄÄÄÄÄÄÄÄÄÄÄÄÄÄÄÄÄÄÄÄÄÄÄÄÄÄÄÄÄÄÄÄÄÄÄÄÄÄÄÄÄÄÄÄÄÄÄÄÄÄÄÄÄÄÄÄÄÄÄÄÄÄÄÄÄÄÄÄÄÄÄÄÄÄÄÄÄÄÄÄÄÄÄÄÄÄÄÄÄÄÄÄÄÄÄÄÄÄÄÄÄÄÄÄÄÄÄÄÄÄÄÄÄÄÄÄÄÄÄÄÄÄÄÄÄÄÄÄÄÄÄÄÄÄÄÄÄÄÄÄÄÄÄÄÄÄÄÄÄÄÄÄÄÄÄÄÄÄÄÄÄÄÄÄÄÄÄÄÄÄÄÄÄÄÄÄÄÄÄÄÄÄÄÄÄÄÄÄÄÄÄÄÄÄÄÄÄÄÄÄÄÄÄÄÄÄÄÄÄÄÄÄÄÄÄÄÄÄÄÄÄÄÄÄÄÄÄÄÄÄÄÄÄÄÄÄÄÄÄÄÄÄÄÄÄÄÄÄÄÄÄÄÄÄÄÄÄÄÄÄÄÄÄÄÄÄÄÄÄÄÄÄÄÄÄÄÄÄÄÄÄÄÄÄÄÄÄÄÄÄÄÄÄÄÄÄÄÄÄÄÄÄÄÄÄÄÄÄÄÄÄÄÄÄÄÄÄÄÄÄÄÄÄÄÄÄÄÄÄÄÄÄÄÄÄÄÄÄÄÄÄÄÄÄÄÄÄÄÄÄÄÄÄÄÄÄÄÄÄÄÄÄÄÄÄÄÄÄÄÄÄÄÄÄÄÄÄÄÄÄÄÄÄÄÄÄÄÄÄÄÄÄÄÄÄÄÄÄÄÄÄÄÄÄÄÄÄÄÄÄÄÄÄÄÄÄÄÄÄÄÄÄÄÄÄÄÄÄÄÄÄÄÄÄÄÄÄÄÄÄÄÄÄÄÄÄÄÄÄÄÄÄÄÄÄÄÄÄÄÄÄÄÄÄÄÄÄÄÄÄÄÄÄÄÄÄÄÄÄÄÄÄÄÄÄÄÄÄÄÄÄÄÄÄÄÄÄÄÄÄÄÄÄÄÄÄÄÄÄÄÄÄÄÄÄÄÄÄÄÄÄÄÄÄÄÄÄÄÄÄÄÄÄÄÄÄÄÄÄÄÄÄÄÄÄÄÄÄÄÄÄÄÄÄÄÄÄÄÄÄÄÄÄÄÄÄÄÄÄÄÄÄÄÄÄÄÄÄÄÄÄÄÄÄÄÄÄÄÄÄÄÄÄÄÄÄÄÄÄÄÄÄÄÄÄÄÄÄÄÄÄÄÄÄÄÄÄÄÄÄÄÄÄÄÄÄÄÄÄÄÄÄÄÄÄÄÄÄÄÄÄÄÄÄÄÄÄÄÄÄÄÄÄÄÄÄÄÄÄÄÄÄÄÄÄÄÄÄÄÄÄÄÄÄÄÄÄÄÄÄÄÄÄÄÄÄÄÄÄÄÄÄÄÄÄÄÄÄÄÄÄÄÄÄÄÄÄÄÄÄÄÄÄÄÄÄÄÄÄÄÄÄÄÄÄÄÄÄÄÄÄÄÄÄÄÄÄÄÄÄÄÄÄÄÄÄÄÄÄÄÄÄÄÄÄÄÄÄÄÄÄÄÄÄÄÄÄÄÄÄÄÄÄÄÄÄÄÄÄÄÄÄÄÄÄÄÄÄÄÄÄÄÄÄÄÄÄÄÄÄÄÄÄÄÄÄÄÄÄÄÄÄÄÄÄÄÄÄÄÄÄÄÄÄÄÄÄÄÄÄÄÄÄÄÄÄÄÄÄÄÄÄÄÄÄÄÄÄÄÄÄÄÄÄÄÄÄÄÄÄÄÄÄÄÄÄÄÄÄÄÄÄÄÄÄÄÄÄÄÄÄÄÄÄÄÄÄÄÄÄÄÄÄÄÄÄÄÄÄÄÄÄÄÄÄÄÄÄÄÄÄÄÄÄÄÄÄÄÄÄÄÄÄÄÄÄÄÄÄÄÄÄÄÄÄÄÄÄÄÄÄÄÄÄÄÄÄÄÄÄÄÄÄÄÄÄÄÄÄÄÄÄÄÄÄÄÄÄÄÄÄÄÄÄÄÄÄÄÄÄÄÄÄÄÄÄÄÄÄÄÄÄÄÄÄÄÄÄÄÄÄÄÄÄÄÄÄÄÄÄÄÄÄÄÄÄÄÄÄÄÄÄÄÄÄÄÄÄÄÄÄÄÄÄÄÄÄÄÄÄÄÄÄÄÄÄÄÄÄÄÄÄÄÄÄÄÄÄÄÄÄÄÄÄÄÄÄÄÄÄÄÄÄÄÄÄÄÄÄÄÄÄÄÄÄÄÄÄÄÄÄÄÄÄÄÄÄÄÄÄÄÄÄÄÄÄÄÄÄÄÄÄÄÄÄÄÄÄÄÄÄÄÄÄÄÄÄÄÄÄÄÄÄÄÄÄÄÄÄÄÄÄÄÄÄÄÄÄÄÄÄÄÄÄÄÄÄÄÄÄÄÄÄÄÄÄÄÄÄÄÄÄÄÄÄÄÄÄÄÄÄÄÄÄÄÄÄÄÄÄÄÄÄÄÄÄÄÄÄÄÄÄÄÄÄÄÄÄÄÄÄÄÄÄÄÄÄÄÄÄÄÄÄÄÄ')
SQL ERROR [ mssqlnative ]<br /><br />SQLSTATE: 22001
code: 8152
message: [Microsoft][SQL Server Native Client 11.0][SQL Server]String or binary data would be truncated.
SQLSTATE: 01000
code: 3621
message: [Microsoft][SQL Server Native Client 11.0][SQL Server]The statement has been terminated.
 [3621]<br /><br />An sql error occurred while fetching this page. Please contact an administrator if this problem persists.
(4 more lines...)
phpbb_dbal_db_tools_test::test_created_column with data set #26 ('c_vchar_ci', 'ÄÄÄÄÄÄÄÄÄÄÄÄÄÄÄÄÄÄÄÄÄÄÄÄÄÄÄÄÄÄÄÄÄÄÄÄÄÄÄÄÄÄÄÄÄÄÄÄÄÄÄÄÄÄÄÄÄÄÄÄÄÄÄÄÄÄÄÄÄÄÄÄÄÄÄÄÄÄÄÄÄÄÄÄÄÄÄÄÄÄÄÄÄÄÄÄÄÄÄÄÄÄÄÄÄÄÄÄÄÄÄÄÄÄÄÄÄÄÄÄÄÄÄÄÄÄÄÄÄÄÄÄÄÄÄÄÄÄÄÄÄÄÄÄÄÄÄÄÄÄÄÄÄÄÄÄÄÄÄÄÄÄÄÄÄÄÄÄÄÄÄÄÄÄÄÄÄÄÄÄÄÄÄÄÄÄÄÄÄÄÄÄÄÄÄÄÄÄÄÄÄÄÄÄÄÄÄÄÄÄÄÄÄÄÄÄÄÄÄÄÄÄÄÄÄÄÄÄÄÄÄÄÄÄÄÄÄÄÄÄÄÄÄÄÄÄÄÄÄÄÄÄÄÄÄ')
SQL ERROR [ mssqlnative ]<br /><br />SQLSTATE: 22001
code: 8152
message: [Microsoft][SQL Server Native Client 11.0][SQL Server]String or binary data would be truncated.
SQLSTATE: 01000
code: 3621
message: [Microsoft][SQL Server Native Client 11.0][SQL Server]The statement has been terminated.
 [3621]<br /><br />An sql error occurred while fetching this page. Please contact an administrator if this problem persists.
(4 more lines...)
phpbb_dbal_db_tools_test::test_created_column with data set #25 ('c_vchar_uni_size', 'ÄÄÄÄ')
SQL ERROR [ mssqlnative ]<br /><br />SQLSTATE: 22001
code: 8152
message: [Microsoft][SQL Server Native Client 11.0][SQL Server]String or binary data would be truncated.
SQLSTATE: 01000
code: 3621
message: [Microsoft][SQL Server Native Client 11.0][SQL Server]The statement has been terminated.
 [3621]<br /><br />An sql error occurred while fetching this page. Please contact an administrator if this problem persists.
(4 more lines...)
phpbb_dbal_db_tools_test::test_created_column with data set #24 ('c_vchar_uni', 'ÄÄÄÄÄÄÄÄÄÄÄÄÄÄÄÄÄÄÄÄÄÄÄÄÄÄÄÄÄÄÄÄÄÄÄÄÄÄÄÄÄÄÄÄÄÄÄÄÄÄÄÄÄÄÄÄÄÄÄÄÄÄÄÄÄÄÄÄÄÄÄÄÄÄÄÄÄÄÄÄÄÄÄÄÄÄÄÄÄÄÄÄÄÄÄÄÄÄÄÄÄÄÄÄÄÄÄÄÄÄÄÄÄÄÄÄÄÄÄÄÄÄÄÄÄÄÄÄÄÄÄÄÄÄÄÄÄÄÄÄÄÄÄÄÄÄÄÄÄÄÄÄÄÄÄÄÄÄÄÄÄÄÄÄÄÄÄÄÄÄÄÄÄÄÄÄÄÄÄÄÄÄÄÄÄÄÄÄÄÄÄÄÄÄÄÄÄÄÄÄÄÄÄÄÄÄÄÄÄÄÄÄÄÄÄÄÄÄÄÄÄÄÄÄÄÄÄÄÄÄÄÄÄÄÄÄÄÄÄÄÄÄÄÄÄÄÄÄÄÄÄÄÄÄÄ')
SQL ERROR [ mssqlnative ]<br /><br />SQLSTATE: 22001
code: 8152
message: [Microsoft][SQL Server Native Client 11.0][SQL Server]String or binary data would be truncated.
SQLSTATE: 01000
code: 3621
message: [Microsoft][SQL Server Native Client 11.0][SQL Server]The statement has been terminated.
 [3621]<br /><br />An sql error occurred while fetching this page. Please contact an administrator if this problem persists.
(4 more lines...)
phpbb_dbal_db_tools_test::test_column_change_with_composite_primary
SQL ERROR [ mssqlnative ]<br /><br />SQLSTATE: 42000
code: 102
message: [Microsoft][SQL Server Native Client 11.0][SQL Server]Incorrect syntax near '1'.
 [102]<br /><br />An sql error occurred while fetching this page. Please contact an administrator if this problem persists.

C:\Users\Administrator\bamboo-agent-home\xml-data\build-dir\PHPBB3-MSSQLNATIVE-BUILD\phpBB\phpbb\db\driver\driver.php:844
C:\Users\Administrator\bamboo-agent-home\xml-data\build-dir\PHPBB3-MSSQLNATIVE-BUILD\phpBB\phpbb\db\driver\mssqlnative.php:143
(3 more lines...)
phpbb_dbal_db_tools_test::test_list_columns
Failed asserting that two arrays are equal.
--- Expected
+++ Actual
@@ @@
 Array (
-    0 => 'c_id'
-    1 => 'c_int_size'
(57 more lines...)
phpbb_dbal_schema_test::test_config_value_multibyte
SQL ERROR [ mssqlnative ]<br /><br />SQLSTATE: 22001
code: 8152
message: [Microsoft][SQL Server Native Client 11.0][SQL Server]String or binary data would be truncated.
SQLSTATE: 01000
code: 3621
message: [Microsoft][SQL Server Native Client 11.0][SQL Server]The statement has been terminated.
 [3621]<br /><br />An sql error occurred while fetching this page. Please contact an administrator if this problem persists.
(4 more lines...)
phpbb_extension_manager_test::test_disable
PHPUnit_Extensions_Database_Operation_Exception: COMPOSITE[INSERT] operation failed on query: 
                INSERT INTO phpbb_ext
                (ext_name, ext_active, ext_state)
                VALUES
                (?, ?, ?)
             using args: Array
(
(8 more lines...)
phpbb_extension_manager_test::test_all_available
PHPUnit_Extensions_Database_Operation_Exception: COMPOSITE[INSERT] operation failed on query: 
                INSERT INTO phpbb_ext
                (ext_name, ext_active, ext_state)
                VALUES
                (?, ?, ?)
             using args: Array
(
(8 more lines...)
phpbb_extension_manager_test::test_all_enabled
PHPUnit_Extensions_Database_Operation_Exception: COMPOSITE[INSERT] operation failed on query: 
                INSERT INTO phpbb_ext
                (ext_name, ext_active, ext_state)
                VALUES
                (?, ?, ?)
             using args: Array
(
(8 more lines...)
phpbb_extension_manager_test::test_is_available
PHPUnit_Extensions_Database_Operation_Exception: COMPOSITE[INSERT] operation failed on query: 
                INSERT INTO phpbb_ext
                (ext_name, ext_active, ext_state)
                VALUES
                (?, ?, ?)
             using args: Array
(
(8 more lines...)
phpbb_extension_manager_test::test_is_purged
PHPUnit_Extensions_Database_Operation_Exception: COMPOSITE[INSERT] operation failed on query: 
                INSERT INTO phpbb_ext
                (ext_name, ext_active, ext_state)
                VALUES
                (?, ?, ?)
             using args: Array
(
(8 more lines...)
phpbb_extension_manager_test::test_enable
PHPUnit_Extensions_Database_Operation_Exception: COMPOSITE[INSERT] operation failed on query: 
                INSERT INTO phpbb_ext
                (ext_name, ext_active, ext_state)
                VALUES
                (?, ?, ?)
             using args: Array
(
(8 more lines...)
phpbb_extension_manager_test::test_is_configured
PHPUnit_Extensions_Database_Operation_Exception: COMPOSITE[INSERT] operation failed on query: 
                INSERT INTO phpbb_ext
                (ext_name, ext_active, ext_state)
                VALUES
                (?, ?, ?)
             using args: Array
(
(8 more lines...)
phpbb_extension_manager_test::test_purge
PHPUnit_Extensions_Database_Operation_Exception: COMPOSITE[INSERT] operation failed on query: 
                INSERT INTO phpbb_ext
                (ext_name, ext_active, ext_state)
                VALUES
                (?, ?, ?)
             using args: Array
(
(8 more lines...)
phpbb_extension_manager_test::test_is_disabled
PHPUnit_Extensions_Database_Operation_Exception: COMPOSITE[INSERT] operation failed on query: 
                INSERT INTO phpbb_ext
                (ext_name, ext_active, ext_state)
                VALUES
                (?, ?, ?)
             using args: Array
(
(8 more lines...)
phpbb_extension_manager_test::test_is_enabled
PHPUnit_Extensions_Database_Operation_Exception: COMPOSITE[INSERT] operation failed on query: 
                INSERT INTO phpbb_ext
                (ext_name, ext_active, ext_state)
                VALUES
                (?, ?, ?)
             using args: Array
(
(8 more lines...)
phpbb_extension_manager_test::test_enabled_no_cache
PHPUnit_Extensions_Database_Operation_Exception: COMPOSITE[INSERT] operation failed on query: 
                INSERT INTO phpbb_ext
                (ext_name, ext_active, ext_state)
                VALUES
                (?, ?, ?)
             using args: Array
(
(8 more lines...)
phpbb_extension_manager_test::test_all_configured
PHPUnit_Extensions_Database_Operation_Exception: COMPOSITE[INSERT] operation failed on query: 
                INSERT INTO phpbb_ext
                (ext_name, ext_active, ext_state)
                VALUES
                (?, ?, ?)
             using args: Array
(
(8 more lines...)
phpbb_extension_metadata_manager_test::test_foo
PHPUnit_Extensions_Database_Operation_Exception: COMPOSITE[INSERT] operation failed on query: 
                INSERT INTO phpbb_ext
                (ext_name, ext_active, ext_state)
                VALUES
                (?, ?, ?)
             using args: Array
(
(8 more lines...)
phpbb_extension_metadata_manager_test::test_bar
PHPUnit_Extensions_Database_Operation_Exception: COMPOSITE[INSERT] operation failed on query: 
                INSERT INTO phpbb_ext
                (ext_name, ext_active, ext_state)
                VALUES
                (?, ?, ?)
             using args: Array
(
(8 more lines...)
phpbb_extension_metadata_manager_test::test_validator_valid
PHPUnit_Extensions_Database_Operation_Exception: COMPOSITE[INSERT] operation failed on query: 
                INSERT INTO phpbb_ext
                (ext_name, ext_active, ext_state)
                VALUES
                (?, ?, ?)
             using args: Array
(
(8 more lines...)
phpbb_extension_metadata_manager_test::test_validator_invalid with data set #1 ('type', 'asdf')
PHPUnit_Extensions_Database_Operation_Exception: COMPOSITE[INSERT] operation failed on query: 
                INSERT INTO phpbb_ext
                (ext_name, ext_active, ext_state)
                VALUES
                (?, ?, ?)
             using args: Array
(
(8 more lines...)
phpbb_extension_metadata_manager_test::test_validator_invalid with data set #2 ('license', '')
PHPUnit_Extensions_Database_Operation_Exception: COMPOSITE[INSERT] operation failed on query: 
                INSERT INTO phpbb_ext
                (ext_name, ext_active, ext_state)
                VALUES
                (?, ?, ?)
             using args: Array
(
(8 more lines...)
phpbb_extension_metadata_manager_test::test_validator_invalid with data set #0 ('name', 'asdf')
PHPUnit_Extensions_Database_Operation_Exception: COMPOSITE[INSERT] operation failed on query: 
                INSERT INTO phpbb_ext
                (ext_name, ext_active, ext_state)
                VALUES
                (?, ?, ?)
             using args: Array
(
(8 more lines...)
phpbb_extension_metadata_manager_test::test_validator_invalid with data set #3 ('version', '')
PHPUnit_Extensions_Database_Operation_Exception: COMPOSITE[INSERT] operation failed on query: 
                INSERT INTO phpbb_ext
                (ext_name, ext_active, ext_state)
                VALUES
                (?, ?, ?)
             using args: Array
(
(8 more lines...)
phpbb_extension_metadata_manager_test::test_validator_non_existing with data set #0 ('name')
PHPUnit_Extensions_Database_Operation_Exception: COMPOSITE[INSERT] operation failed on query: 
                INSERT INTO phpbb_ext
                (ext_name, ext_active, ext_state)
                VALUES
                (?, ?, ?)
             using args: Array
(
(8 more lines...)
phpbb_extension_metadata_manager_test::test_validator_non_existing with data set #2 ('license')
PHPUnit_Extensions_Database_Operation_Exception: COMPOSITE[INSERT] operation failed on query: 
                INSERT INTO phpbb_ext
                (ext_name, ext_active, ext_state)
                VALUES
                (?, ?, ?)
             using args: Array
(
(8 more lines...)
phpbb_extension_metadata_manager_test::test_validator_non_existing with data set #1 ('type')
PHPUnit_Extensions_Database_Operation_Exception: COMPOSITE[INSERT] operation failed on query: 
                INSERT INTO phpbb_ext
                (ext_name, ext_active, ext_state)
                VALUES
                (?, ?, ?)
             using args: Array
(
(8 more lines...)
phpbb_extension_metadata_manager_test::test_validator_non_existing with data set #3 ('version')
PHPUnit_Extensions_Database_Operation_Exception: COMPOSITE[INSERT] operation failed on query: 
                INSERT INTO phpbb_ext
                (ext_name, ext_active, ext_state)
                VALUES
                (?, ?, ?)
             using args: Array
(
(8 more lines...)
phpbb_extension_metadata_manager_test::test_validator_non_existing_authors
PHPUnit_Extensions_Database_Operation_Exception: COMPOSITE[INSERT] operation failed on query: 
                INSERT INTO phpbb_ext
                (ext_name, ext_active, ext_state)
                VALUES
                (?, ?, ?)
             using args: Array
(
(8 more lines...)
phpbb_extension_metadata_manager_test::test_validator_requirements with data set #3 ('<5.4.17', '<3.1.0', false, false, 'Versions are not compared at the moment')
PHPUnit_Extensions_Database_Operation_Exception: COMPOSITE[INSERT] operation failed on query: 
                INSERT INTO phpbb_ext
                (ext_name, ext_active, ext_state)
                VALUES
                (?, ?, ?)
             using args: Array
(
(8 more lines...)