Performs unit tests on SQL Server 2012 using the MSSQL Native driver

Build: #31 failed Rebuilt by nickvergessen

Build result summary

Details

Completed
Duration
5 minutes
Flags
Custom build
Labels
pr_3332 Edit labels
Revision
9cdbb69f9e50f665caad54fc93f64143cb7d8fc8 9cdbb69f9e50f665caad54fc93f64143cb7d8fc8
Total tests
3963
Failing since
#21 (Rebuilt by Patrick Webster)
Number of retries
2

Responsible

This build has been failing since #21
No one has taken responsibility

Custom variables

Name Value
PRnumber 3332

Tests

New test failures 10
Status Test View job Duration
Collapse Failed phpbb_functions_user_delete_user_test::test_delete_data test_delete_data with data set #1 History
Build and Test < 1 sec
phpbb_functions_user_delete_user_test::test_delete_data with data set #1 ('remove', array(array(1, 2)), array(array(1, 3)), array(array(2), array(3)), array(array('12345678901234567890123456789013')), array(array(2, 1, 1), array(3, 1, 1)), array(array(1, 3, 3), array(2, 1, 1)))
PHPUnit_Extensions_Database_Operation_Exception: COMPOSITE[INSERT] operation failed on query: 
                INSERT INTO phpbb_privmsgs_to
                (msg_id, user_id, author_id)
                VALUES
                (?, ?, ?)
             using args: Array
(
(8 more lines...)
Collapse Failed phpbb_functions_user_delete_user_test::test_delete_data test_delete_data with data set #0 History
Build and Test < 1 sec
phpbb_functions_user_delete_user_test::test_delete_data with data set #0 ('retain', array(array(1, 4)), array(array(1, 3)), array(array(2), array(3)), array(array('12345678901234567890123456789013')), array(array(2, 1, 1), array(3, 1, 1)), array(array(1, 3, 3), array(2, 1, 1)))
PHPUnit_Extensions_Database_Operation_Exception: COMPOSITE[INSERT] operation failed on query: 
                INSERT INTO phpbb_privmsgs_to
                (msg_id, user_id, author_id)
                VALUES
                (?, ?, ?)
             using args: Array
(
(8 more lines...)
Collapse Failed phpbb_functions_user_delete_user_test::test_delete_user_id_data test_delete_user_id_data with data set #0 History
Build and Test < 1 sec
phpbb_functions_user_delete_user_test::test_delete_user_id_data with data set #0 ('retain', array('phpbb_user_group', 'phpbb_topics_watch', 'phpbb_forums_watch', 'phpbb_acl_users', 'phpbb_topics_track', 'phpbb_topics_posted', 'phpbb_forums_track', 'phpbb_profile_fields_data', 'phpbb_moderator_cache', 'phpbb_drafts', 'phpbb_bookmarks', 'phpbb_sessions_keys', 'phpbb_privmsgs_folder', 'phpbb_privmsgs_rules'))
PHPUnit_Extensions_Database_Operation_Exception: COMPOSITE[INSERT] operation failed on query: 
                INSERT INTO phpbb_privmsgs_to
                (msg_id, user_id, author_id)
                VALUES
                (?, ?, ?)
             using args: Array
(
(8 more lines...)
Collapse Failed phpbb_functions_user_delete_user_test::test_delete_user_id_data test_delete_user_id_data with data set #1 History
Build and Test < 1 sec
phpbb_functions_user_delete_user_test::test_delete_user_id_data with data set #1 ('remove', array('phpbb_user_group', 'phpbb_topics_watch', 'phpbb_forums_watch', 'phpbb_acl_users', 'phpbb_topics_track', 'phpbb_topics_posted', 'phpbb_forums_track', 'phpbb_profile_fields_data', 'phpbb_moderator_cache', 'phpbb_drafts', 'phpbb_bookmarks', 'phpbb_sessions_keys', 'phpbb_privmsgs_folder', 'phpbb_privmsgs_rules'))
PHPUnit_Extensions_Database_Operation_Exception: COMPOSITE[INSERT] operation failed on query: 
                INSERT INTO phpbb_privmsgs_to
                (msg_id, user_id, author_id)
                VALUES
                (?, ?, ?)
             using args: Array
(
(8 more lines...)
Collapse Failed phpbb_functions_user_delete_user_test::test_first_last_post_info test_first_last_post_info with data set #0 History
Build and Test < 1 sec
phpbb_functions_user_delete_user_test::test_first_last_post_info with data set #0 ('retain', false, array(array(1, 1, ''), array(2, 1, 'Other'), array(3, 1, ''), array(4, 1, 'Other')), array(array(1, 1, '', '', 1, '', ''), array(2, 1, 'Other', '', 1, 'Other', ''), array(3, 1, '', '', 1, '', ''), array(4, 1, 'Other', '', 1, 'Other', '')), array(array(1, 1, '', ''), array(2, 1, 'Other', ''), array(3, 1, '', ''), array(4, 1, 'Other', '')))
PHPUnit_Extensions_Database_Operation_Exception: COMPOSITE[INSERT] operation failed on query: 
                INSERT INTO phpbb_privmsgs_to
                (msg_id, user_id, author_id)
                VALUES
                (?, ?, ?)
             using args: Array
(
(8 more lines...)
Collapse Failed phpbb_functions_user_delete_user_test::test_first_last_post_info test_first_last_post_info with data set #1 History
Build and Test < 1 sec
phpbb_functions_user_delete_user_test::test_first_last_post_info with data set #1 ('remove', false, array(array(2, 1, 'Other'), array(4, 1, 'Other')), array(array(2, 1, 'Other', '', 1, 'Other', ''), array(4, 1, 'Other', '', 1, 'Other', '')), array(array(1, 0, '', ''), array(2, 1, 'Other', ''), array(3, 0, '', ''), array(4, 1, 'Other', '')))
PHPUnit_Extensions_Database_Operation_Exception: COMPOSITE[INSERT] operation failed on query: 
                INSERT INTO phpbb_privmsgs_to
                (msg_id, user_id, author_id)
                VALUES
                (?, ?, ?)
             using args: Array
(
(8 more lines...)
Collapse Failed phpbb_functions_user_delete_user_test::test_first_last_post_info test_first_last_post_info with data set #2 History
Build and Test < 1 sec
phpbb_functions_user_delete_user_test::test_first_last_post_info with data set #2 ('retain', true, array(array(1, 1, 'Foobar'), array(2, 1, 'Other'), array(3, 1, 'Foobar'), array(4, 1, 'Other')), array(array(1, 1, 'Foobar', '', 1, 'Foobar', ''), array(2, 1, 'Other', '', 1, 'Other', ''), array(3, 1, 'Foobar', '', 1, 'Foobar', ''), array(4, 1, 'Other', '', 1, 'Other', '')), array(array(1, 1, 'Foobar', ''), array(2, 1, 'Other', ''), array(3, 1, 'Foobar', ''), array(4, 1, 'Other', '')))
PHPUnit_Extensions_Database_Operation_Exception: COMPOSITE[INSERT] operation failed on query: 
                INSERT INTO phpbb_privmsgs_to
                (msg_id, user_id, author_id)
                VALUES
                (?, ?, ?)
             using args: Array
(
(8 more lines...)
Collapse Failed phpbb_functions_user_delete_user_test::test_first_last_post_info test_first_last_post_info with data set #3 History
Build and Test < 1 sec
phpbb_functions_user_delete_user_test::test_first_last_post_info with data set #3 ('remove', true, array(array(2, 1, 'Other'), array(4, 1, 'Other')), array(array(2, 1, 'Other', '', 1, 'Other', ''), array(4, 1, 'Other', '', 1, 'Other', '')), array(array(1, 0, '', ''), array(2, 1, 'Other', ''), array(3, 0, '', ''), array(4, 1, 'Other', '')))
PHPUnit_Extensions_Database_Operation_Exception: COMPOSITE[INSERT] operation failed on query: 
                INSERT INTO phpbb_privmsgs_to
                (msg_id, user_id, author_id)
                VALUES
                (?, ?, ?)
             using args: Array
(
(8 more lines...)
Collapse Failed phpbb_functions_user_delete_user_test::test_report_attachment_info test_report_attachment_info with data set #1 History
Build and Test < 1 sec
phpbb_functions_user_delete_user_test::test_report_attachment_info with data set #1 ('remove', array(array(2, 1, 1, 1), array(4, 0, 1, 1)), array(array(3, 2, 1)), array(array(2, 1, 1), array(4, 0, 1)), array(array(2, 2, 1), array(3, 0, 2)))
PHPUnit_Extensions_Database_Operation_Exception: COMPOSITE[INSERT] operation failed on query: 
                INSERT INTO phpbb_privmsgs_to
                (msg_id, user_id, author_id)
                VALUES
                (?, ?, ?)
             using args: Array
(
(8 more lines...)
Collapse Failed phpbb_functions_user_delete_user_test::test_report_attachment_info test_report_attachment_info with data set #0 History
Build and Test < 1 sec
phpbb_functions_user_delete_user_test::test_report_attachment_info with data set #0 ('retain', array(array(1, 1, 1, 1), array(2, 1, 1, 1), array(3, 0, 1, 1), array(4, 0, 1, 1)), array(array(1, 1, 1), array(3, 2, 1)), array(array(1, 1, 1), array(2, 1, 1), array(3, 0, 1), array(4, 0, 1)), array(array(1, 1, 1), array(2, 2, 1), array(3, 0, 1)))
PHPUnit_Extensions_Database_Operation_Exception: COMPOSITE[INSERT] operation failed on query: 
                INSERT INTO phpbb_privmsgs_to
                (msg_id, user_id, author_id)
                VALUES
                (?, ?, ?)
             using args: Array
(
(8 more lines...)
Existing test failures 201
Status Test Failing since View job Duration
phpbb_auth_provider_oauth_token_storage_test::test_hasAccessToken with data set #1 (OAuth\OAuth2\Token\StdOAuth2Token, true)
PHPUnit_Extensions_Database_Operation_Exception: COMPOSITE[INSERT] operation failed on query: 
                INSERT INTO phpbb_oauth_tokens
                (user_id, session_id, provider, oauth_token)
                VALUES
                (?, ?, ?, ?)
             using args: Array
(
(9 more lines...)
phpbb_auth_provider_oauth_token_storage_test::test_hasAccessToken with data set #0 (NULL, false)
PHPUnit_Extensions_Database_Operation_Exception: COMPOSITE[INSERT] operation failed on query: 
                INSERT INTO phpbb_oauth_tokens
                (user_id, session_id, provider, oauth_token)
                VALUES
                (?, ?, ?, ?)
             using args: Array
(
(9 more lines...)
phpbb_auth_provider_oauth_token_storage_test::test_clearToken
PHPUnit_Extensions_Database_Operation_Exception: COMPOSITE[INSERT] operation failed on query: 
                INSERT INTO phpbb_oauth_tokens
                (user_id, session_id, provider, oauth_token)
                VALUES
                (?, ?, ?, ?)
             using args: Array
(
(9 more lines...)
phpbb_auth_provider_oauth_token_storage_test::test_set_user_id
PHPUnit_Extensions_Database_Operation_Exception: COMPOSITE[INSERT] operation failed on query: 
                INSERT INTO phpbb_oauth_tokens
                (user_id, session_id, provider, oauth_token)
                VALUES
                (?, ?, ?, ?)
             using args: Array
(
(9 more lines...)
phpbb_auth_provider_oauth_token_storage_test::test_has_access_token_by_session with data set #0 (NULL, false)
PHPUnit_Extensions_Database_Operation_Exception: COMPOSITE[INSERT] operation failed on query: 
                INSERT INTO phpbb_oauth_tokens
                (user_id, session_id, provider, oauth_token)
                VALUES
                (?, ?, ?, ?)
             using args: Array
(
(9 more lines...)
phpbb_auth_provider_oauth_token_storage_test::test_has_access_token_by_session with data set #1 (OAuth\OAuth2\Token\StdOAuth2Token, true)
PHPUnit_Extensions_Database_Operation_Exception: COMPOSITE[INSERT] operation failed on query: 
                INSERT INTO phpbb_oauth_tokens
                (user_id, session_id, provider, oauth_token)
                VALUES
                (?, ?, ?, ?)
             using args: Array
(
(9 more lines...)
phpbb_auth_provider_oauth_token_storage_test::test_retrieveAccessToken_from_db
PHPUnit_Extensions_Database_Operation_Exception: COMPOSITE[INSERT] operation failed on query: 
                INSERT INTO phpbb_oauth_tokens
                (user_id, session_id, provider, oauth_token)
                VALUES
                (?, ?, ?, ?)
             using args: Array
(
(9 more lines...)
phpbb_auth_provider_oauth_token_storage_test::test_retrieveAccessToken with data set #1 (NULL, 'OAuth\\Common\\Storage\\Exception\\TokenNotFoundException')
PHPUnit_Extensions_Database_Operation_Exception: COMPOSITE[INSERT] operation failed on query: 
                INSERT INTO phpbb_oauth_tokens
                (user_id, session_id, provider, oauth_token)
                VALUES
                (?, ?, ?, ?)
             using args: Array
(
(9 more lines...)
phpbb_auth_provider_oauth_token_storage_test::test_retrieveAccessToken_wrong_token
PHPUnit_Extensions_Database_Operation_Exception: COMPOSITE[INSERT] operation failed on query: 
                INSERT INTO phpbb_oauth_tokens
                (user_id, session_id, provider, oauth_token)
                VALUES
                (?, ?, ?, ?)
             using args: Array
(
(9 more lines...)
phpbb_auth_provider_oauth_token_storage_test::test_retrieveAccessToken with data set #0 (OAuth\OAuth2\Token\StdOAuth2Token, NULL)
PHPUnit_Extensions_Database_Operation_Exception: COMPOSITE[INSERT] operation failed on query: 
                INSERT INTO phpbb_oauth_tokens
                (user_id, session_id, provider, oauth_token)
                VALUES
                (?, ?, ?, ?)
             using args: Array
(
(9 more lines...)
phpbb_auth_provider_oauth_token_storage_test::test_retrieve_access_token_by_session with data set #0 (OAuth\OAuth2\Token\StdOAuth2Token, NULL)
PHPUnit_Extensions_Database_Operation_Exception: COMPOSITE[INSERT] operation failed on query: 
                INSERT INTO phpbb_oauth_tokens
                (user_id, session_id, provider, oauth_token)
                VALUES
                (?, ?, ?, ?)
             using args: Array
(
(9 more lines...)
phpbb_auth_provider_oauth_token_storage_test::test_retrieve_access_token_by_session with data set #1 (NULL, 'OAuth\\Common\\Storage\\Exception\\TokenNotFoundException')
PHPUnit_Extensions_Database_Operation_Exception: COMPOSITE[INSERT] operation failed on query: 
                INSERT INTO phpbb_oauth_tokens
                (user_id, session_id, provider, oauth_token)
                VALUES
                (?, ?, ?, ?)
             using args: Array
(
(9 more lines...)
phpbb_auth_provider_oauth_token_storage_test::test_storeAccessToken
PHPUnit_Extensions_Database_Operation_Exception: COMPOSITE[INSERT] operation failed on query: 
                INSERT INTO phpbb_oauth_tokens
                (user_id, session_id, provider, oauth_token)
                VALUES
                (?, ?, ?, ?)
             using args: Array
(
(9 more lines...)
phpbb_auth_provider_oauth_token_storage_test::test_retrieve_access_token_by_session_from_db
PHPUnit_Extensions_Database_Operation_Exception: COMPOSITE[INSERT] operation failed on query: 
                INSERT INTO phpbb_oauth_tokens
                (user_id, session_id, provider, oauth_token)
                VALUES
                (?, ?, ?, ?)
             using args: Array
(
(9 more lines...)
phpbb_dbal_cross_join_test::test_cross_join
PHPUnit_Extensions_Database_Operation_Exception: COMPOSITE[INSERT] operation failed on query: 
                INSERT INTO phpbb_user_group
                (user_id, group_id)
                VALUES
                (?, ?)
             using args: Array
(
(6 more lines...)
phpbb_dbal_db_tools_test::test_column_remove_primary
SQL ERROR [ mssqlnative ]<br /><br />SQLSTATE: 42000
code: 3723
message: [Microsoft][SQL Server Native Client 11.0][SQL Server]An explicit DROP INDEX is not allowed on index 'prefix_table_name.PK_prefix_table_name'. It is being used for PRIMARY KEY constraint enforcement.
 [3723]<br /><br />An sql error occurred while fetching this page. Please contact an administrator if this problem persists.

C:\Users\Administrator\bamboo-agent-home\xml-data\build-dir\PHPBB3-MSSQLNATIVE-BUILD\phpBB\phpbb\db\driver\driver.php:855
C:\Users\Administrator\bamboo-agent-home\xml-data\build-dir\PHPBB3-MSSQLNATIVE-BUILD\phpBB\phpbb\db\driver\mssqlnative.php:143
(3 more lines...)
phpbb_dbal_db_tools_test::test_created_column with data set #16 ('c_stext_uni', 'ÄÄÄÄÄÄÄÄÄÄÄÄÄÄÄÄÄÄÄÄÄÄÄÄÄÄÄÄÄÄÄÄÄÄÄÄÄÄÄÄÄÄÄÄÄÄÄÄÄÄÄÄÄÄÄÄÄÄÄÄÄÄÄÄÄÄÄÄÄÄÄÄÄÄÄÄÄÄÄÄÄÄÄÄÄÄÄÄÄÄÄÄÄÄÄÄÄÄÄÄÄÄÄÄÄÄÄÄÄÄÄÄÄÄÄÄÄÄÄÄÄÄÄÄÄÄÄÄÄÄÄÄÄÄÄÄÄÄÄÄÄÄÄÄÄÄÄÄÄÄÄÄÄÄÄÄÄÄÄÄÄÄÄÄÄÄÄÄÄÄÄÄÄÄÄÄÄÄÄÄÄÄÄÄÄÄÄÄÄÄÄÄÄÄÄÄÄÄÄÄÄÄÄÄÄÄÄÄÄÄÄÄÄÄÄÄÄÄÄÄÄÄÄÄÄÄÄÄÄÄÄÄÄÄÄÄÄÄÄÄÄÄÄÄÄÄÄÄÄÄÄÄÄÄÄ')
SQL ERROR [ mssqlnative ]<br /><br />SQLSTATE: 22001
code: 8152
message: [Microsoft][SQL Server Native Client 11.0][SQL Server]String or binary data would be truncated.
SQLSTATE: 01000
code: 3621
message: [Microsoft][SQL Server Native Client 11.0][SQL Server]The statement has been terminated.
 [3621]<br /><br />An sql error occurred while fetching this page. Please contact an administrator if this problem persists.
(4 more lines...)
phpbb_dbal_db_tools_test::test_created_column with data set #15 ('c_xstext_uni', 'ÄÄÄÄÄÄÄÄÄÄÄÄÄÄÄÄÄÄÄÄÄÄÄÄÄÄÄÄÄÄÄÄÄÄÄÄÄÄÄÄÄÄÄÄÄÄÄÄÄÄÄÄÄÄÄÄÄÄÄÄÄÄÄÄÄÄÄÄÄÄÄÄÄÄÄÄÄÄÄÄÄÄÄÄÄÄÄÄÄÄÄÄÄÄÄÄÄÄÄÄ')
SQL ERROR [ mssqlnative ]<br /><br />SQLSTATE: 22001
code: 8152
message: [Microsoft][SQL Server Native Client 11.0][SQL Server]String or binary data would be truncated.
SQLSTATE: 01000
code: 3621
message: [Microsoft][SQL Server Native Client 11.0][SQL Server]The statement has been terminated.
 [3621]<br /><br />An sql error occurred while fetching this page. Please contact an administrator if this problem persists.
(4 more lines...)
phpbb_dbal_db_tools_test::test_created_column with data set #17 ('c_text_uni', 'ÄÄÄÄÄÄÄÄÄÄÄÄÄÄÄÄÄÄÄÄÄÄÄÄÄÄÄÄÄÄÄÄÄÄÄÄÄÄÄÄÄÄÄÄÄÄÄÄÄÄÄÄÄÄÄÄÄÄÄÄÄÄÄÄÄÄÄÄÄÄÄÄÄÄÄÄÄÄÄÄÄÄÄÄÄÄÄÄÄÄÄÄÄÄÄÄÄÄÄÄÄÄÄÄÄÄÄÄÄÄÄÄÄÄÄÄÄÄÄÄÄÄÄÄÄÄÄÄÄÄÄÄÄÄÄÄÄÄÄÄÄÄÄÄÄÄÄÄÄÄÄÄÄÄÄÄÄÄÄÄÄÄÄÄÄÄÄÄÄÄÄÄÄÄÄÄÄÄÄÄÄÄÄÄÄÄÄÄÄÄÄÄÄÄÄÄÄÄÄÄÄÄÄÄÄÄÄÄÄÄÄÄÄÄÄÄÄÄÄÄÄÄÄÄÄÄÄÄÄÄÄÄÄÄÄÄÄÄÄÄÄÄÄÄÄÄÄÄÄÄÄÄÄÄÄÄÄÄÄÄÄÄÄÄÄÄÄÄÄÄÄÄÄÄÄÄÄÄÄÄÄÄÄÄÄÄÄÄÄÄÄÄÄÄÄÄÄÄÄÄÄÄÄÄÄÄÄÄÄÄÄÄÄÄÄÄÄÄÄÄÄÄÄÄÄÄÄÄÄÄÄÄÄÄÄÄÄÄÄÄÄÄÄÄÄÄÄÄÄÄÄÄÄÄÄÄÄÄÄÄÄÄÄÄÄÄÄÄÄÄÄÄÄÄÄÄÄÄÄÄÄÄÄÄÄÄÄÄÄÄÄÄÄÄÄÄÄÄÄÄÄÄÄÄÄÄÄÄÄÄÄÄÄÄÄÄÄÄÄÄÄÄÄÄÄÄÄÄÄÄÄÄÄÄÄÄÄÄÄÄÄÄÄÄÄÄÄÄÄÄÄÄÄÄÄÄÄÄÄÄÄÄÄÄÄÄÄÄÄÄÄÄÄÄÄÄÄÄÄÄÄÄÄÄÄÄÄÄÄÄÄÄÄÄÄÄÄÄÄÄÄÄÄÄÄÄÄÄÄÄÄÄÄÄÄÄÄÄÄÄÄÄÄÄÄÄÄÄÄÄÄÄÄÄÄÄÄÄÄÄÄÄÄÄÄÄÄÄÄÄÄÄÄÄÄÄÄÄÄÄÄÄÄÄÄÄÄÄÄÄÄÄÄÄÄÄÄÄÄÄÄÄÄÄÄÄÄÄÄÄÄÄÄÄÄÄÄÄÄÄÄÄÄÄÄÄÄÄÄÄÄÄÄÄÄÄÄÄÄÄÄÄÄÄÄÄÄÄÄÄÄÄÄÄÄÄÄÄÄÄÄÄÄÄÄÄÄÄÄÄÄÄÄÄÄÄÄÄÄÄÄÄÄÄÄÄÄÄÄÄÄÄÄÄÄÄÄÄÄÄÄÄÄÄÄÄÄÄÄÄÄÄÄÄÄÄÄÄÄÄÄÄÄÄÄÄÄÄÄÄÄÄÄÄÄÄÄÄÄÄÄÄÄÄÄÄÄÄÄÄÄÄÄÄÄÄÄÄÄÄÄÄÄÄÄÄÄÄÄÄÄÄÄÄÄÄÄÄÄÄÄÄÄÄÄÄÄÄÄÄÄÄÄÄÄÄÄÄÄÄÄÄÄÄÄÄÄÄÄÄÄÄÄÄÄÄÄÄÄÄÄÄÄÄÄÄÄÄÄÄÄÄÄÄÄÄÄÄÄÄÄÄÄÄÄÄÄÄÄÄÄÄÄÄÄÄÄÄÄÄÄÄÄÄÄÄÄÄÄÄÄÄÄÄÄÄÄÄÄÄÄÄÄÄÄÄÄÄÄÄÄÄÄÄÄÄÄÄÄÄÄÄÄÄÄÄÄÄÄÄÄÄÄÄÄÄÄÄÄÄÄÄÄÄÄÄÄÄÄÄÄÄÄÄÄÄÄÄÄÄÄÄÄÄÄÄÄÄÄÄÄÄÄÄÄÄÄÄÄÄÄÄÄÄÄÄÄÄÄÄÄÄÄÄÄÄÄÄÄÄÄÄÄÄÄÄÄÄÄÄÄÄÄÄÄÄÄÄÄÄÄÄÄÄÄÄÄÄÄÄÄÄÄÄÄÄÄÄÄÄÄÄÄÄÄÄÄÄÄÄÄÄÄÄÄÄÄÄÄÄÄÄÄÄÄÄÄÄÄÄÄÄÄÄÄÄÄÄÄÄÄÄÄÄÄÄÄÄÄÄÄÄÄÄÄÄÄÄÄÄÄÄÄÄÄÄÄÄÄÄÄÄÄÄÄÄÄÄÄÄÄÄÄÄÄÄÄÄÄÄÄÄÄÄÄÄÄÄÄÄÄÄÄÄÄÄÄÄÄÄÄÄÄÄÄÄÄÄÄÄÄÄÄÄÄÄÄÄÄÄÄÄÄÄÄÄÄÄÄÄÄÄÄÄÄÄÄÄÄÄÄÄÄÄÄÄÄÄÄÄÄÄÄÄÄÄÄÄÄÄÄÄÄÄÄÄÄÄÄÄÄÄÄÄÄÄÄÄÄÄÄÄÄÄÄÄÄÄÄÄÄÄÄÄÄÄÄÄÄÄÄÄÄÄÄÄÄÄÄÄÄÄÄÄÄÄÄÄÄÄÄÄÄÄÄÄÄÄÄÄÄÄÄÄÄÄÄÄÄÄÄÄÄÄÄÄÄÄÄÄÄÄÄÄÄÄÄÄÄÄÄÄÄÄÄÄÄÄÄÄÄÄÄÄÄÄÄÄÄÄÄÄÄÄÄÄÄÄÄÄÄÄÄÄÄÄÄÄÄÄÄÄÄÄÄÄÄÄÄÄÄÄÄÄÄÄÄÄÄÄÄÄÄÄÄÄÄÄÄÄÄÄÄÄÄÄÄÄÄÄÄÄÄÄÄÄÄÄÄÄÄÄÄÄÄÄÄÄÄÄÄÄÄÄÄÄÄÄÄÄÄÄÄÄÄÄÄÄÄÄÄÄÄÄÄÄÄÄÄÄÄÄÄÄÄÄÄÄÄÄÄÄÄÄÄÄÄÄÄÄÄÄÄÄÄÄÄÄÄÄÄÄÄÄÄÄÄÄÄÄÄÄÄÄÄÄÄÄÄÄÄÄÄÄÄÄÄÄÄÄÄÄÄÄÄÄÄÄÄÄÄÄÄÄÄÄÄÄÄÄÄÄÄÄÄÄÄÄÄÄÄÄÄÄÄÄÄÄÄÄÄÄÄÄÄÄÄÄÄÄÄÄÄÄÄÄÄÄÄÄÄÄÄÄÄÄÄÄÄÄÄÄÄÄÄÄÄÄÄÄÄÄÄÄÄÄÄÄÄÄÄÄÄÄÄÄÄÄÄÄÄÄÄÄÄÄÄÄÄÄÄÄÄÄÄÄÄÄÄÄÄÄÄÄÄÄÄÄÄÄÄÄÄÄÄÄÄÄÄÄÄÄÄÄÄÄÄÄÄÄÄÄÄÄÄÄÄÄÄÄÄÄÄÄÄÄÄÄÄÄÄÄÄÄÄÄÄÄÄÄÄÄÄÄÄÄÄÄÄÄÄÄÄÄÄÄÄÄÄÄÄÄÄÄÄÄÄÄÄÄÄÄÄÄÄÄÄÄÄÄÄÄÄÄÄÄÄÄÄÄÄÄÄÄÄÄÄÄÄÄÄÄÄÄÄÄÄÄÄÄÄÄÄÄÄÄÄÄÄÄÄÄÄÄÄÄÄÄÄÄÄÄÄÄÄÄÄÄÄÄÄÄÄÄÄÄÄÄÄÄÄÄÄÄÄÄÄÄÄÄÄÄÄÄÄÄÄÄÄÄÄÄÄÄÄÄÄÄÄÄÄÄÄÄÄÄÄÄÄÄÄÄÄÄÄÄÄÄÄÄÄÄÄÄÄÄÄÄÄÄÄÄÄÄÄÄÄÄÄÄÄÄÄÄÄÄÄÄÄÄÄÄÄÄÄÄÄÄÄÄÄÄÄÄÄÄÄÄÄÄÄÄÄÄÄÄÄÄÄÄÄÄÄÄÄÄÄÄÄÄÄÄÄÄÄÄÄÄÄÄÄÄÄÄÄÄÄÄÄÄÄÄÄÄÄÄÄÄÄÄÄÄÄÄÄÄÄÄÄÄÄÄÄÄÄÄÄÄÄÄÄÄÄÄÄÄÄÄÄÄÄÄÄÄÄÄÄÄÄÄÄÄÄÄÄÄÄÄÄÄÄÄÄÄÄÄÄÄÄÄÄÄÄÄÄÄÄÄÄÄÄÄÄÄÄÄÄÄÄÄÄÄÄÄÄÄÄÄÄÄÄÄÄÄÄÄÄÄÄÄÄÄÄÄÄÄÄÄÄÄÄÄÄÄÄÄÄÄÄÄÄÄÄÄÄÄÄÄÄÄÄÄÄÄÄÄÄÄÄÄÄÄÄÄÄÄÄÄÄÄÄÄÄÄÄÄÄÄÄÄÄÄÄÄÄÄÄÄÄÄÄÄÄÄÄÄÄÄÄÄÄÄÄÄÄÄÄÄÄÄÄÄÄÄÄÄÄÄÄÄÄÄÄÄÄÄÄÄÄÄÄÄÄÄÄÄÄÄÄÄÄÄÄÄÄÄÄÄÄÄÄÄÄÄÄÄÄÄÄÄÄÄÄÄÄÄÄÄÄÄÄÄÄÄÄÄÄÄÄÄÄÄÄÄÄÄÄÄÄÄÄÄÄÄÄÄÄÄÄÄÄÄÄÄÄÄÄÄÄÄÄÄÄÄÄÄÄÄÄÄÄÄÄÄÄÄÄÄÄÄÄÄÄÄÄÄÄÄÄÄÄÄÄÄÄÄÄÄÄÄÄÄÄÄÄÄÄÄÄÄÄÄÄÄÄÄÄÄÄÄÄÄÄÄÄÄÄÄÄÄÄÄÄÄÄÄÄÄÄÄÄÄÄÄÄÄÄÄÄÄÄÄÄÄÄÄÄÄÄÄÄÄÄÄÄÄÄÄÄÄÄÄÄÄÄÄÄÄÄÄÄÄÄÄÄÄÄÄÄÄÄÄÄÄÄÄÄÄÄÄÄÄÄÄÄÄÄÄÄÄÄÄÄÄÄÄÄÄÄÄÄÄÄÄÄÄÄÄÄÄÄÄÄÄÄÄÄÄÄÄÄÄÄÄÄÄÄÄÄÄÄÄÄÄÄÄÄÄÄÄÄÄÄÄÄÄÄÄÄÄÄÄÄÄÄÄÄÄÄÄÄÄÄÄÄÄÄÄÄÄÄÄÄÄÄÄÄÄÄÄÄÄÄÄÄÄÄÄÄÄÄÄÄÄÄÄÄÄÄÄÄÄÄÄÄÄÄÄÄÄÄÄÄÄÄÄÄÄÄÄÄÄÄÄÄÄÄÄÄÄÄÄÄÄÄÄÄÄÄÄÄÄÄÄÄÄÄÄÄÄÄÄÄÄÄÄÄÄÄÄÄÄÄÄÄÄÄÄÄÄÄÄÄÄÄÄÄÄÄÄÄÄÄÄÄÄÄÄÄÄÄÄÄÄÄÄÄÄÄÄÄÄÄÄÄÄÄÄÄÄÄÄÄÄÄÄÄÄÄÄÄÄÄÄÄÄÄÄÄÄÄÄÄÄÄÄÄÄÄÄÄÄÄÄÄÄÄÄÄÄÄÄÄÄÄÄÄÄÄÄÄÄÄÄÄÄÄÄÄÄÄÄÄÄÄÄÄÄÄÄÄÄÄÄÄÄÄÄÄÄÄÄÄÄÄÄÄÄÄÄÄÄÄÄÄÄÄÄÄÄÄÄÄÄÄÄÄÄÄÄÄÄÄÄÄÄÄÄÄÄÄÄÄÄÄÄÄÄÄÄÄÄÄÄÄÄÄÄÄÄÄÄÄÄÄÄÄÄÄÄÄÄÄÄÄÄÄÄÄÄÄÄÄÄÄÄÄÄÄÄÄÄÄÄÄÄÄÄÄÄÄÄÄÄÄÄÄÄÄÄÄÄÄÄÄÄÄÄÄÄÄÄÄÄÄÄÄÄÄÄÄÄÄÄÄÄÄÄÄÄÄÄÄÄÄÄÄÄÄÄÄÄÄÄÄÄÄÄÄÄÄÄÄÄÄÄÄÄÄÄÄÄÄÄÄÄÄÄÄÄÄÄÄÄÄÄÄÄÄÄÄÄÄÄÄÄÄÄÄÄÄÄÄÄÄÄÄÄÄÄÄÄÄÄÄÄÄÄÄÄÄÄÄÄÄÄÄÄÄÄÄÄÄÄÄÄÄÄÄÄÄÄÄÄÄÄÄÄÄÄÄÄÄÄÄÄÄÄÄÄÄÄÄÄÄÄÄÄÄÄÄÄÄÄÄÄÄÄÄÄÄÄÄÄÄÄÄÄÄÄÄÄÄÄÄÄÄÄÄÄÄÄÄÄÄÄÄÄÄÄÄÄÄÄÄÄÄÄÄÄÄÄÄÄÄÄÄÄÄÄÄÄÄÄÄÄÄÄÄÄÄÄÄÄÄÄÄÄÄÄÄÄÄÄÄÄÄÄÄÄÄÄÄÄÄÄÄÄÄÄÄÄÄÄÄÄÄÄÄÄÄÄÄÄÄÄÄÄÄÄÄÄÄÄÄÄÄÄÄÄÄÄÄÄÄÄÄÄÄÄÄÄÄÄÄÄÄÄÄÄÄÄÄÄÄÄÄÄÄÄÄÄÄÄÄÄÄÄÄÄÄÄÄÄÄÄÄÄÄÄÄÄÄÄÄÄÄÄÄÄÄÄÄÄÄÄÄÄÄÄÄÄÄÄÄÄÄÄÄÄÄÄÄÄÄÄÄÄÄÄÄÄÄÄÄÄÄÄÄÄÄÄÄÄÄÄÄÄÄÄÄÄÄÄÄÄÄÄÄÄÄÄÄÄÄÄÄÄÄÄÄÄÄÄÄÄÄÄÄÄÄÄÄÄÄÄÄÄÄÄÄÄÄÄÄÄÄÄÄÄÄÄÄÄÄÄÄÄÄÄÄÄÄÄÄÄÄÄÄÄÄÄÄÄÄÄÄÄÄÄÄÄÄÄÄÄÄÄÄÄÄÄÄÄÄÄÄÄÄÄÄÄÄÄÄÄÄÄÄÄÄÄÄÄÄÄÄÄÄÄÄÄÄÄÄÄÄÄÄÄÄÄÄÄÄÄÄÄÄÄÄÄÄÄÄÄÄÄÄÄÄÄÄÄÄÄÄÄÄÄÄÄÄÄÄÄÄÄÄÄÄÄÄÄÄÄÄÄÄÄÄÄÄÄÄÄÄÄÄÄÄÄÄÄÄÄÄÄÄÄÄÄÄÄÄÄÄÄÄÄÄÄÄÄÄÄÄÄÄÄÄÄÄÄÄÄÄÄÄÄÄÄÄÄÄÄÄÄÄÄÄÄÄÄÄÄÄÄÄÄÄÄÄÄÄÄÄÄÄÄÄÄÄÄÄÄÄÄÄÄÄÄÄÄÄÄÄÄÄÄÄÄÄÄÄÄÄÄÄÄÄÄÄÄÄÄÄÄÄÄÄÄÄÄÄÄÄÄÄÄÄÄÄÄÄÄÄÄÄÄÄÄÄÄÄÄÄÄÄÄÄÄÄÄÄÄÄÄÄÄÄÄÄÄÄÄÄÄÄÄÄÄÄÄÄÄÄÄÄÄÄÄÄÄÄÄÄÄÄÄÄÄÄÄÄÄÄÄÄÄÄÄÄÄÄÄÄÄÄÄÄÄÄÄÄÄÄÄÄÄÄÄÄÄÄÄÄÄÄÄÄÄÄÄÄÄÄÄÄÄÄÄÄÄÄÄÄÄÄÄÄÄÄÄÄÄÄÄÄÄÄÄÄÄÄÄÄÄÄÄÄÄÄÄÄÄÄÄÄÄÄÄÄÄÄÄÄÄÄÄÄÄÄÄÄÄÄÄÄÄÄÄÄÄÄÄÄÄÄÄÄÄÄÄÄÄÄÄÄÄÄÄÄÄÄÄÄÄÄÄÄÄÄÄÄÄÄÄÄÄÄÄÄÄÄÄÄÄÄÄÄÄÄÄÄÄÄÄÄÄÄÄÄÄÄÄÄÄÄÄÄÄÄÄÄÄÄÄÄÄÄÄÄÄÄÄÄÄÄÄÄÄÄÄÄÄÄÄÄÄÄÄÄÄÄÄÄÄÄÄÄÄÄÄÄÄÄÄÄÄÄÄÄÄÄÄÄÄÄÄÄÄÄÄÄÄÄÄÄÄÄÄÄÄÄÄÄÄÄÄÄÄÄÄÄÄÄÄÄÄÄÄÄÄÄÄÄÄÄÄÄÄÄÄÄÄÄÄÄÄÄÄÄÄÄÄÄÄÄÄÄÄÄÄÄÄÄÄÄÄÄÄÄÄÄÄÄÄÄÄÄÄÄÄÄÄÄÄÄÄÄÄÄÄÄÄÄÄÄÄÄÄÄÄÄÄÄÄÄÄÄÄÄÄÄÄÄÄÄÄÄÄÄÄÄÄÄÄÄÄÄÄÄÄÄÄÄÄÄÄÄÄÄÄÄÄÄÄÄÄÄÄÄÄÄÄÄÄÄÄÄÄÄÄÄÄÄÄÄÄÄÄÄÄÄÄÄÄÄÄÄÄÄÄÄÄÄÄÄÄÄÄÄÄÄÄÄÄÄÄÄÄÄÄÄÄÄÄÄÄÄÄÄÄÄÄÄÄÄÄÄÄÄÄÄÄÄÄÄÄÄÄÄÄÄÄÄÄÄÄ')
SQL ERROR [ mssqlnative ]<br /><br />SQLSTATE: 22001
code: 8152
message: [Microsoft][SQL Server Native Client 11.0][SQL Server]String or binary data would be truncated.
SQLSTATE: 01000
code: 3621
message: [Microsoft][SQL Server Native Client 11.0][SQL Server]The statement has been terminated.
 [3621]<br /><br />An sql error occurred while fetching this page. Please contact an administrator if this problem persists.
(4 more lines...)
phpbb_dbal_db_tools_test::test_created_column with data set #26 ('c_vchar_ci', 'ÄÄÄÄÄÄÄÄÄÄÄÄÄÄÄÄÄÄÄÄÄÄÄÄÄÄÄÄÄÄÄÄÄÄÄÄÄÄÄÄÄÄÄÄÄÄÄÄÄÄÄÄÄÄÄÄÄÄÄÄÄÄÄÄÄÄÄÄÄÄÄÄÄÄÄÄÄÄÄÄÄÄÄÄÄÄÄÄÄÄÄÄÄÄÄÄÄÄÄÄÄÄÄÄÄÄÄÄÄÄÄÄÄÄÄÄÄÄÄÄÄÄÄÄÄÄÄÄÄÄÄÄÄÄÄÄÄÄÄÄÄÄÄÄÄÄÄÄÄÄÄÄÄÄÄÄÄÄÄÄÄÄÄÄÄÄÄÄÄÄÄÄÄÄÄÄÄÄÄÄÄÄÄÄÄÄÄÄÄÄÄÄÄÄÄÄÄÄÄÄÄÄÄÄÄÄÄÄÄÄÄÄÄÄÄÄÄÄÄÄÄÄÄÄÄÄÄÄÄÄÄÄÄÄÄÄÄÄÄÄÄÄÄÄÄÄÄÄÄÄÄÄÄÄÄ')
SQL ERROR [ mssqlnative ]<br /><br />SQLSTATE: 22001
code: 8152
message: [Microsoft][SQL Server Native Client 11.0][SQL Server]String or binary data would be truncated.
SQLSTATE: 01000
code: 3621
message: [Microsoft][SQL Server Native Client 11.0][SQL Server]The statement has been terminated.
 [3621]<br /><br />An sql error occurred while fetching this page. Please contact an administrator if this problem persists.
(4 more lines...)
phpbb_dbal_db_tools_test::test_created_column with data set #25 ('c_vchar_uni_size', 'ÄÄÄÄ')
SQL ERROR [ mssqlnative ]<br /><br />SQLSTATE: 22001
code: 8152
message: [Microsoft][SQL Server Native Client 11.0][SQL Server]String or binary data would be truncated.
SQLSTATE: 01000
code: 3621
message: [Microsoft][SQL Server Native Client 11.0][SQL Server]The statement has been terminated.
 [3621]<br /><br />An sql error occurred while fetching this page. Please contact an administrator if this problem persists.
(4 more lines...)
phpbb_dbal_db_tools_test::test_created_column with data set #24 ('c_vchar_uni', 'ÄÄÄÄÄÄÄÄÄÄÄÄÄÄÄÄÄÄÄÄÄÄÄÄÄÄÄÄÄÄÄÄÄÄÄÄÄÄÄÄÄÄÄÄÄÄÄÄÄÄÄÄÄÄÄÄÄÄÄÄÄÄÄÄÄÄÄÄÄÄÄÄÄÄÄÄÄÄÄÄÄÄÄÄÄÄÄÄÄÄÄÄÄÄÄÄÄÄÄÄÄÄÄÄÄÄÄÄÄÄÄÄÄÄÄÄÄÄÄÄÄÄÄÄÄÄÄÄÄÄÄÄÄÄÄÄÄÄÄÄÄÄÄÄÄÄÄÄÄÄÄÄÄÄÄÄÄÄÄÄÄÄÄÄÄÄÄÄÄÄÄÄÄÄÄÄÄÄÄÄÄÄÄÄÄÄÄÄÄÄÄÄÄÄÄÄÄÄÄÄÄÄÄÄÄÄÄÄÄÄÄÄÄÄÄÄÄÄÄÄÄÄÄÄÄÄÄÄÄÄÄÄÄÄÄÄÄÄÄÄÄÄÄÄÄÄÄÄÄÄÄÄÄÄÄ')
SQL ERROR [ mssqlnative ]<br /><br />SQLSTATE: 22001
code: 8152
message: [Microsoft][SQL Server Native Client 11.0][SQL Server]String or binary data would be truncated.
SQLSTATE: 01000
code: 3621
message: [Microsoft][SQL Server Native Client 11.0][SQL Server]The statement has been terminated.
 [3621]<br /><br />An sql error occurred while fetching this page. Please contact an administrator if this problem persists.
(4 more lines...)
phpbb_dbal_db_tools_test::test_column_change_with_composite_primary
SQL ERROR [ mssqlnative ]<br /><br />SQLSTATE: 42000
code: 3723
message: [Microsoft][SQL Server Native Client 11.0][SQL Server]An explicit DROP INDEX is not allowed on index 'prefix_table_name.PK_prefix_table_name'. It is being used for PRIMARY KEY constraint enforcement.
 [3723]<br /><br />An sql error occurred while fetching this page. Please contact an administrator if this problem persists.

C:\Users\Administrator\bamboo-agent-home\xml-data\build-dir\PHPBB3-MSSQLNATIVE-BUILD\phpBB\phpbb\db\driver\driver.php:855
C:\Users\Administrator\bamboo-agent-home\xml-data\build-dir\PHPBB3-MSSQLNATIVE-BUILD\phpBB\phpbb\db\driver\mssqlnative.php:143
(3 more lines...)
phpbb_dbal_db_tools_test::test_list_columns
Failed asserting that two arrays are equal.
--- Expected
+++ Actual
@@ @@
 Array (
-    0 => 'c_id'
-    1 => 'c_int_size'
(57 more lines...)
phpbb_dbal_schema_test::test_config_value_multibyte
SQL ERROR [ mssqlnative ]<br /><br />SQLSTATE: 22001
code: 8152
message: [Microsoft][SQL Server Native Client 11.0][SQL Server]String or binary data would be truncated.
SQLSTATE: 01000
code: 3621
message: [Microsoft][SQL Server Native Client 11.0][SQL Server]The statement has been terminated.
 [3621]<br /><br />An sql error occurred while fetching this page. Please contact an administrator if this problem persists.
(4 more lines...)
phpbb_extension_manager_test::test_disable
PHPUnit_Extensions_Database_Operation_Exception: COMPOSITE[INSERT] operation failed on query: 
                INSERT INTO phpbb_ext
                (ext_name, ext_active, ext_state)
                VALUES
                (?, ?, ?)
             using args: Array
(
(8 more lines...)
phpbb_extension_manager_test::test_all_available
PHPUnit_Extensions_Database_Operation_Exception: COMPOSITE[INSERT] operation failed on query: 
                INSERT INTO phpbb_ext
                (ext_name, ext_active, ext_state)
                VALUES
                (?, ?, ?)
             using args: Array
(
(8 more lines...)
phpbb_extension_manager_test::test_all_enabled
PHPUnit_Extensions_Database_Operation_Exception: COMPOSITE[INSERT] operation failed on query: 
                INSERT INTO phpbb_ext
                (ext_name, ext_active, ext_state)
                VALUES
                (?, ?, ?)
             using args: Array
(
(8 more lines...)
phpbb_extension_manager_test::test_is_available
PHPUnit_Extensions_Database_Operation_Exception: COMPOSITE[INSERT] operation failed on query: 
                INSERT INTO phpbb_ext
                (ext_name, ext_active, ext_state)
                VALUES
                (?, ?, ?)
             using args: Array
(
(8 more lines...)
phpbb_extension_manager_test::test_is_purged
PHPUnit_Extensions_Database_Operation_Exception: COMPOSITE[INSERT] operation failed on query: 
                INSERT INTO phpbb_ext
                (ext_name, ext_active, ext_state)
                VALUES
                (?, ?, ?)
             using args: Array
(
(8 more lines...)
phpbb_extension_manager_test::test_enable
PHPUnit_Extensions_Database_Operation_Exception: COMPOSITE[INSERT] operation failed on query: 
                INSERT INTO phpbb_ext
                (ext_name, ext_active, ext_state)
                VALUES
                (?, ?, ?)
             using args: Array
(
(8 more lines...)
phpbb_extension_manager_test::test_is_configured
PHPUnit_Extensions_Database_Operation_Exception: COMPOSITE[INSERT] operation failed on query: 
                INSERT INTO phpbb_ext
                (ext_name, ext_active, ext_state)
                VALUES
                (?, ?, ?)
             using args: Array
(
(8 more lines...)
phpbb_extension_manager_test::test_enable_not_enableable
PHPUnit_Extensions_Database_Operation_Exception: COMPOSITE[INSERT] operation failed on query: 
                INSERT INTO phpbb_ext
                (ext_name, ext_active, ext_state)
                VALUES
                (?, ?, ?)
             using args: Array
(
(8 more lines...)
phpbb_extension_manager_test::test_purge
PHPUnit_Extensions_Database_Operation_Exception: COMPOSITE[INSERT] operation failed on query: 
                INSERT INTO phpbb_ext
                (ext_name, ext_active, ext_state)
                VALUES
                (?, ?, ?)
             using args: Array
(
(8 more lines...)
phpbb_extension_manager_test::test_is_disabled
PHPUnit_Extensions_Database_Operation_Exception: COMPOSITE[INSERT] operation failed on query: 
                INSERT INTO phpbb_ext
                (ext_name, ext_active, ext_state)
                VALUES
                (?, ?, ?)
             using args: Array
(
(8 more lines...)
phpbb_extension_manager_test::test_is_enabled
PHPUnit_Extensions_Database_Operation_Exception: COMPOSITE[INSERT] operation failed on query: 
                INSERT INTO phpbb_ext
                (ext_name, ext_active, ext_state)
                VALUES
                (?, ?, ?)
             using args: Array
(
(8 more lines...)
phpbb_extension_manager_test::test_enabled_no_cache
PHPUnit_Extensions_Database_Operation_Exception: COMPOSITE[INSERT] operation failed on query: 
                INSERT INTO phpbb_ext
                (ext_name, ext_active, ext_state)
                VALUES
                (?, ?, ?)
             using args: Array
(
(8 more lines...)
phpbb_extension_manager_test::test_all_configured
PHPUnit_Extensions_Database_Operation_Exception: COMPOSITE[INSERT] operation failed on query: 
                INSERT INTO phpbb_ext
                (ext_name, ext_active, ext_state)
                VALUES
                (?, ?, ?)
             using args: Array
(
(8 more lines...)
phpbb_extension_metadata_manager_test::test_foo
PHPUnit_Extensions_Database_Operation_Exception: COMPOSITE[INSERT] operation failed on query: 
                INSERT INTO phpbb_ext
                (ext_name, ext_active, ext_state)
                VALUES
                (?, ?, ?)
             using args: Array
(
(8 more lines...)
phpbb_extension_metadata_manager_test::test_bar
PHPUnit_Extensions_Database_Operation_Exception: COMPOSITE[INSERT] operation failed on query: 
                INSERT INTO phpbb_ext
                (ext_name, ext_active, ext_state)
                VALUES
                (?, ?, ?)
             using args: Array
(
(8 more lines...)
phpbb_extension_metadata_manager_test::test_validator_valid
PHPUnit_Extensions_Database_Operation_Exception: COMPOSITE[INSERT] operation failed on query: 
                INSERT INTO phpbb_ext
                (ext_name, ext_active, ext_state)
                VALUES
                (?, ?, ?)
             using args: Array
(
(8 more lines...)
phpbb_extension_metadata_manager_test::test_validator_invalid with data set #1 ('type', 'asdf')
PHPUnit_Extensions_Database_Operation_Exception: COMPOSITE[INSERT] operation failed on query: 
                INSERT INTO phpbb_ext
                (ext_name, ext_active, ext_state)
                VALUES
                (?, ?, ?)
             using args: Array
(
(8 more lines...)
phpbb_extension_metadata_manager_test::test_validator_invalid with data set #2 ('license', '')
PHPUnit_Extensions_Database_Operation_Exception: COMPOSITE[INSERT] operation failed on query: 
                INSERT INTO phpbb_ext
                (ext_name, ext_active, ext_state)
                VALUES
                (?, ?, ?)
             using args: Array
(
(8 more lines...)
phpbb_extension_metadata_manager_test::test_validator_invalid with data set #0 ('name', 'asdf')
PHPUnit_Extensions_Database_Operation_Exception: COMPOSITE[INSERT] operation failed on query: 
                INSERT INTO phpbb_ext
                (ext_name, ext_active, ext_state)
                VALUES
                (?, ?, ?)
             using args: Array
(
(8 more lines...)
phpbb_extension_metadata_manager_test::test_validator_invalid with data set #3 ('version', '')
PHPUnit_Extensions_Database_Operation_Exception: COMPOSITE[INSERT] operation failed on query: 
                INSERT INTO phpbb_ext
                (ext_name, ext_active, ext_state)
                VALUES
                (?, ?, ?)
             using args: Array
(
(8 more lines...)
phpbb_extension_metadata_manager_test::test_validator_non_existing with data set #0 ('name')
PHPUnit_Extensions_Database_Operation_Exception: COMPOSITE[INSERT] operation failed on query: 
                INSERT INTO phpbb_ext
                (ext_name, ext_active, ext_state)
                VALUES
                (?, ?, ?)
             using args: Array
(
(8 more lines...)
phpbb_extension_metadata_manager_test::test_validator_non_existing with data set #2 ('license')
PHPUnit_Extensions_Database_Operation_Exception: COMPOSITE[INSERT] operation failed on query: 
                INSERT INTO phpbb_ext
                (ext_name, ext_active, ext_state)
                VALUES
                (?, ?, ?)
             using args: Array
(
(8 more lines...)
phpbb_extension_metadata_manager_test::test_validator_non_existing with data set #1 ('type')
PHPUnit_Extensions_Database_Operation_Exception: COMPOSITE[INSERT] operation failed on query: 
                INSERT INTO phpbb_ext
                (ext_name, ext_active, ext_state)
                VALUES
                (?, ?, ?)
             using args: Array
(
(8 more lines...)
phpbb_extension_metadata_manager_test::test_validator_non_existing with data set #3 ('version')
PHPUnit_Extensions_Database_Operation_Exception: COMPOSITE[INSERT] operation failed on query: 
                INSERT INTO phpbb_ext
                (ext_name, ext_active, ext_state)
                VALUES
                (?, ?, ?)
             using args: Array
(
(8 more lines...)
phpbb_extension_metadata_manager_test::test_validator_non_existing_authors
PHPUnit_Extensions_Database_Operation_Exception: COMPOSITE[INSERT] operation failed on query: 
                INSERT INTO phpbb_ext
                (ext_name, ext_active, ext_state)
                VALUES
                (?, ?, ?)
             using args: Array
(
(8 more lines...)
Fixed tests 23
Status Test Failing since View job Duration
Successful phpbb_dbal_db_tools_test::test_created_column test_column_remove History
Failing since build #30 (Rebuilt by Marc) Build and Test < 1 sec
Successful phpbb_dbal_db_tools_test::test_created_column test_column_remove_similar_name History
Failing since build #30 (Rebuilt by Marc) Build and Test < 1 sec
Successful phpbb_dbal_db_tools_test::test_created_column test_column_change_with_index History
Failing since build #30 (Rebuilt by Marc) Build and Test < 1 sec
Successful phpbb_dbal_db_tools_test::test_created_column test_column_remove_with_index History
Failing since build #30 (Rebuilt by Marc) Build and Test < 1 sec
Successful phpbb_dbal_migrator_test test_schema History
Failing since build #30 (Rebuilt by Marc) Build and Test < 1 sec
Successful phpbb_dbal_migrator_test test_fail History
Failing since build #30 (Rebuilt by Marc) Build and Test < 1 sec
Successful phpbb_dbal_migrator_test test_revert History
Failing since build #30 (Rebuilt by Marc) Build and Test < 1 sec
Successful phpbb_dbal_migrator_test test_update History
Failing since build #30 (Rebuilt by Marc) Build and Test < 1 sec
Successful phpbb_dbal_migrator_test test_unfulfillable History
Failing since build #30 (Rebuilt by Marc) Build and Test < 1 sec
Successful phpbb_dbal_write_test::test_build_array_insert test_multiple_insert History
Failing since build #30 (Rebuilt by Marc) Build and Test < 1 sec
Successful phpbb_dbal_write_test::test_build_array_insert test_build_array_insert with data set #0 History
Failing since build #30 (Rebuilt by Marc) Build and Test < 1 sec
Successful phpbb_dbal_write_test::test_build_array_insert test_build_array_insert with data set #1 History
Failing since build #30 (Rebuilt by Marc) Build and Test < 1 sec
Successful phpbb_dbal_write_test::test_update test_update with data set #1 History
Failing since build #30 (Rebuilt by Marc) Build and Test < 1 sec
Successful phpbb_dbal_write_test::test_update test_update with data set #0 History
Failing since build #30 (Rebuilt by Marc) Build and Test < 1 sec
Successful phpbb_filespec_test::test_is_image_get_mimetype test_is_image_get_mimetype with data set #2 History
Failing since build #30 (Rebuilt by Marc) Build and Test < 1 sec
Successful phpbb_filespec_test::test_is_image_get_mimetype test_is_image_get_mimetype with data set #1 History
Failing since build #30 (Rebuilt by Marc) Build and Test < 1 sec
Successful phpbb_filespec_test::test_is_image_get_mimetype test_is_image_get_mimetype with data set #3 History
Failing since build #30 (Rebuilt by Marc) Build and Test < 1 sec
Successful phpbb_filespec_test::test_is_image_get_mimetype test_is_image_get_mimetype with data set #6 History
Failing since build #30 (Rebuilt by Marc) Build and Test < 1 sec
Successful phpbb_filespec_test::test_is_image_get_mimetype test_is_image_get_mimetype with data set #5 History
Failing since build #30 (Rebuilt by Marc) Build and Test < 1 sec
Successful phpbb_filespec_test::test_is_image_get_mimetype test_is_image_get_mimetype with data set #7 History
Failing since build #30 (Rebuilt by Marc) Build and Test < 1 sec
Successful phpbb_filespec_test::test_is_image_get_mimetype test_is_image_get_mimetype with data set #0 History
Failing since build #30 (Rebuilt by Marc) Build and Test < 1 sec
Successful phpbb_filespec_test::test_move_file test_move_file with data set #5 History
Failing since build #30 (Rebuilt by Marc) Build and Test < 1 sec
Successful phpbb_migrator_convert_timezones_test test_convert History
Failing since build #30 (Rebuilt by Marc) Build and Test < 1 sec