Performs unit tests on SQL Server 2012 using the MSSQL Native driver

Build: #31 failed Rebuilt by nickvergessen

Test results

  • 3,963 tests in total
  • 211 tests failed
  • 10 failures are new
  • 23 tests were fixed
  • 2 minutes taken in total.
New test failures 10
Status Test View job Duration
Collapse Failed phpbb_functions_user_delete_user_test::test_delete_data test_delete_data with data set #1 History
Build and Test < 1 sec
phpbb_functions_user_delete_user_test::test_delete_data with data set #1 ('remove', array(array(1, 2)), array(array(1, 3)), array(array(2), array(3)), array(array('12345678901234567890123456789013')), array(array(2, 1, 1), array(3, 1, 1)), array(array(1, 3, 3), array(2, 1, 1)))
PHPUnit_Extensions_Database_Operation_Exception: COMPOSITE[INSERT] operation failed on query: 
                INSERT INTO phpbb_privmsgs_to
                (msg_id, user_id, author_id)
                VALUES
                (?, ?, ?)
             using args: Array
(
(8 more lines...)
Collapse Failed phpbb_functions_user_delete_user_test::test_delete_data test_delete_data with data set #0 History
Build and Test < 1 sec
phpbb_functions_user_delete_user_test::test_delete_data with data set #0 ('retain', array(array(1, 4)), array(array(1, 3)), array(array(2), array(3)), array(array('12345678901234567890123456789013')), array(array(2, 1, 1), array(3, 1, 1)), array(array(1, 3, 3), array(2, 1, 1)))
PHPUnit_Extensions_Database_Operation_Exception: COMPOSITE[INSERT] operation failed on query: 
                INSERT INTO phpbb_privmsgs_to
                (msg_id, user_id, author_id)
                VALUES
                (?, ?, ?)
             using args: Array
(
(8 more lines...)
Collapse Failed phpbb_functions_user_delete_user_test::test_delete_user_id_data test_delete_user_id_data with data set #0 History
Build and Test < 1 sec
phpbb_functions_user_delete_user_test::test_delete_user_id_data with data set #0 ('retain', array('phpbb_user_group', 'phpbb_topics_watch', 'phpbb_forums_watch', 'phpbb_acl_users', 'phpbb_topics_track', 'phpbb_topics_posted', 'phpbb_forums_track', 'phpbb_profile_fields_data', 'phpbb_moderator_cache', 'phpbb_drafts', 'phpbb_bookmarks', 'phpbb_sessions_keys', 'phpbb_privmsgs_folder', 'phpbb_privmsgs_rules'))
PHPUnit_Extensions_Database_Operation_Exception: COMPOSITE[INSERT] operation failed on query: 
                INSERT INTO phpbb_privmsgs_to
                (msg_id, user_id, author_id)
                VALUES
                (?, ?, ?)
             using args: Array
(
(8 more lines...)
Collapse Failed phpbb_functions_user_delete_user_test::test_delete_user_id_data test_delete_user_id_data with data set #1 History
Build and Test < 1 sec
phpbb_functions_user_delete_user_test::test_delete_user_id_data with data set #1 ('remove', array('phpbb_user_group', 'phpbb_topics_watch', 'phpbb_forums_watch', 'phpbb_acl_users', 'phpbb_topics_track', 'phpbb_topics_posted', 'phpbb_forums_track', 'phpbb_profile_fields_data', 'phpbb_moderator_cache', 'phpbb_drafts', 'phpbb_bookmarks', 'phpbb_sessions_keys', 'phpbb_privmsgs_folder', 'phpbb_privmsgs_rules'))
PHPUnit_Extensions_Database_Operation_Exception: COMPOSITE[INSERT] operation failed on query: 
                INSERT INTO phpbb_privmsgs_to
                (msg_id, user_id, author_id)
                VALUES
                (?, ?, ?)
             using args: Array
(
(8 more lines...)
Collapse Failed phpbb_functions_user_delete_user_test::test_first_last_post_info test_first_last_post_info with data set #0 History
Build and Test < 1 sec
phpbb_functions_user_delete_user_test::test_first_last_post_info with data set #0 ('retain', false, array(array(1, 1, ''), array(2, 1, 'Other'), array(3, 1, ''), array(4, 1, 'Other')), array(array(1, 1, '', '', 1, '', ''), array(2, 1, 'Other', '', 1, 'Other', ''), array(3, 1, '', '', 1, '', ''), array(4, 1, 'Other', '', 1, 'Other', '')), array(array(1, 1, '', ''), array(2, 1, 'Other', ''), array(3, 1, '', ''), array(4, 1, 'Other', '')))
PHPUnit_Extensions_Database_Operation_Exception: COMPOSITE[INSERT] operation failed on query: 
                INSERT INTO phpbb_privmsgs_to
                (msg_id, user_id, author_id)
                VALUES
                (?, ?, ?)
             using args: Array
(
(8 more lines...)
Collapse Failed phpbb_functions_user_delete_user_test::test_first_last_post_info test_first_last_post_info with data set #1 History
Build and Test < 1 sec
phpbb_functions_user_delete_user_test::test_first_last_post_info with data set #1 ('remove', false, array(array(2, 1, 'Other'), array(4, 1, 'Other')), array(array(2, 1, 'Other', '', 1, 'Other', ''), array(4, 1, 'Other', '', 1, 'Other', '')), array(array(1, 0, '', ''), array(2, 1, 'Other', ''), array(3, 0, '', ''), array(4, 1, 'Other', '')))
PHPUnit_Extensions_Database_Operation_Exception: COMPOSITE[INSERT] operation failed on query: 
                INSERT INTO phpbb_privmsgs_to
                (msg_id, user_id, author_id)
                VALUES
                (?, ?, ?)
             using args: Array
(
(8 more lines...)
Collapse Failed phpbb_functions_user_delete_user_test::test_first_last_post_info test_first_last_post_info with data set #2 History
Build and Test < 1 sec
phpbb_functions_user_delete_user_test::test_first_last_post_info with data set #2 ('retain', true, array(array(1, 1, 'Foobar'), array(2, 1, 'Other'), array(3, 1, 'Foobar'), array(4, 1, 'Other')), array(array(1, 1, 'Foobar', '', 1, 'Foobar', ''), array(2, 1, 'Other', '', 1, 'Other', ''), array(3, 1, 'Foobar', '', 1, 'Foobar', ''), array(4, 1, 'Other', '', 1, 'Other', '')), array(array(1, 1, 'Foobar', ''), array(2, 1, 'Other', ''), array(3, 1, 'Foobar', ''), array(4, 1, 'Other', '')))
PHPUnit_Extensions_Database_Operation_Exception: COMPOSITE[INSERT] operation failed on query: 
                INSERT INTO phpbb_privmsgs_to
                (msg_id, user_id, author_id)
                VALUES
                (?, ?, ?)
             using args: Array
(
(8 more lines...)
Collapse Failed phpbb_functions_user_delete_user_test::test_first_last_post_info test_first_last_post_info with data set #3 History
Build and Test < 1 sec
phpbb_functions_user_delete_user_test::test_first_last_post_info with data set #3 ('remove', true, array(array(2, 1, 'Other'), array(4, 1, 'Other')), array(array(2, 1, 'Other', '', 1, 'Other', ''), array(4, 1, 'Other', '', 1, 'Other', '')), array(array(1, 0, '', ''), array(2, 1, 'Other', ''), array(3, 0, '', ''), array(4, 1, 'Other', '')))
PHPUnit_Extensions_Database_Operation_Exception: COMPOSITE[INSERT] operation failed on query: 
                INSERT INTO phpbb_privmsgs_to
                (msg_id, user_id, author_id)
                VALUES
                (?, ?, ?)
             using args: Array
(
(8 more lines...)
Collapse Failed phpbb_functions_user_delete_user_test::test_report_attachment_info test_report_attachment_info with data set #1 History
Build and Test < 1 sec
phpbb_functions_user_delete_user_test::test_report_attachment_info with data set #1 ('remove', array(array(2, 1, 1, 1), array(4, 0, 1, 1)), array(array(3, 2, 1)), array(array(2, 1, 1), array(4, 0, 1)), array(array(2, 2, 1), array(3, 0, 2)))
PHPUnit_Extensions_Database_Operation_Exception: COMPOSITE[INSERT] operation failed on query: 
                INSERT INTO phpbb_privmsgs_to
                (msg_id, user_id, author_id)
                VALUES
                (?, ?, ?)
             using args: Array
(
(8 more lines...)
Collapse Failed phpbb_functions_user_delete_user_test::test_report_attachment_info test_report_attachment_info with data set #0 History
Build and Test < 1 sec
phpbb_functions_user_delete_user_test::test_report_attachment_info with data set #0 ('retain', array(array(1, 1, 1, 1), array(2, 1, 1, 1), array(3, 0, 1, 1), array(4, 0, 1, 1)), array(array(1, 1, 1), array(3, 2, 1)), array(array(1, 1, 1), array(2, 1, 1), array(3, 0, 1), array(4, 0, 1)), array(array(1, 1, 1), array(2, 2, 1), array(3, 0, 1)))
PHPUnit_Extensions_Database_Operation_Exception: COMPOSITE[INSERT] operation failed on query: 
                INSERT INTO phpbb_privmsgs_to
                (msg_id, user_id, author_id)
                VALUES
                (?, ?, ?)
             using args: Array
(
(8 more lines...)
Existing test failures 201
Status Test Failing since View job Duration
phpbb_auth_provider_oauth_token_storage_test::test_hasAccessToken with data set #1 (OAuth\OAuth2\Token\StdOAuth2Token, true)
PHPUnit_Extensions_Database_Operation_Exception: COMPOSITE[INSERT] operation failed on query: 
                INSERT INTO phpbb_oauth_tokens
                (user_id, session_id, provider, oauth_token)
                VALUES
                (?, ?, ?, ?)
             using args: Array
(
(9 more lines...)
phpbb_auth_provider_oauth_token_storage_test::test_hasAccessToken with data set #0 (NULL, false)
PHPUnit_Extensions_Database_Operation_Exception: COMPOSITE[INSERT] operation failed on query: 
                INSERT INTO phpbb_oauth_tokens
                (user_id, session_id, provider, oauth_token)
                VALUES
                (?, ?, ?, ?)
             using args: Array
(
(9 more lines...)
phpbb_auth_provider_oauth_token_storage_test::test_clearToken
PHPUnit_Extensions_Database_Operation_Exception: COMPOSITE[INSERT] operation failed on query: 
                INSERT INTO phpbb_oauth_tokens
                (user_id, session_id, provider, oauth_token)
                VALUES
                (?, ?, ?, ?)
             using args: Array
(
(9 more lines...)
phpbb_auth_provider_oauth_token_storage_test::test_set_user_id
PHPUnit_Extensions_Database_Operation_Exception: COMPOSITE[INSERT] operation failed on query: 
                INSERT INTO phpbb_oauth_tokens
                (user_id, session_id, provider, oauth_token)
                VALUES
                (?, ?, ?, ?)
             using args: Array
(
(9 more lines...)
phpbb_auth_provider_oauth_token_storage_test::test_has_access_token_by_session with data set #0 (NULL, false)
PHPUnit_Extensions_Database_Operation_Exception: COMPOSITE[INSERT] operation failed on query: 
                INSERT INTO phpbb_oauth_tokens
                (user_id, session_id, provider, oauth_token)
                VALUES
                (?, ?, ?, ?)
             using args: Array
(
(9 more lines...)
phpbb_auth_provider_oauth_token_storage_test::test_has_access_token_by_session with data set #1 (OAuth\OAuth2\Token\StdOAuth2Token, true)
PHPUnit_Extensions_Database_Operation_Exception: COMPOSITE[INSERT] operation failed on query: 
                INSERT INTO phpbb_oauth_tokens
                (user_id, session_id, provider, oauth_token)
                VALUES
                (?, ?, ?, ?)
             using args: Array
(
(9 more lines...)
phpbb_auth_provider_oauth_token_storage_test::test_retrieveAccessToken_from_db
PHPUnit_Extensions_Database_Operation_Exception: COMPOSITE[INSERT] operation failed on query: 
                INSERT INTO phpbb_oauth_tokens
                (user_id, session_id, provider, oauth_token)
                VALUES
                (?, ?, ?, ?)
             using args: Array
(
(9 more lines...)
phpbb_auth_provider_oauth_token_storage_test::test_retrieveAccessToken with data set #1 (NULL, 'OAuth\\Common\\Storage\\Exception\\TokenNotFoundException')
PHPUnit_Extensions_Database_Operation_Exception: COMPOSITE[INSERT] operation failed on query: 
                INSERT INTO phpbb_oauth_tokens
                (user_id, session_id, provider, oauth_token)
                VALUES
                (?, ?, ?, ?)
             using args: Array
(
(9 more lines...)
phpbb_auth_provider_oauth_token_storage_test::test_retrieveAccessToken_wrong_token
PHPUnit_Extensions_Database_Operation_Exception: COMPOSITE[INSERT] operation failed on query: 
                INSERT INTO phpbb_oauth_tokens
                (user_id, session_id, provider, oauth_token)
                VALUES
                (?, ?, ?, ?)
             using args: Array
(
(9 more lines...)
phpbb_auth_provider_oauth_token_storage_test::test_retrieveAccessToken with data set #0 (OAuth\OAuth2\Token\StdOAuth2Token, NULL)
PHPUnit_Extensions_Database_Operation_Exception: COMPOSITE[INSERT] operation failed on query: 
                INSERT INTO phpbb_oauth_tokens
                (user_id, session_id, provider, oauth_token)
                VALUES
                (?, ?, ?, ?)
             using args: Array
(
(9 more lines...)
phpbb_auth_provider_oauth_token_storage_test::test_retrieve_access_token_by_session with data set #0 (OAuth\OAuth2\Token\StdOAuth2Token, NULL)
PHPUnit_Extensions_Database_Operation_Exception: COMPOSITE[INSERT] operation failed on query: 
                INSERT INTO phpbb_oauth_tokens
                (user_id, session_id, provider, oauth_token)
                VALUES
                (?, ?, ?, ?)
             using args: Array
(
(9 more lines...)
phpbb_auth_provider_oauth_token_storage_test::test_retrieve_access_token_by_session with data set #1 (NULL, 'OAuth\\Common\\Storage\\Exception\\TokenNotFoundException')
PHPUnit_Extensions_Database_Operation_Exception: COMPOSITE[INSERT] operation failed on query: 
                INSERT INTO phpbb_oauth_tokens
                (user_id, session_id, provider, oauth_token)
                VALUES
                (?, ?, ?, ?)
             using args: Array
(
(9 more lines...)
phpbb_auth_provider_oauth_token_storage_test::test_storeAccessToken
PHPUnit_Extensions_Database_Operation_Exception: COMPOSITE[INSERT] operation failed on query: 
                INSERT INTO phpbb_oauth_tokens
                (user_id, session_id, provider, oauth_token)
                VALUES
                (?, ?, ?, ?)
             using args: Array
(
(9 more lines...)
phpbb_auth_provider_oauth_token_storage_test::test_retrieve_access_token_by_session_from_db
PHPUnit_Extensions_Database_Operation_Exception: COMPOSITE[INSERT] operation failed on query: 
                INSERT INTO phpbb_oauth_tokens
                (user_id, session_id, provider, oauth_token)
                VALUES
                (?, ?, ?, ?)
             using args: Array
(
(9 more lines...)
phpbb_dbal_cross_join_test::test_cross_join
PHPUnit_Extensions_Database_Operation_Exception: COMPOSITE[INSERT] operation failed on query: 
                INSERT INTO phpbb_user_group
                (user_id, group_id)
                VALUES
                (?, ?)
             using args: Array
(
(6 more lines...)
phpbb_dbal_db_tools_test::test_column_remove_primary
SQL ERROR [ mssqlnative ]<br /><br />SQLSTATE: 42000
code: 3723
message: [Microsoft][SQL Server Native Client 11.0][SQL Server]An explicit DROP INDEX is not allowed on index 'prefix_table_name.PK_prefix_table_name'. It is being used for PRIMARY KEY constraint enforcement.
 [3723]<br /><br />An sql error occurred while fetching this page. Please contact an administrator if this problem persists.

C:\Users\Administrator\bamboo-agent-home\xml-data\build-dir\PHPBB3-MSSQLNATIVE-BUILD\phpBB\phpbb\db\driver\driver.php:855
C:\Users\Administrator\bamboo-agent-home\xml-data\build-dir\PHPBB3-MSSQLNATIVE-BUILD\phpBB\phpbb\db\driver\mssqlnative.php:143
(3 more lines...)
phpbb_dbal_db_tools_test::test_created_column with data set #16 ('c_stext_uni', 'ÄÄÄÄÄÄÄÄÄÄÄÄÄÄÄÄÄÄÄÄÄÄÄÄÄÄÄÄÄÄÄÄÄÄÄÄÄÄÄÄÄÄÄÄÄÄÄÄÄÄÄÄÄÄÄÄÄÄÄÄÄÄÄÄÄÄÄÄÄÄÄÄÄÄÄÄÄÄÄÄÄÄÄÄÄÄÄÄÄÄÄÄÄÄÄÄÄÄÄÄÄÄÄÄÄÄÄÄÄÄÄÄÄÄÄÄÄÄÄÄÄÄÄÄÄÄÄÄÄÄÄÄÄÄÄÄÄÄÄÄÄÄÄÄÄÄÄÄÄÄÄÄÄÄÄÄÄÄÄÄÄÄÄÄÄÄÄÄÄÄÄÄÄÄÄÄÄÄÄÄÄÄÄÄÄÄÄÄÄÄÄÄÄÄÄÄÄÄÄÄÄÄÄÄÄÄÄÄÄÄÄÄÄÄÄÄÄÄÄÄÄÄÄÄÄÄÄÄÄÄÄÄÄÄÄÄÄÄÄÄÄÄÄÄÄÄÄÄÄÄÄÄÄÄÄ')
SQL ERROR [ mssqlnative ]<br /><br />SQLSTATE: 22001
code: 8152
message: [Microsoft][SQL Server Native Client 11.0][SQL Server]String or binary data would be truncated.
SQLSTATE: 01000
code: 3621
message: [Microsoft][SQL Server Native Client 11.0][SQL Server]The statement has been terminated.
 [3621]<br /><br />An sql error occurred while fetching this page. Please contact an administrator if this problem persists.
(4 more lines...)
phpbb_dbal_db_tools_test::test_created_column with data set #15 ('c_xstext_uni', 'ÄÄÄÄÄÄÄÄÄÄÄÄÄÄÄÄÄÄÄÄÄÄÄÄÄÄÄÄÄÄÄÄÄÄÄÄÄÄÄÄÄÄÄÄÄÄÄÄÄÄÄÄÄÄÄÄÄÄÄÄÄÄÄÄÄÄÄÄÄÄÄÄÄÄÄÄÄÄÄÄÄÄÄÄÄÄÄÄÄÄÄÄÄÄÄÄÄÄÄÄ')
SQL ERROR [ mssqlnative ]<br /><br />SQLSTATE: 22001
code: 8152
message: [Microsoft][SQL Server Native Client 11.0][SQL Server]String or binary data would be truncated.
SQLSTATE: 01000
code: 3621
message: [Microsoft][SQL Server Native Client 11.0][SQL Server]The statement has been terminated.
 [3621]<br /><br />An sql error occurred while fetching this page. Please contact an administrator if this problem persists.
(4 more lines...)
phpbb_dbal_db_tools_test::test_created_column with data set #17 ('c_text_uni', 'ÄÄÄÄÄÄÄÄÄÄÄÄÄÄÄÄÄÄÄÄÄÄÄÄÄÄÄÄÄÄÄÄÄÄÄÄÄÄÄÄÄÄÄÄÄÄÄÄÄÄÄÄÄÄÄÄÄÄÄÄÄÄÄÄÄÄÄÄÄÄÄÄÄÄÄÄÄÄÄÄÄÄÄÄÄÄÄÄÄÄÄÄÄÄÄÄÄÄÄÄÄÄÄÄÄÄÄÄÄÄÄÄÄÄÄÄÄÄÄÄÄÄÄÄÄÄÄÄÄÄÄÄÄÄÄÄÄÄÄÄÄÄÄÄÄÄÄÄÄÄÄÄÄÄÄÄÄÄÄÄÄÄÄÄÄÄÄÄÄÄÄÄÄÄÄÄÄÄÄÄÄÄÄÄÄÄÄÄÄÄÄÄÄÄÄÄÄÄÄÄÄÄÄÄÄÄÄÄÄÄÄÄÄÄÄÄÄÄÄÄÄÄÄÄÄÄÄÄÄÄÄÄÄÄÄÄÄÄÄÄÄÄÄÄÄÄÄÄÄÄÄÄÄÄÄÄÄÄÄÄÄÄÄÄÄÄÄÄÄÄÄÄÄÄÄÄÄÄÄÄÄÄÄÄÄÄÄÄÄÄÄÄÄÄÄÄÄÄÄÄÄÄÄÄÄÄÄÄÄÄÄÄÄÄÄÄÄÄÄÄÄÄÄÄÄÄÄÄÄÄÄÄÄÄÄÄÄÄÄÄÄÄÄÄÄÄÄÄÄÄÄÄÄÄÄÄÄÄÄÄÄÄÄÄÄÄÄÄÄÄÄÄÄÄÄÄÄÄÄÄÄÄÄÄÄÄÄÄÄÄÄÄÄÄÄÄÄÄÄÄÄÄÄÄÄÄÄÄÄÄÄÄÄÄÄÄÄÄÄÄÄÄÄÄÄÄÄÄÄÄÄÄÄÄÄÄÄÄÄÄÄÄÄÄÄÄÄÄÄÄÄÄÄÄÄÄÄÄÄÄÄÄÄÄÄÄÄÄÄÄÄÄÄÄÄÄÄÄÄÄÄÄÄÄÄÄÄÄÄÄÄÄÄÄÄÄÄÄÄÄÄÄÄÄÄÄÄÄÄÄÄÄÄÄÄÄÄÄÄÄÄÄÄÄÄÄÄÄÄÄÄÄÄÄÄÄÄÄÄÄÄÄÄÄÄÄÄÄÄÄÄÄÄÄÄÄÄÄÄÄÄÄÄÄÄÄÄÄÄÄÄÄÄÄÄÄÄÄÄÄÄÄÄÄÄÄÄÄÄÄÄÄÄÄÄÄÄÄÄÄÄÄÄÄÄÄÄÄÄÄÄÄÄÄÄÄÄÄÄÄÄÄÄÄÄÄÄÄÄÄÄÄÄÄÄÄÄÄÄÄÄÄÄÄÄÄÄÄÄÄÄÄÄÄÄÄÄÄÄÄÄÄÄÄÄÄÄÄÄÄÄÄÄÄÄÄÄÄÄÄÄÄÄÄÄÄÄÄÄÄÄÄÄÄÄÄÄÄÄÄÄÄÄÄÄÄÄÄÄÄÄÄÄÄÄÄÄÄÄÄÄÄÄÄÄÄÄÄÄÄÄÄÄÄÄÄÄÄÄÄÄÄÄÄÄÄÄÄÄÄÄÄÄÄÄÄÄÄÄÄÄÄÄÄÄÄÄÄÄÄÄÄÄÄÄÄÄÄÄÄÄÄÄÄÄÄÄÄÄÄÄÄÄÄÄÄÄÄÄÄÄÄÄÄÄÄÄÄÄÄÄÄÄÄÄÄÄÄÄÄÄÄÄÄÄÄÄÄÄÄÄÄÄÄÄÄÄÄÄÄÄÄÄÄÄÄÄÄÄÄÄÄÄÄÄÄÄÄÄÄÄÄÄÄÄÄÄÄÄÄÄÄÄÄÄÄÄÄÄÄÄÄÄÄÄÄÄÄÄÄÄÄÄÄÄÄÄÄÄÄÄÄÄÄÄÄÄÄÄÄÄÄÄÄÄÄÄÄÄÄÄÄÄÄÄÄÄÄÄÄÄÄÄÄÄÄÄÄÄÄÄÄÄÄÄÄÄÄÄÄÄÄÄÄÄÄÄÄÄÄÄÄÄÄÄÄÄÄÄÄÄÄÄÄÄÄÄÄÄÄÄÄÄÄÄÄÄÄÄÄÄÄÄÄÄÄÄÄÄÄÄÄÄÄÄÄÄÄÄÄÄÄÄÄÄÄÄÄÄÄÄÄÄÄÄÄÄÄÄÄÄÄÄÄÄÄÄÄÄÄÄÄÄÄÄÄÄÄÄÄÄÄÄÄÄÄÄÄÄÄÄÄÄÄÄÄÄÄÄÄÄÄÄÄÄÄÄÄÄÄÄÄÄÄÄÄÄÄÄÄÄÄÄÄÄÄÄÄÄÄÄÄÄÄÄÄÄÄÄÄÄÄÄÄÄÄÄÄÄÄÄÄÄÄÄÄÄÄÄÄÄÄÄÄÄÄÄÄÄÄÄÄÄÄÄÄÄÄÄÄÄÄÄÄÄÄÄÄÄÄÄÄÄÄÄÄÄÄÄÄÄÄÄÄÄÄÄÄÄÄÄÄÄÄÄÄÄÄÄÄÄÄÄÄÄÄÄÄÄÄÄÄÄÄÄÄÄÄÄÄÄÄÄÄÄÄÄÄÄÄÄÄÄÄÄÄÄÄÄÄÄÄÄÄÄÄÄÄÄÄÄÄÄÄÄÄÄÄÄÄÄÄÄÄÄÄÄÄÄÄÄÄÄÄÄÄÄÄÄÄÄÄÄÄÄÄÄÄÄÄÄÄÄÄÄÄÄÄÄÄÄÄÄÄÄÄÄÄÄÄÄÄÄÄÄÄÄÄÄÄÄÄÄÄÄÄÄÄÄÄÄÄÄÄÄÄÄÄÄÄÄÄÄÄÄÄÄÄÄÄÄÄÄÄÄÄÄÄÄÄÄÄÄÄÄÄÄÄÄÄÄÄÄÄÄÄÄÄÄÄÄÄÄÄÄÄÄÄÄÄÄÄÄÄÄÄÄÄÄÄÄÄÄÄÄÄÄÄÄÄÄÄÄÄÄÄÄÄÄÄÄÄÄÄÄÄÄÄÄÄÄÄÄÄÄÄÄÄÄÄÄÄÄÄÄÄÄÄÄÄÄÄÄÄÄÄÄÄÄÄÄÄÄÄÄÄÄÄÄÄÄÄÄÄÄÄÄÄÄÄÄÄÄÄÄÄÄÄÄÄÄÄÄÄÄÄÄÄÄÄÄÄÄÄÄÄÄÄÄÄÄÄÄÄÄÄÄÄÄÄÄÄÄÄÄÄÄÄÄÄÄÄÄÄÄÄÄÄÄÄÄÄÄÄÄÄÄÄÄÄÄÄÄÄÄÄÄÄÄÄÄÄÄÄÄÄÄÄÄÄÄÄÄÄÄÄÄÄÄÄÄÄÄÄÄÄÄÄÄÄÄÄÄÄÄÄÄÄÄÄÄÄÄÄÄÄÄÄÄÄÄÄÄÄÄÄÄÄÄÄÄÄÄÄÄÄÄÄÄÄÄÄÄÄÄÄÄÄÄÄÄÄÄÄÄÄÄÄÄÄÄÄÄÄÄÄÄÄÄÄÄÄÄÄÄÄÄÄÄÄÄÄÄÄÄÄÄÄÄÄÄÄÄÄÄÄÄÄÄÄÄÄÄÄÄÄÄÄÄÄÄÄÄÄÄÄÄÄÄÄÄÄÄÄÄÄÄÄÄÄÄÄÄÄÄÄÄÄÄÄÄÄÄÄÄÄÄÄÄÄÄÄÄÄÄÄÄÄÄÄÄÄÄÄÄÄÄÄÄÄÄÄÄÄÄÄÄÄÄÄÄÄÄÄÄÄÄÄÄÄÄÄÄÄÄÄÄÄÄÄÄÄÄÄÄÄÄÄÄÄÄÄÄÄÄÄÄÄÄÄÄÄÄÄÄÄÄÄÄÄÄÄÄÄÄÄÄÄÄÄÄÄÄÄÄÄÄÄÄÄÄÄÄÄÄÄÄÄÄÄÄÄÄÄÄÄÄÄÄÄÄÄÄÄÄÄÄÄÄÄÄÄÄÄÄÄÄÄÄÄÄÄÄÄÄÄÄÄÄÄÄÄÄÄÄÄÄÄÄÄÄÄÄÄÄÄÄÄÄÄÄÄÄÄÄÄÄÄÄÄÄÄÄÄÄÄÄÄÄÄÄÄÄÄÄÄÄÄÄÄÄÄÄÄÄÄÄÄÄÄÄÄÄÄÄÄÄÄÄÄÄÄÄÄÄÄÄÄÄÄÄÄÄÄÄÄÄÄÄÄÄÄÄÄÄÄÄÄÄÄÄÄÄÄÄÄÄÄÄÄÄÄÄÄÄÄÄÄÄÄÄÄÄÄÄÄÄÄÄÄÄÄÄÄÄÄÄÄÄÄÄÄÄÄÄÄÄÄÄÄÄÄÄÄÄÄÄÄÄÄÄÄÄÄÄÄÄÄÄÄÄÄÄÄÄÄÄÄÄÄÄÄÄÄÄÄÄÄÄÄÄÄÄÄÄÄÄÄÄÄÄÄÄÄÄÄÄÄÄÄÄÄÄÄÄÄÄÄÄÄÄÄÄÄÄÄÄÄÄÄÄÄÄÄÄÄÄÄÄÄÄÄÄÄÄÄÄÄÄÄÄÄÄÄÄÄÄÄÄÄÄÄÄÄÄÄÄÄÄÄÄÄÄÄÄÄÄÄÄÄÄÄÄÄÄÄÄÄÄÄÄÄÄÄÄÄÄÄÄÄÄÄÄÄÄÄÄÄÄÄÄÄÄÄÄÄÄÄÄÄÄÄÄÄÄÄÄÄÄÄÄÄÄÄÄÄÄÄÄÄÄÄÄÄÄÄÄÄÄÄÄÄÄÄÄÄÄÄÄÄÄÄÄÄÄÄÄÄÄÄÄÄÄÄÄÄÄÄÄÄÄÄÄÄÄÄÄÄÄÄÄÄÄÄÄÄÄÄÄÄÄÄÄÄÄÄÄÄÄÄÄÄÄÄÄÄÄÄÄÄÄÄÄÄÄÄÄÄÄÄÄÄÄÄÄÄÄÄÄÄÄÄÄÄÄÄÄÄÄÄÄÄÄÄÄÄÄÄÄÄÄÄÄÄÄÄÄÄÄÄÄÄÄÄÄÄÄÄÄÄÄÄÄÄÄÄÄÄÄÄÄÄÄÄÄÄÄÄÄÄÄÄÄÄÄÄÄÄÄÄÄÄÄÄÄÄÄÄÄÄÄÄÄÄÄÄÄÄÄÄÄÄÄÄÄÄÄÄÄÄÄÄÄÄÄÄÄÄÄÄÄÄÄÄÄÄÄÄÄÄÄÄÄÄÄÄÄÄÄÄÄÄÄÄÄÄÄÄÄÄÄÄÄÄÄÄÄÄÄÄÄÄÄÄÄÄÄÄÄÄÄÄÄÄÄÄÄÄÄÄÄÄÄÄÄÄÄÄÄÄÄÄÄÄÄÄÄÄÄÄÄÄÄÄÄÄÄÄÄÄÄÄÄÄÄÄÄÄÄÄÄÄÄÄÄÄÄÄÄÄÄÄÄÄÄÄÄÄÄÄÄÄÄÄÄÄÄÄÄÄÄÄÄÄÄÄÄÄÄÄÄÄÄÄÄÄÄÄÄÄÄÄÄÄÄÄÄÄÄÄÄÄÄÄÄÄÄÄÄÄÄÄÄÄÄÄÄÄÄÄÄÄÄÄÄÄÄÄÄÄÄÄÄÄÄÄÄÄÄÄÄÄÄÄÄÄÄÄÄÄÄÄÄÄÄÄÄÄÄÄÄÄÄÄÄÄÄÄÄÄÄÄÄÄÄÄÄÄÄÄÄÄÄÄÄÄÄÄÄÄÄÄÄÄÄÄÄÄÄÄÄÄÄÄÄÄÄÄÄÄÄÄÄÄÄÄÄÄÄÄÄÄÄÄÄÄÄÄÄÄÄÄÄÄÄÄÄÄÄÄÄÄÄÄÄÄÄÄÄÄÄÄÄÄÄÄÄÄÄÄÄÄÄÄÄÄÄÄÄÄÄÄÄÄÄÄÄÄÄÄÄÄÄÄÄÄÄÄÄÄÄÄÄÄÄÄÄÄÄÄÄÄÄÄÄÄÄÄÄÄÄÄÄÄÄÄÄÄÄÄÄÄÄÄÄÄÄÄÄÄÄÄÄÄÄÄÄÄÄÄÄÄÄÄÄÄÄÄÄÄÄÄÄÄÄÄÄÄÄÄÄÄÄÄÄÄÄÄÄÄÄÄÄÄÄÄÄÄÄÄÄÄÄÄÄÄÄÄÄÄÄÄÄÄÄÄÄÄÄÄÄÄÄÄÄÄÄÄÄÄÄÄÄÄÄÄÄÄÄÄÄÄÄÄÄÄÄÄÄÄÄÄÄÄÄÄÄÄÄÄÄÄÄÄÄÄÄÄÄÄÄÄÄÄÄÄÄÄÄÄÄÄÄÄÄÄÄÄÄÄÄÄÄÄÄÄÄÄÄÄÄÄÄÄÄÄÄÄÄÄÄÄÄÄÄÄÄÄÄÄÄÄÄÄÄÄÄÄÄÄÄÄÄÄÄÄÄÄÄÄÄÄÄÄÄÄÄÄÄÄÄÄÄÄÄÄÄÄÄÄÄÄÄÄÄÄÄÄÄÄÄÄÄÄÄÄÄÄÄÄÄÄÄÄÄÄÄÄÄÄÄÄÄÄÄÄÄÄÄÄÄÄÄÄÄÄÄÄÄÄÄÄÄÄÄÄÄÄÄÄÄÄÄÄÄÄÄÄÄÄÄÄÄÄÄÄÄÄÄÄÄÄÄÄÄÄÄÄÄÄÄÄÄÄÄÄÄÄÄÄÄÄÄÄÄÄÄÄÄÄÄÄÄÄÄÄÄÄÄÄÄÄÄÄÄÄÄÄÄÄÄÄÄÄÄÄÄÄÄÄÄÄÄÄÄÄÄÄÄÄÄÄÄÄÄÄÄÄÄÄÄÄÄÄÄÄÄÄÄÄÄÄÄÄÄÄÄÄÄÄÄÄÄÄÄÄÄÄÄÄÄÄÄÄÄÄÄÄÄÄÄÄÄÄÄÄÄÄÄÄÄÄÄÄÄÄÄÄÄÄÄÄÄÄÄÄÄÄÄÄÄÄÄÄÄÄÄÄÄÄÄÄÄÄÄÄÄÄÄÄÄÄÄÄÄÄÄÄÄÄÄÄÄÄÄÄÄÄÄÄÄÄÄÄÄÄÄÄÄÄÄÄÄÄÄÄÄÄÄÄÄÄÄÄÄÄÄÄÄÄÄÄÄÄÄÄÄÄÄÄÄÄÄÄÄÄÄÄÄÄÄÄÄÄÄÄÄÄÄÄÄÄÄÄÄÄÄÄÄÄÄÄÄÄÄÄÄÄÄÄÄÄÄÄÄÄÄÄÄÄÄÄÄÄÄÄÄÄÄÄÄÄÄÄÄÄÄÄÄÄÄÄÄÄÄÄÄÄÄÄÄÄÄÄÄÄÄÄÄÄÄÄÄÄÄÄÄÄÄÄÄÄÄÄÄÄÄÄÄÄÄÄÄÄÄÄÄÄÄÄÄÄÄÄÄÄÄÄÄÄÄÄÄÄÄÄÄÄÄÄÄÄÄÄÄÄÄÄÄÄÄÄÄÄÄÄÄÄÄÄÄÄÄÄÄÄÄÄÄÄÄÄÄÄÄÄÄÄÄÄÄÄÄÄÄÄÄÄÄÄÄÄÄÄÄÄÄÄÄÄÄÄÄÄÄÄÄÄÄÄÄÄÄÄÄÄÄÄÄÄÄÄÄÄÄÄÄÄÄÄÄÄÄÄÄÄÄÄÄÄÄÄÄÄÄÄÄÄÄÄÄÄÄÄÄÄÄÄÄÄÄÄÄÄÄÄÄÄÄÄÄÄÄÄÄÄÄÄÄÄÄÄÄÄÄÄÄÄÄÄÄÄÄÄÄÄÄÄÄÄÄÄÄÄÄÄÄÄÄÄÄÄÄÄÄÄÄÄÄÄÄÄÄÄÄÄÄÄÄÄÄÄÄÄÄÄÄÄÄÄÄÄÄÄÄÄÄÄÄÄÄÄÄÄÄÄÄÄÄÄÄÄÄÄÄÄÄÄÄÄÄÄÄÄÄÄÄÄÄÄÄÄÄÄÄÄÄÄÄÄÄÄÄÄÄÄÄÄÄÄÄÄÄÄÄÄÄÄÄÄÄÄÄÄÄÄÄÄÄÄÄÄÄÄÄÄÄÄÄÄÄÄÄÄÄÄÄÄÄÄÄÄÄÄÄÄÄÄÄÄÄÄÄÄÄÄÄÄÄÄÄÄÄÄÄÄÄÄÄÄÄÄÄÄÄÄÄÄÄÄÄÄÄÄÄÄÄÄÄÄÄÄÄÄÄÄÄÄÄÄÄÄÄÄÄÄÄÄÄÄÄÄÄÄÄÄÄÄÄÄÄÄÄÄÄÄÄÄÄÄÄÄÄÄÄÄÄÄÄÄÄÄÄÄÄÄÄÄÄÄÄÄÄÄÄÄÄÄÄÄÄÄÄÄÄÄÄÄÄÄÄÄÄÄÄÄÄÄÄÄÄÄÄÄÄÄÄÄÄÄÄÄÄÄÄÄÄÄÄÄÄÄÄÄÄÄÄÄÄÄÄÄÄÄÄÄÄÄÄÄÄÄÄÄÄÄÄÄÄÄÄÄÄÄÄÄÄÄÄÄÄÄÄÄÄÄÄÄÄÄÄÄÄÄÄÄÄÄÄÄ')
SQL ERROR [ mssqlnative ]<br /><br />SQLSTATE: 22001
code: 8152
message: [Microsoft][SQL Server Native Client 11.0][SQL Server]String or binary data would be truncated.
SQLSTATE: 01000
code: 3621
message: [Microsoft][SQL Server Native Client 11.0][SQL Server]The statement has been terminated.
 [3621]<br /><br />An sql error occurred while fetching this page. Please contact an administrator if this problem persists.
(4 more lines...)
phpbb_dbal_db_tools_test::test_created_column with data set #26 ('c_vchar_ci', 'ÄÄÄÄÄÄÄÄÄÄÄÄÄÄÄÄÄÄÄÄÄÄÄÄÄÄÄÄÄÄÄÄÄÄÄÄÄÄÄÄÄÄÄÄÄÄÄÄÄÄÄÄÄÄÄÄÄÄÄÄÄÄÄÄÄÄÄÄÄÄÄÄÄÄÄÄÄÄÄÄÄÄÄÄÄÄÄÄÄÄÄÄÄÄÄÄÄÄÄÄÄÄÄÄÄÄÄÄÄÄÄÄÄÄÄÄÄÄÄÄÄÄÄÄÄÄÄÄÄÄÄÄÄÄÄÄÄÄÄÄÄÄÄÄÄÄÄÄÄÄÄÄÄÄÄÄÄÄÄÄÄÄÄÄÄÄÄÄÄÄÄÄÄÄÄÄÄÄÄÄÄÄÄÄÄÄÄÄÄÄÄÄÄÄÄÄÄÄÄÄÄÄÄÄÄÄÄÄÄÄÄÄÄÄÄÄÄÄÄÄÄÄÄÄÄÄÄÄÄÄÄÄÄÄÄÄÄÄÄÄÄÄÄÄÄÄÄÄÄÄÄÄÄÄÄ')
SQL ERROR [ mssqlnative ]<br /><br />SQLSTATE: 22001
code: 8152
message: [Microsoft][SQL Server Native Client 11.0][SQL Server]String or binary data would be truncated.
SQLSTATE: 01000
code: 3621
message: [Microsoft][SQL Server Native Client 11.0][SQL Server]The statement has been terminated.
 [3621]<br /><br />An sql error occurred while fetching this page. Please contact an administrator if this problem persists.
(4 more lines...)
phpbb_dbal_db_tools_test::test_created_column with data set #25 ('c_vchar_uni_size', 'ÄÄÄÄ')
SQL ERROR [ mssqlnative ]<br /><br />SQLSTATE: 22001
code: 8152
message: [Microsoft][SQL Server Native Client 11.0][SQL Server]String or binary data would be truncated.
SQLSTATE: 01000
code: 3621
message: [Microsoft][SQL Server Native Client 11.0][SQL Server]The statement has been terminated.
 [3621]<br /><br />An sql error occurred while fetching this page. Please contact an administrator if this problem persists.
(4 more lines...)
phpbb_dbal_db_tools_test::test_created_column with data set #24 ('c_vchar_uni', 'ÄÄÄÄÄÄÄÄÄÄÄÄÄÄÄÄÄÄÄÄÄÄÄÄÄÄÄÄÄÄÄÄÄÄÄÄÄÄÄÄÄÄÄÄÄÄÄÄÄÄÄÄÄÄÄÄÄÄÄÄÄÄÄÄÄÄÄÄÄÄÄÄÄÄÄÄÄÄÄÄÄÄÄÄÄÄÄÄÄÄÄÄÄÄÄÄÄÄÄÄÄÄÄÄÄÄÄÄÄÄÄÄÄÄÄÄÄÄÄÄÄÄÄÄÄÄÄÄÄÄÄÄÄÄÄÄÄÄÄÄÄÄÄÄÄÄÄÄÄÄÄÄÄÄÄÄÄÄÄÄÄÄÄÄÄÄÄÄÄÄÄÄÄÄÄÄÄÄÄÄÄÄÄÄÄÄÄÄÄÄÄÄÄÄÄÄÄÄÄÄÄÄÄÄÄÄÄÄÄÄÄÄÄÄÄÄÄÄÄÄÄÄÄÄÄÄÄÄÄÄÄÄÄÄÄÄÄÄÄÄÄÄÄÄÄÄÄÄÄÄÄÄÄÄÄ')
SQL ERROR [ mssqlnative ]<br /><br />SQLSTATE: 22001
code: 8152
message: [Microsoft][SQL Server Native Client 11.0][SQL Server]String or binary data would be truncated.
SQLSTATE: 01000
code: 3621
message: [Microsoft][SQL Server Native Client 11.0][SQL Server]The statement has been terminated.
 [3621]<br /><br />An sql error occurred while fetching this page. Please contact an administrator if this problem persists.
(4 more lines...)
phpbb_dbal_db_tools_test::test_column_change_with_composite_primary
SQL ERROR [ mssqlnative ]<br /><br />SQLSTATE: 42000
code: 3723
message: [Microsoft][SQL Server Native Client 11.0][SQL Server]An explicit DROP INDEX is not allowed on index 'prefix_table_name.PK_prefix_table_name'. It is being used for PRIMARY KEY constraint enforcement.
 [3723]<br /><br />An sql error occurred while fetching this page. Please contact an administrator if this problem persists.

C:\Users\Administrator\bamboo-agent-home\xml-data\build-dir\PHPBB3-MSSQLNATIVE-BUILD\phpBB\phpbb\db\driver\driver.php:855
C:\Users\Administrator\bamboo-agent-home\xml-data\build-dir\PHPBB3-MSSQLNATIVE-BUILD\phpBB\phpbb\db\driver\mssqlnative.php:143
(3 more lines...)
phpbb_dbal_db_tools_test::test_list_columns
Failed asserting that two arrays are equal.
--- Expected
+++ Actual
@@ @@
 Array (
-    0 => 'c_id'
-    1 => 'c_int_size'
(57 more lines...)
phpbb_dbal_schema_test::test_config_value_multibyte
SQL ERROR [ mssqlnative ]<br /><br />SQLSTATE: 22001
code: 8152
message: [Microsoft][SQL Server Native Client 11.0][SQL Server]String or binary data would be truncated.
SQLSTATE: 01000
code: 3621
message: [Microsoft][SQL Server Native Client 11.0][SQL Server]The statement has been terminated.
 [3621]<br /><br />An sql error occurred while fetching this page. Please contact an administrator if this problem persists.
(4 more lines...)
phpbb_extension_manager_test::test_disable
PHPUnit_Extensions_Database_Operation_Exception: COMPOSITE[INSERT] operation failed on query: 
                INSERT INTO phpbb_ext
                (ext_name, ext_active, ext_state)
                VALUES
                (?, ?, ?)
             using args: Array
(
(8 more lines...)
phpbb_extension_manager_test::test_all_available
PHPUnit_Extensions_Database_Operation_Exception: COMPOSITE[INSERT] operation failed on query: 
                INSERT INTO phpbb_ext
                (ext_name, ext_active, ext_state)
                VALUES
                (?, ?, ?)
             using args: Array
(
(8 more lines...)
phpbb_extension_manager_test::test_all_enabled
PHPUnit_Extensions_Database_Operation_Exception: COMPOSITE[INSERT] operation failed on query: 
                INSERT INTO phpbb_ext
                (ext_name, ext_active, ext_state)
                VALUES
                (?, ?, ?)
             using args: Array
(
(8 more lines...)
phpbb_extension_manager_test::test_is_available
PHPUnit_Extensions_Database_Operation_Exception: COMPOSITE[INSERT] operation failed on query: 
                INSERT INTO phpbb_ext
                (ext_name, ext_active, ext_state)
                VALUES
                (?, ?, ?)
             using args: Array
(
(8 more lines...)
phpbb_extension_manager_test::test_is_purged
PHPUnit_Extensions_Database_Operation_Exception: COMPOSITE[INSERT] operation failed on query: 
                INSERT INTO phpbb_ext
                (ext_name, ext_active, ext_state)
                VALUES
                (?, ?, ?)
             using args: Array
(
(8 more lines...)
phpbb_extension_manager_test::test_enable
PHPUnit_Extensions_Database_Operation_Exception: COMPOSITE[INSERT] operation failed on query: 
                INSERT INTO phpbb_ext
                (ext_name, ext_active, ext_state)
                VALUES
                (?, ?, ?)
             using args: Array
(
(8 more lines...)
phpbb_extension_manager_test::test_is_configured
PHPUnit_Extensions_Database_Operation_Exception: COMPOSITE[INSERT] operation failed on query: 
                INSERT INTO phpbb_ext
                (ext_name, ext_active, ext_state)
                VALUES
                (?, ?, ?)
             using args: Array
(
(8 more lines...)
phpbb_extension_manager_test::test_enable_not_enableable
PHPUnit_Extensions_Database_Operation_Exception: COMPOSITE[INSERT] operation failed on query: 
                INSERT INTO phpbb_ext
                (ext_name, ext_active, ext_state)
                VALUES
                (?, ?, ?)
             using args: Array
(
(8 more lines...)
phpbb_extension_manager_test::test_purge
PHPUnit_Extensions_Database_Operation_Exception: COMPOSITE[INSERT] operation failed on query: 
                INSERT INTO phpbb_ext
                (ext_name, ext_active, ext_state)
                VALUES
                (?, ?, ?)
             using args: Array
(
(8 more lines...)
phpbb_extension_manager_test::test_is_disabled
PHPUnit_Extensions_Database_Operation_Exception: COMPOSITE[INSERT] operation failed on query: 
                INSERT INTO phpbb_ext
                (ext_name, ext_active, ext_state)
                VALUES
                (?, ?, ?)
             using args: Array
(
(8 more lines...)
phpbb_extension_manager_test::test_is_enabled
PHPUnit_Extensions_Database_Operation_Exception: COMPOSITE[INSERT] operation failed on query: 
                INSERT INTO phpbb_ext
                (ext_name, ext_active, ext_state)
                VALUES
                (?, ?, ?)
             using args: Array
(
(8 more lines...)
phpbb_extension_manager_test::test_enabled_no_cache
PHPUnit_Extensions_Database_Operation_Exception: COMPOSITE[INSERT] operation failed on query: 
                INSERT INTO phpbb_ext
                (ext_name, ext_active, ext_state)
                VALUES
                (?, ?, ?)
             using args: Array
(
(8 more lines...)
phpbb_extension_manager_test::test_all_configured
PHPUnit_Extensions_Database_Operation_Exception: COMPOSITE[INSERT] operation failed on query: 
                INSERT INTO phpbb_ext
                (ext_name, ext_active, ext_state)
                VALUES
                (?, ?, ?)
             using args: Array
(
(8 more lines...)
phpbb_extension_metadata_manager_test::test_foo
PHPUnit_Extensions_Database_Operation_Exception: COMPOSITE[INSERT] operation failed on query: 
                INSERT INTO phpbb_ext
                (ext_name, ext_active, ext_state)
                VALUES
                (?, ?, ?)
             using args: Array
(
(8 more lines...)
phpbb_extension_metadata_manager_test::test_bar
PHPUnit_Extensions_Database_Operation_Exception: COMPOSITE[INSERT] operation failed on query: 
                INSERT INTO phpbb_ext
                (ext_name, ext_active, ext_state)
                VALUES
                (?, ?, ?)
             using args: Array
(
(8 more lines...)
phpbb_extension_metadata_manager_test::test_validator_valid
PHPUnit_Extensions_Database_Operation_Exception: COMPOSITE[INSERT] operation failed on query: 
                INSERT INTO phpbb_ext
                (ext_name, ext_active, ext_state)
                VALUES
                (?, ?, ?)
             using args: Array
(
(8 more lines...)
phpbb_extension_metadata_manager_test::test_validator_invalid with data set #1 ('type', 'asdf')
PHPUnit_Extensions_Database_Operation_Exception: COMPOSITE[INSERT] operation failed on query: 
                INSERT INTO phpbb_ext
                (ext_name, ext_active, ext_state)
                VALUES
                (?, ?, ?)
             using args: Array
(
(8 more lines...)
phpbb_extension_metadata_manager_test::test_validator_invalid with data set #2 ('license', '')
PHPUnit_Extensions_Database_Operation_Exception: COMPOSITE[INSERT] operation failed on query: 
                INSERT INTO phpbb_ext
                (ext_name, ext_active, ext_state)
                VALUES
                (?, ?, ?)
             using args: Array
(
(8 more lines...)
phpbb_extension_metadata_manager_test::test_validator_invalid with data set #0 ('name', 'asdf')
PHPUnit_Extensions_Database_Operation_Exception: COMPOSITE[INSERT] operation failed on query: 
                INSERT INTO phpbb_ext
                (ext_name, ext_active, ext_state)
                VALUES
                (?, ?, ?)
             using args: Array
(
(8 more lines...)
phpbb_extension_metadata_manager_test::test_validator_invalid with data set #3 ('version', '')
PHPUnit_Extensions_Database_Operation_Exception: COMPOSITE[INSERT] operation failed on query: 
                INSERT INTO phpbb_ext
                (ext_name, ext_active, ext_state)
                VALUES
                (?, ?, ?)
             using args: Array
(
(8 more lines...)
phpbb_extension_metadata_manager_test::test_validator_non_existing with data set #0 ('name')
PHPUnit_Extensions_Database_Operation_Exception: COMPOSITE[INSERT] operation failed on query: 
                INSERT INTO phpbb_ext
                (ext_name, ext_active, ext_state)
                VALUES
                (?, ?, ?)
             using args: Array
(
(8 more lines...)
phpbb_extension_metadata_manager_test::test_validator_non_existing with data set #2 ('license')
PHPUnit_Extensions_Database_Operation_Exception: COMPOSITE[INSERT] operation failed on query: 
                INSERT INTO phpbb_ext
                (ext_name, ext_active, ext_state)
                VALUES
                (?, ?, ?)
             using args: Array
(
(8 more lines...)
phpbb_extension_metadata_manager_test::test_validator_non_existing with data set #1 ('type')
PHPUnit_Extensions_Database_Operation_Exception: COMPOSITE[INSERT] operation failed on query: 
                INSERT INTO phpbb_ext
                (ext_name, ext_active, ext_state)
                VALUES
                (?, ?, ?)
             using args: Array
(
(8 more lines...)
phpbb_extension_metadata_manager_test::test_validator_non_existing with data set #3 ('version')
PHPUnit_Extensions_Database_Operation_Exception: COMPOSITE[INSERT] operation failed on query: 
                INSERT INTO phpbb_ext
                (ext_name, ext_active, ext_state)
                VALUES
                (?, ?, ?)
             using args: Array
(
(8 more lines...)
phpbb_extension_metadata_manager_test::test_validator_non_existing_authors
PHPUnit_Extensions_Database_Operation_Exception: COMPOSITE[INSERT] operation failed on query: 
                INSERT INTO phpbb_ext
                (ext_name, ext_active, ext_state)
                VALUES
                (?, ?, ?)
             using args: Array
(
(8 more lines...)
phpbb_extension_metadata_manager_test::test_validator_requirements with data set #3 ('<5.4.17', '<3.1.0', false, false, 'Versions are not compared at the moment')
PHPUnit_Extensions_Database_Operation_Exception: COMPOSITE[INSERT] operation failed on query: 
                INSERT INTO phpbb_ext
                (ext_name, ext_active, ext_state)
                VALUES
                (?, ?, ?)
             using args: Array
(
(8 more lines...)
phpbb_extension_metadata_manager_test::test_validator_requirements with data set #4 ('5.4.17', '3.1.0', true, true)
PHPUnit_Extensions_Database_Operation_Exception: COMPOSITE[INSERT] operation failed on query: 
                INSERT INTO phpbb_ext
                (ext_name, ext_active, ext_state)
                VALUES
                (?, ?, ?)
             using args: Array
(
(8 more lines...)
phpbb_extension_metadata_manager_test::test_validator_requirements with data set #5 ('>=5.4.17', '>=3.1.0', true, true)
PHPUnit_Extensions_Database_Operation_Exception: COMPOSITE[INSERT] operation failed on query: 
                INSERT INTO phpbb_ext
                (ext_name, ext_active, ext_state)
                VALUES
                (?, ?, ?)
             using args: Array
(
(8 more lines...)
phpbb_extension_metadata_manager_test::test_validator_requirements with data set #6 ('<=5.4.17', '<=3.1.0', true, true)
PHPUnit_Extensions_Database_Operation_Exception: COMPOSITE[INSERT] operation failed on query: 
                INSERT INTO phpbb_ext
                (ext_name, ext_active, ext_state)
                VALUES
                (?, ?, ?)
             using args: Array
(
(8 more lines...)
phpbb_extension_metadata_manager_test::test_validator_requirements with data set #0 ('10.0.0', '100.2.0', false, false, 'Versions are not compared at the moment')
PHPUnit_Extensions_Database_Operation_Exception: COMPOSITE[INSERT] operation failed on query: 
                INSERT INTO phpbb_ext
                (ext_name, ext_active, ext_state)
                VALUES
                (?, ?, ?)
             using args: Array
(
(8 more lines...)
phpbb_extension_metadata_manager_test::test_validator_requirements with data set #1 ('5.3.0', '3.1.0-beta', true, true)
PHPUnit_Extensions_Database_Operation_Exception: COMPOSITE[INSERT] operation failed on query: 
                INSERT INTO phpbb_ext
                (ext_name, ext_active, ext_state)
                VALUES
                (?, ?, ?)
             using args: Array
(
(8 more lines...)
phpbb_extension_metadata_manager_test::test_validator_requirements with data set #2 ('>5.4.17', '>3.1.0', false, false, 'Versions are not compared at the moment')
PHPUnit_Extensions_Database_Operation_Exception: COMPOSITE[INSERT] operation failed on query: 
                INSERT INTO phpbb_ext
                (ext_name, ext_active, ext_state)
                VALUES
                (?, ?, ?)
             using args: Array
(
(8 more lines...)
phpbb_functions_language_select_test::test_language_select with data set #2 ('cs', '<option value="cs" selected="selected">Čeština</option><option value="en">English</option>')
Failed asserting that two strings are equal.
--- Expected
+++ Actual
@@ @@
-'<option value="cs" selected="selected">Čeština</option><option value="en">English</option>'
+'<option value="cs" selected="selected">Cetina</option><option value="en">English</option>'

(1 more lines...)
phpbb_functions_language_select_test::test_language_select with data set #1 ('en', '<option value="cs">Čeština</option><option value="en" selected="selected">English</option>')
Failed asserting that two strings are equal.
--- Expected
+++ Actual
@@ @@
-'<option value="cs">Čeština</option><option value="en" selected="selected">English</option>'
+'<option value="cs">Cetina</option><option value="en" selected="selected">English</option>'

(1 more lines...)
phpbb_functions_language_select_test::test_language_select with data set #3 ('de', '<option value="cs">Čeština</option><option value="en">English</option>')
Failed asserting that two strings are equal.
--- Expected
+++ Actual
@@ @@
-'<option value="cs">Čeština</option><option value="en">English</option>'
+'<option value="cs">Cetina</option><option value="en">English</option>'

(1 more lines...)
phpbb_functions_language_select_test::test_language_select with data set #0 ('', '<option value="cs">Čeština</option><option value="en">English</option>')
Failed asserting that two strings are equal.
--- Expected
+++ Actual
@@ @@
-'<option value="cs">Čeština</option><option value="en">English</option>'
+'<option value="cs">Cetina</option><option value="en">English</option>'

(1 more lines...)
phpbb_functions_user_group_user_attributes_test::test_group_user_attributes with data set #2 ('Setting new default group without settings for user with custom settings - no change', 3, 2, array('', '', 0, 0, 0), array('custom', 2))
PHPUnit_Extensions_Database_Operation_Exception: COMPOSITE[INSERT] operation failed on query: 
                INSERT INTO phpbb_user_group
                (user_id, group_id, user_pending)
                VALUES
                (?, ?, ?)
             using args: Array
(
(7 more lines...)
phpbb_functions_user_group_user_attributes_test::test_group_user_attributes with data set #1 ('Setting new default group without settings for user with default settings - user settings overwritten', 2, 2, array('', '', 0, 0, 0), array('', 0))
PHPUnit_Extensions_Database_Operation_Exception: COMPOSITE[INSERT] operation failed on query: 
                INSERT INTO phpbb_user_group
                (user_id, group_id, user_pending)
                VALUES
                (?, ?, ?)
             using args: Array
(
(7 more lines...)
phpbb_functions_user_group_user_attributes_test::test_group_user_attributes with data set #0 ('Setting new default group without settings for user with no settings - no change', 1, 2, array('', '', 0, 0, 0), array('', 0))
PHPUnit_Extensions_Database_Operation_Exception: COMPOSITE[INSERT] operation failed on query: 
                INSERT INTO phpbb_user_group
                (user_id, group_id, user_pending)
                VALUES
                (?, ?, ?)
             using args: Array
(
(7 more lines...)
phpbb_functions_user_group_user_attributes_test::test_group_user_attributes with data set #3 ('Setting new default group with settings for user with no settings - user settings overwritten', 1, 3, array('default2', 'avatar.driver.upload', 1, 1, 3), array('default2', 3))
PHPUnit_Extensions_Database_Operation_Exception: COMPOSITE[INSERT] operation failed on query: 
                INSERT INTO phpbb_user_group
                (user_id, group_id, user_pending)
                VALUES
                (?, ?, ?)
             using args: Array
(
(7 more lines...)
phpbb_functions_user_group_user_attributes_test::test_group_user_attributes with data set #4 ('Setting new default group with settings for user with default settings - user settings overwritten', 2, 3, array('default2', 'avatar.driver.upload', 1, 1, 3), array('default2', 3))
PHPUnit_Extensions_Database_Operation_Exception: COMPOSITE[INSERT] operation failed on query: 
                INSERT INTO phpbb_user_group
                (user_id, group_id, user_pending)
                VALUES
                (?, ?, ?)
             using args: Array
(
(7 more lines...)
phpbb_functions_user_group_user_attributes_test::test_group_user_attributes with data set #5 ('Setting new default group with settings for user with custom settings - no change', 3, 3, array('default2', 'avatar.driver.upload', 1, 1, 3), array('custom', 2))
PHPUnit_Extensions_Database_Operation_Exception: COMPOSITE[INSERT] operation failed on query: 
                INSERT INTO phpbb_user_group
                (user_id, group_id, user_pending)
                VALUES
                (?, ?, ?)
             using args: Array
(
(7 more lines...)
phpbb_functions_validate_data_test::test_validate_username with data set #0 ('USERNAME_CHARS_ANY', array(array(), array(), array(), array(), array(), array(), array(), array('INVALID_CHARS'), array('USERNAME_DISALLOWED'), array('USERNAME_TAKEN'), array('USERNAME_TAKEN')))
PHPUnit_Extensions_Database_Operation_Exception: COMPOSITE[INSERT] operation failed on query: 
                INSERT INTO phpbb_groups
                (group_name, group_desc)
                VALUES
                (?, ?)
             using args: Array
(
(7 more lines...)
phpbb_functions_validate_data_test::test_validate_username with data set #3 ('USERNAME_LETTER_NUM', array(array(), array(), array('INVALID_CHARS'), array(), array('INVALID_CHARS'), array(), array('INVALID_CHARS'), array('INVALID_CHARS'), array('USERNAME_DISALLOWED'), array('USERNAME_TAKEN'), array('INVALID_CHARS')))
PHPUnit_Extensions_Database_Operation_Exception: COMPOSITE[INSERT] operation failed on query: 
                INSERT INTO phpbb_groups
                (group_name, group_desc)
                VALUES
                (?, ?)
             using args: Array
(
(7 more lines...)
phpbb_functions_validate_data_test::test_validate_username with data set #4 ('USERNAME_LETTER_NUM_SPACERS', array(array(), array(), array('INVALID_CHARS'), array(), array(), array(), array(), array('INVALID_CHARS'), array('USERNAME_DISALLOWED'), array('USERNAME_TAKEN'), array('USERNAME_TAKEN')))
PHPUnit_Extensions_Database_Operation_Exception: COMPOSITE[INSERT] operation failed on query: 
                INSERT INTO phpbb_groups
                (group_name, group_desc)
                VALUES
                (?, ?)
             using args: Array
(
(7 more lines...)
phpbb_functions_validate_data_test::test_validate_username with data set #1 ('USERNAME_ALPHA_ONLY', array(array(), array(), array('INVALID_CHARS'), array(), array('INVALID_CHARS'), array(), array('INVALID_CHARS'), array('INVALID_CHARS'), array('USERNAME_DISALLOWED'), array('USERNAME_TAKEN'), array('INVALID_CHARS')))
PHPUnit_Extensions_Database_Operation_Exception: COMPOSITE[INSERT] operation failed on query: 
                INSERT INTO phpbb_groups
                (group_name, group_desc)
                VALUES
                (?, ?)
             using args: Array
(
(7 more lines...)
phpbb_functions_validate_data_test::test_validate_username with data set #2 ('USERNAME_ALPHA_SPACERS', array(array(), array(), array('INVALID_CHARS'), array(), array(), array(), array('INVALID_CHARS'), array('INVALID_CHARS'), array('USERNAME_DISALLOWED'), array('USERNAME_TAKEN'), array('USERNAME_TAKEN')))
PHPUnit_Extensions_Database_Operation_Exception: COMPOSITE[INSERT] operation failed on query: 
                INSERT INTO phpbb_groups
                (group_name, group_desc)
                VALUES
                (?, ?)
             using args: Array
(
(7 more lines...)
phpbb_functions_validate_data_test::test_validate_username with data set #5 ('USERNAME_ASCII', array(array(), array(), array(), array(), array(), array(), array('INVALID_CHARS'), array('INVALID_CHARS'), array('USERNAME_DISALLOWED'), array('USERNAME_TAKEN'), array('USERNAME_TAKEN')))
PHPUnit_Extensions_Database_Operation_Exception: COMPOSITE[INSERT] operation failed on query: 
                INSERT INTO phpbb_groups
                (group_name, group_desc)
                VALUES
                (?, ?)
             using args: Array
(
(7 more lines...)
phpbb_notification_submit_post_type_bookmark_test::test_submit_post with data set #1 (array(false), array(array(5, 1, 1)), array(array(5, 1, 1)))
PHPUnit_Extensions_Database_Operation_Exception: COMPOSITE[INSERT] operation failed on query: 
                INSERT INTO phpbb_notifications
                (notification_type_id, user_id, item_id, item_parent_id, notification_read, notification_data)
                VALUES
                (?, ?, ?, ?, ?, ?)
             using args: Array
(
(12 more lines...)
phpbb_notification_submit_post_type_bookmark_test::test_submit_post with data set #0 (array(), array(array(5, 1, 1)), array(array(3, 2, 1), array(5, 1, 1), array(7, 2, 1)))
PHPUnit_Extensions_Database_Operation_Exception: COMPOSITE[INSERT] operation failed on query: 
                INSERT INTO phpbb_notifications
                (notification_type_id, user_id, item_id, item_parent_id, notification_read, notification_data)
                VALUES
                (?, ?, ?, ?, ?, ?)
             using args: Array
(
(12 more lines...)
phpbb_notification_submit_post_type_post_in_queue_test::test_submit_post with data set #1 (array(false), array(array(6, 1, 1)), array(array(3, 2, 1), array(6, 1, 1), array(6, 2, 1), array(8, 2, 1), array(9, 2, 1)))
PHPUnit_Extensions_Database_Operation_Exception: COMPOSITE[INSERT] operation failed on query: 
                INSERT INTO phpbb_notifications
                (notification_type_id, user_id, item_id, item_parent_id, notification_read, notification_data)
                VALUES
                (?, ?, ?, ?, ?, ?)
             using args: Array
(
(12 more lines...)
phpbb_notification_submit_post_type_post_in_queue_test::test_submit_post with data set #0 (array(), array(array(6, 1, 1)), array(array(6, 1, 1)))
PHPUnit_Extensions_Database_Operation_Exception: COMPOSITE[INSERT] operation failed on query: 
                INSERT INTO phpbb_notifications
                (notification_type_id, user_id, item_id, item_parent_id, notification_read, notification_data)
                VALUES
                (?, ?, ?, ?, ?, ?)
             using args: Array
(
(12 more lines...)
phpbb_notification_submit_post_type_post_test::test_submit_post with data set #1 (array(false), array(array(5, 1, 1), array(8, 1, 1)), array(array(5, 1, 1), array(8, 1, 1)))
PHPUnit_Extensions_Database_Operation_Exception: COMPOSITE[INSERT] operation failed on query: 
                INSERT INTO phpbb_forums_watch
                (forum_id, user_id, notify_status)
                VALUES
                (?, ?, ?)
             using args: Array
(
(9 more lines...)
phpbb_notification_submit_post_type_post_test::test_submit_post with data set #0 (array(), array(array(5, 1, 1), array(8, 1, 1)), array(array(3, 2, 1), array(5, 1, 1), array(6, 2, 1), array(7, 2, 1), array(8, 1, 1)))
PHPUnit_Extensions_Database_Operation_Exception: COMPOSITE[INSERT] operation failed on query: 
                INSERT INTO phpbb_forums_watch
                (forum_id, user_id, notify_status)
                VALUES
                (?, ?, ?)
             using args: Array
(
(9 more lines...)
phpbb_notification_submit_post_type_quote_test::test_submit_post with data set #0 (array('[quote=&quot;poster&quot;:uid]poster should not be notified[/quote:uid] [quote=&quot;test&quot;:uid]test should be notified[/quote:uid] [quote=&quot;unauthorized&quot;:uid]unauthorized to read, should not receive a notification[/quote:uid] [quote=&quot;notified&quot;:uid]already notified, should not receive a new notification[/quote:uid] [quote=&quot;disabled&quot;:uid]option disabled, should not receive a notification[/quote:uid] [quote=&quot;default&quot;:uid]option set to default, should receive a notification[/quote:uid] [quote=&quot;doesn\'t exist&quot;:uid]user does not exist, should not receive a notification[/quote:uid]', 'uid'), array(array(5, 1, 1)), array(array(3, 2, 1), array(5, 1, 1), array(5, 2, 1), array(7, 2, 1)))
PHPUnit_Extensions_Database_Operation_Exception: COMPOSITE[INSERT] operation failed on query: 
                INSERT INTO phpbb_notifications
                (notification_type_id, user_id, item_id, item_parent_id, notification_read, notification_data)
                VALUES
                (?, ?, ?, ?, ?, ?)
             using args: Array
(
(12 more lines...)
phpbb_notification_submit_post_type_quote_test::test_submit_post with data set #1 (array('[quote=&quot;poster&quot;:uid]poster should not be notified[/quote:uid] [quote=&quot;test&quot;:uid]test should be notified[/quote:uid] [quote=&quot;unauthorized&quot;:uid]unauthorized to read, should not receive a notification[/quote:uid] [quote=&quot;notified&quot;:uid]already notified, should not receive a new notification[/quote:uid] [quote=&quot;disabled&quot;:uid]option disabled, should not receive a notification[/quote:uid] [quote=&quot;default&quot;:uid]option set to default, should receive a notification[/quote:uid] [quote=&quot;doesn\'t exist&quot;:uid]user does not exist, should not receive a notification[/quote:uid]', 'uid', false), array(array(5, 1, 1)), array(array(5, 1, 1)))
PHPUnit_Extensions_Database_Operation_Exception: COMPOSITE[INSERT] operation failed on query: 
                INSERT INTO phpbb_notifications
                (notification_type_id, user_id, item_id, item_parent_id, notification_read, notification_data)
                VALUES
                (?, ?, ?, ?, ?, ?)
             using args: Array
(
(12 more lines...)
phpbb_notification_submit_post_type_topic_test::test_submit_post with data set #1 (array(false), array(array(8, 1, 1)), array(array(8, 1, 1)))
PHPUnit_Extensions_Database_Operation_Exception: COMPOSITE[INSERT] operation failed on query: 
                INSERT INTO phpbb_forums_watch
                (forum_id, user_id, notify_status)
                VALUES
                (?, ?, ?)
             using args: Array
(
(9 more lines...)
phpbb_notification_submit_post_type_topic_test::test_submit_post with data set #0 (array(), array(array(8, 1, 1)), array(array(7, 2, 1), array(8, 1, 1), array(8, 2, 1)))
PHPUnit_Extensions_Database_Operation_Exception: COMPOSITE[INSERT] operation failed on query: 
                INSERT INTO phpbb_forums_watch
                (forum_id, user_id, notify_status)
                VALUES
                (?, ?, ?)
             using args: Array
(
(9 more lines...)
phpbb_notification_test::test_notifications
SQL ERROR [ mssqlnative ]<br /><br />SQLSTATE: 23000
code: 544
message: [Microsoft][SQL Server Native Client 11.0][SQL Server]Cannot insert explicit value for identity column in table 'phpbb_notification_types' when IDENTITY_INSERT is set to OFF.
 [544]<br /><br />SQL<br /><br />INSERT INTO phpbb_notification_types  (notification_type_id, notification_type_name, notification_type_enabled) VALUES (1, 'notification.type.quote', 1)

C:\Users\Administrator\bamboo-agent-home\xml-data\build-dir\PHPBB3-MSSQLNATIVE-BUILD\phpBB\phpbb\db\driver\driver.php:855
C:\Users\Administrator\bamboo-agent-home\xml-data\build-dir\PHPBB3-MSSQLNATIVE-BUILD\phpBB\phpbb\db\driver\mssqlnative.php:143
(1 more lines...)
phpbb_privmsgs_delete_user_pms_test::test_delete_user_pms with data set #2 (5, array(array(1), array(2), array(3), array(4), array(5)), array(array(1, 2), array(1, 3), array(1, 4), array(2, 2), array(2, 4), array(3, 2), array(4, 3), array(5, 2), array(5, 3), array(5, 4)))
PHPUnit_Extensions_Database_Operation_Exception: COMPOSITE[INSERT] operation failed on query: 
                INSERT INTO phpbb_privmsgs_to
                (msg_id, user_id, author_id, pm_new, pm_unread, folder_id)
                VALUES
                (?, ?, ?, ?, ?, ?)
             using args: Array
(
(10 more lines...)
phpbb_privmsgs_delete_user_pms_test::test_delete_user_pms with data set #0 (2, array(array(1)), array(array(1, 3)))
PHPUnit_Extensions_Database_Operation_Exception: COMPOSITE[INSERT] operation failed on query: 
                INSERT INTO phpbb_privmsgs_to
                (msg_id, user_id, author_id, pm_new, pm_unread, folder_id)
                VALUES
                (?, ?, ?, ?, ?, ?)
             using args: Array
(
(10 more lines...)
phpbb_privmsgs_delete_user_pms_test::test_delete_user_pms with data set #1 (3, array(array(1), array(2), array(3), array(5)), array(array(1, 2), array(1, 4), array(2, 2), array(2, 4), array(3, 2), array(5, 2), array(5, 4)))
PHPUnit_Extensions_Database_Operation_Exception: COMPOSITE[INSERT] operation failed on query: 
                INSERT INTO phpbb_privmsgs_to
                (msg_id, user_id, author_id, pm_new, pm_unread, folder_id)
                VALUES
                (?, ?, ?, ?, ?, ?)
             using args: Array
(
(10 more lines...)
phpbb_search_native_test::test_split_keywords with data set #12 ('foo- foo', 'all', true, array(1), array(), array())
PHPUnit_Extensions_Database_Operation_Exception: COMPOSITE[INSERT] operation failed on query: 
                INSERT INTO phpbb_posts
                (post_username, post_subject, post_text)
                VALUES
                (?, ?, ?)
             using args: Array
(
(8 more lines...)
phpbb_search_native_test::test_split_keywords with data set #11 ('foo foo-', 'all', true, array(1), array(), array())
PHPUnit_Extensions_Database_Operation_Exception: COMPOSITE[INSERT] operation failed on query: 
                INSERT INTO phpbb_posts
                (post_username, post_subject, post_text)
                VALUES
                (?, ?, ?)
             using args: Array
(
(8 more lines...)
phpbb_search_native_test::test_split_keywords with data set #14 ('foo-bar-foo', 'all', true, array(1, 2), array(), array())
PHPUnit_Extensions_Database_Operation_Exception: COMPOSITE[INSERT] operation failed on query: 
                INSERT INTO phpbb_posts
                (post_username, post_subject, post_text)
                VALUES
                (?, ?, ?)
             using args: Array
(
(8 more lines...)
phpbb_search_native_test::test_split_keywords with data set #13 ('foo-bar', 'all', true, array(1, 2), array(), array())
PHPUnit_Extensions_Database_Operation_Exception: COMPOSITE[INSERT] operation failed on query: 
                INSERT INTO phpbb_posts
                (post_username, post_subject, post_text)
                VALUES
                (?, ?, ?)
             using args: Array
(
(8 more lines...)
phpbb_search_native_test::test_split_keywords with data set #10 ('-foo foo', 'all', true, array(1), array(1), array())
PHPUnit_Extensions_Database_Operation_Exception: COMPOSITE[INSERT] operation failed on query: 
                INSERT INTO phpbb_posts
                (post_username, post_subject, post_text)
                VALUES
                (?, ?, ?)
             using args: Array
(
(8 more lines...)
phpbb_search_native_test::test_split_keywords with data set #16 ('commonword foo', 'all', true, array(1), array(), array('commonword'))
PHPUnit_Extensions_Database_Operation_Exception: COMPOSITE[INSERT] operation failed on query: 
                INSERT INTO phpbb_posts
                (post_username, post_subject, post_text)
                VALUES
                (?, ?, ?)
             using args: Array
(
(8 more lines...)
phpbb_search_native_test::test_split_keywords with data set #15 ('commonword', 'all', false, NULL, NULL, array('commonword'))
PHPUnit_Extensions_Database_Operation_Exception: COMPOSITE[INSERT] operation failed on query: 
                INSERT INTO phpbb_posts
                (post_username, post_subject, post_text)
                VALUES
                (?, ?, ?)
             using args: Array
(
(8 more lines...)
phpbb_search_native_test::test_split_keywords with data set #8 ('-foo -bar', 'all', true, array(), array(1, 2), array())
PHPUnit_Extensions_Database_Operation_Exception: COMPOSITE[INSERT] operation failed on query: 
                INSERT INTO phpbb_posts
                (post_username, post_subject, post_text)
                VALUES
                (?, ?, ?)
             using args: Array
(
(8 more lines...)
phpbb_search_native_test::test_split_keywords with data set #9 ('foo -foo', 'all', true, array(1), array(1), array())
PHPUnit_Extensions_Database_Operation_Exception: COMPOSITE[INSERT] operation failed on query: 
                INSERT INTO phpbb_posts
                (post_username, post_subject, post_text)
                VALUES
                (?, ?, ?)
             using args: Array
(
(8 more lines...)
phpbb_search_native_test::test_split_keywords with data set #6 ('foo -bar', 'all', true, array(1), array(2), array())
PHPUnit_Extensions_Database_Operation_Exception: COMPOSITE[INSERT] operation failed on query: 
                INSERT INTO phpbb_posts
                (post_username, post_subject, post_text)
                VALUES
                (?, ?, ?)
             using args: Array
(
(8 more lines...)
phpbb_search_native_test::test_split_keywords with data set #7 ('-foo', 'all', true, array(), array(1), array())
PHPUnit_Extensions_Database_Operation_Exception: COMPOSITE[INSERT] operation failed on query: 
                INSERT INTO phpbb_posts
                (post_username, post_subject, post_text)
                VALUES
                (?, ?, ?)
             using args: Array
(
(8 more lines...)
phpbb_search_native_test::test_split_keywords with data set #4 ('f o o', 'all', false, NULL, NULL, array('f', 'o', 'o'))
PHPUnit_Extensions_Database_Operation_Exception: COMPOSITE[INSERT] operation failed on query: 
                INSERT INTO phpbb_posts
                (post_username, post_subject, post_text)
                VALUES
                (?, ?, ?)
             using args: Array
(
(8 more lines...)
phpbb_search_native_test::test_split_keywords with data set #5 ('f -o -o', 'all', false, NULL, NULL, array('f', 'o', 'o'))
PHPUnit_Extensions_Database_Operation_Exception: COMPOSITE[INSERT] operation failed on query: 
                INSERT INTO phpbb_posts
                (post_username, post_subject, post_text)
                VALUES
                (?, ?, ?)
             using args: Array
(
(8 more lines...)
Fixed tests 23
Status Test Failing since View job Duration
Successful phpbb_dbal_db_tools_test::test_created_column test_column_remove History
Failing since build #30 (Rebuilt by Marc) Build and Test < 1 sec
Successful phpbb_dbal_db_tools_test::test_created_column test_column_remove_similar_name History
Failing since build #30 (Rebuilt by Marc) Build and Test < 1 sec
Successful phpbb_dbal_db_tools_test::test_created_column test_column_change_with_index History
Failing since build #30 (Rebuilt by Marc) Build and Test < 1 sec
Successful phpbb_dbal_db_tools_test::test_created_column test_column_remove_with_index History
Failing since build #30 (Rebuilt by Marc) Build and Test < 1 sec
Successful phpbb_dbal_migrator_test test_schema History
Failing since build #30 (Rebuilt by Marc) Build and Test < 1 sec
Successful phpbb_dbal_migrator_test test_fail History
Failing since build #30 (Rebuilt by Marc) Build and Test < 1 sec
Successful phpbb_dbal_migrator_test test_revert History
Failing since build #30 (Rebuilt by Marc) Build and Test < 1 sec
Successful phpbb_dbal_migrator_test test_update History
Failing since build #30 (Rebuilt by Marc) Build and Test < 1 sec
Successful phpbb_dbal_migrator_test test_unfulfillable History
Failing since build #30 (Rebuilt by Marc) Build and Test < 1 sec
Successful phpbb_dbal_write_test::test_build_array_insert test_multiple_insert History
Failing since build #30 (Rebuilt by Marc) Build and Test < 1 sec
Successful phpbb_dbal_write_test::test_build_array_insert test_build_array_insert with data set #0 History
Failing since build #30 (Rebuilt by Marc) Build and Test < 1 sec
Successful phpbb_dbal_write_test::test_build_array_insert test_build_array_insert with data set #1 History
Failing since build #30 (Rebuilt by Marc) Build and Test < 1 sec
Successful phpbb_dbal_write_test::test_update test_update with data set #1 History
Failing since build #30 (Rebuilt by Marc) Build and Test < 1 sec
Successful phpbb_dbal_write_test::test_update test_update with data set #0 History
Failing since build #30 (Rebuilt by Marc) Build and Test < 1 sec
Successful phpbb_filespec_test::test_is_image_get_mimetype test_is_image_get_mimetype with data set #2 History
Failing since build #30 (Rebuilt by Marc) Build and Test < 1 sec
Successful phpbb_filespec_test::test_is_image_get_mimetype test_is_image_get_mimetype with data set #1 History
Failing since build #30 (Rebuilt by Marc) Build and Test < 1 sec
Successful phpbb_filespec_test::test_is_image_get_mimetype test_is_image_get_mimetype with data set #3 History
Failing since build #30 (Rebuilt by Marc) Build and Test < 1 sec
Successful phpbb_filespec_test::test_is_image_get_mimetype test_is_image_get_mimetype with data set #6 History
Failing since build #30 (Rebuilt by Marc) Build and Test < 1 sec
Successful phpbb_filespec_test::test_is_image_get_mimetype test_is_image_get_mimetype with data set #5 History
Failing since build #30 (Rebuilt by Marc) Build and Test < 1 sec
Successful phpbb_filespec_test::test_is_image_get_mimetype test_is_image_get_mimetype with data set #7 History
Failing since build #30 (Rebuilt by Marc) Build and Test < 1 sec
Successful phpbb_filespec_test::test_is_image_get_mimetype test_is_image_get_mimetype with data set #0 History
Failing since build #30 (Rebuilt by Marc) Build and Test < 1 sec
Successful phpbb_filespec_test::test_move_file test_move_file with data set #5 History
Failing since build #30 (Rebuilt by Marc) Build and Test < 1 sec
Successful phpbb_migrator_convert_timezones_test test_convert History
Failing since build #30 (Rebuilt by Marc) Build and Test < 1 sec