Build: #19 failed

Job: Create PDF failed

Stages & jobs

  1. Default Stage

Build log

The build generated 250 lines of output. Download or view full build log

14-Apr-2021 18:23:16 Build Documentation - phpBB Documentation - 3.3.x - Create PDF #19 (DOC-PHPBB7-JOB1-19) started building on agent Agent 2
14-Apr-2021 18:23:16
14-Apr-2021 18:23:16 Build working directory is /home/bamboo/xml-data/build-dir/DOC-PHPBB7-JOB1
14-Apr-2021 18:23:16 Executing build Documentation - phpBB Documentation - 3.3.x - Create PDF #19 (DOC-PHPBB7-JOB1-19)
14-Apr-2021 18:23:16 Starting task 'Checkout Default Repository' of type 'com.atlassian.bamboo.plugins.vcs:task.vcs.checkout'
14-Apr-2021 18:23:16 Checking out into /home/bamboo/xml-data/build-dir/DOC-PHPBB7-JOB1
14-Apr-2021 18:23:16 Updating source code to revision: 08396b3cda0eee0865ee0cfd012ccf382321a74e
14-Apr-2021 18:23:16 Fetching 'refs/heads/3.3.x' from 'https://github.com/phpbb/documentation.git'.
14-Apr-2021 18:23:17 From https://github.com/phpbb/documentation
14-Apr-2021 18:23:17    5dfbf3b..08396b3  3.3.x      -> 3.3.x
14-Apr-2021 18:23:17 Checking out revision 08396b3cda0eee0865ee0cfd012ccf382321a74e.
14-Apr-2021 18:23:17 Creating local git repository in '/home/bamboo/xml-data/build-dir/DOC-PHPBB7-JOB1/.git'.
14-Apr-2021 18:23:17 Cloning into '/home/bamboo/xml-data/build-dir/DOC-PHPBB7-JOB1'...
14-Apr-2021 18:23:17 done.
14-Apr-2021 18:23:17 Switched to a new branch '3.3.x'
14-Apr-2021 18:23:17 Branch 3.3.x set up to track remote branch 3.3.x from origin.
14-Apr-2021 18:23:17 Updated source code to revision: 08396b3cda0eee0865ee0cfd012ccf382321a74e
14-Apr-2021 18:23:17 Finished task 'Checkout Default Repository' with result: Success
14-Apr-2021 18:23:17 Running pre-build action: VCS Version Collector
14-Apr-2021 18:23:17 Skipping execution of task 'Generate PDF' as it is disabled
14-Apr-2021 18:23:17
Substituting variable: ${bamboo.planRepository.branchName} with 3.3.x
14-Apr-2021 18:23:17
Substituting variable: ${bamboo.planRepository.branchName} with 3.3.x
14-Apr-2021 18:23:17
Substituting variable: ${bamboo.planRepository.branchName} with 3.3.x
14-Apr-2021 18:23:17
Substituting variable: ${bamboo.planRepository.branchName} with 3.3.x
14-Apr-2021 18:23:17 Starting task 'Generate PDF' of type 'com.atlassian.bamboo.plugins.scripttask:task.builder.script'
14-Apr-2021 18:23:17
Beginning to execute external process for build 'Documentation - phpBB Documentation - 3.3.x - Create PDF #19 (DOC-PHPBB7-JOB1-19)'
... running command line:
/bin/sh /home/bamboo/temp/DOC-PHPBB7-JOB1-19-ScriptBuildTask-6177852419008939010.sh
... in: /home/bamboo/xml-data/build-dir/DOC-PHPBB7-JOB1/documentation
... using extra environment variables:
bamboo_planRepository_1_branch=3.3.x
bamboo_planRepository_1_branchDisplayName=3.3.x
bamboo_repository_revision_number=08396b3cda0eee0865ee0cfd012ccf382321a74e
bamboo_resultsUrl=https://bamboo.phpbb.com/browse/DOC-PHPBB7-JOB1-19
bamboo_capability_system_builder_command_Git=/usr/bin/git
bamboo_build_working_directory=/home/bamboo/xml-data/build-dir/DOC-PHPBB7-JOB1
bamboo_planRepository_1_name=Documentation
bamboo_buildKey=DOC-PHPBB7-JOB1
bamboo_repository_113803265_git_branch=3.3.x
bamboo_shortPlanName=phpBB Documentation
bamboo_capability_system_builder_command_fop=/usr/bin/fop
bamboo_capability_dbms_sqlite_2=true
bamboo_planRepository_name=Documentation
bamboo_buildNumber=19
bamboo_capability_system_builder_phpunit_PHPUnit=/usr/bin/phpunit
bamboo_shortJobName=Create PDF
bamboo_buildResultsUrl=https://bamboo.phpbb.com/browse/DOC-PHPBB7-JOB1-19
bamboo_planRepository_repositoryUrl=https://github.com/phpbb/documentation.git
bamboo_agentId=41779201
bamboo_repository_113803265_branch_name=3.3.x
bamboo_planName=Documentation - phpBB Documentation - 3.3.x
bamboo_shortPlanKey=PHPBB7
bamboo_shortJobKey=JOB1
bamboo_capability_dbms_mysql_55=true
bamboo_capability_system_jdk_JDK_1_7_0_65=/usr/lib/jvm/java-7-openjdk-amd64
bamboo_planRepository_revision=08396b3cda0eee0865ee0cfd012ccf382321a74e
bamboo_buildTimeStamp=2021-04-14T18:22:51.476Z
bamboo_repository_previous_revision_number=5dfbf3bddb57f1ffb4557861c1442013e0f21797
bamboo_repository_113803265_name=Documentation
bamboo_capability_system_jdk_JDK_1_6_0_16=/usr/lib/jvm/java-6-sun-1.6.0.16
bamboo_capability_system_builder_mvn2_Maven_2=/usr/share/maven2
bamboo_planRepository_previousRevision=5dfbf3bddb57f1ffb4557861c1442013e0f21797
bamboo_repository_git_branch=3.3.x
bamboo_buildResultKey=DOC-PHPBB7-JOB1-19
bamboo_repository_branch_name=3.3.x
bamboo_buildPlanName=Documentation - phpBB Documentation - 3.3.x - Create PDF
bamboo_planRepository_1_revision=08396b3cda0eee0865ee0cfd012ccf382321a74e
bamboo_repository_name=Documentation
bamboo_buildFailed=false
bamboo_capability_system_docker_executable=/usr/bin/docker
bamboo_planRepository_branch=3.3.x
bamboo_repository_113803265_git_repositoryUrl=https://github.com/phpbb/documentation.git
bamboo_agentWorkingDirectory=/home/bamboo/xml-data/build-dir
bamboo_capability_system_git_executable=/usr/bin/git
bamboo_repository_113803265_previous_revision_number=5dfbf3bddb57f1ffb4557861c1442013e0f21797
bamboo_capability_system_builder_phpunit_PHPUnit_3_4=/usr/bin/phpunit
bamboo_repository_git_username=phpbb
bamboo_planRepository_1_previousRevision=5dfbf3bddb57f1ffb4557861c1442013e0f21797
bamboo_planRepository_branchDisplayName=3.3.x
bamboo_planRepository_1_type=gh2
bamboo_planRepository_branchName=3.3.x
bamboo_capability_system_jdk_JDK=/usr/lib/jvm/java-6-sun
bamboo_plan_storageTag=plan-113606657
bamboo_hg_cache_directory=/home/bamboo/xml-data/build-dir/_hg-repositories-cache
bamboo_planRepository_1_username=phpbb
bamboo_planRepository_type=gh2
bamboo_git_cache_directory=/home/bamboo/xml-data/build-dir/_git-repositories-cache
bamboo_repository_git_repositoryUrl=https://github.com/phpbb/documentation.git
bamboo_capability_system_builder_ant_Ant=/usr/share/ant
bamboo_tmp_directory=/home/bamboo/temp
bamboo_repository_113803265_revision_number=08396b3cda0eee0865ee0cfd012ccf382321a74e
bamboo_working_directory=/home/bamboo/xml-data/build-dir/DOC-PHPBB7-JOB1
bamboo_planKey=DOC-PHPBB7
bamboo_capability_local=true
bamboo_planRepository_1_repositoryUrl=https://github.com/phpbb/documentation.git
bamboo_planRepository_username=phpbb
bamboo_capability_system_jdk_JDK_1_6=/usr/lib/jvm/java-6-sun
bamboo_capability_system_jdk_JDK_1_7=/usr/lib/jvm/java-7-openjdk-amd64
bamboo_repository_113803265_git_username=phpbb
bamboo_planRepository_1_branchName=3.3.x
14-Apr-2021 18:23:41 Apr 14, 2021 6:23:41 PM org.apache.fop.cli.InputHandler warning
14-Apr-2021 18:23:41 WARNING: Making portrait pages on USletter paper (8.5inx11in)
14-Apr-2021 18:23:43 Apr 14, 2021 6:23:43 PM org.apache.fop.events.LoggingEventListener processEvent
14-Apr-2021 18:23:43 WARNING: Font "Symbol,normal,700" not found. Substituting with "Symbol,normal,400".
14-Apr-2021 18:23:43 Apr 14, 2021 6:23:43 PM org.apache.fop.events.LoggingEventListener processEvent
14-Apr-2021 18:23:43 WARNING: Font "ZapfDingbats,normal,700" not found. Substituting with "ZapfDingbats,normal,400".
14-Apr-2021 18:23:43 Apr 14, 2021 6:23:43 PM org.apache.fop.hyphenation.Hyphenator getHyphenationTree
14-Apr-2021 18:23:43 SEVERE: Couldn't find hyphenation pattern for lang="en".
14-Apr-2021 18:23:43 Apr 14, 2021 6:23:43 PM org.apache.fop.events.LoggingEventListener processEvent
14-Apr-2021 18:23:43 INFO: Rendered page #1.
14-Apr-2021 18:23:43 Apr 14, 2021 6:23:43 PM org.apache.fop.events.LoggingEventListener processEvent
14-Apr-2021 18:23:43 INFO: Rendered page #2.
14-Apr-2021 18:23:43 Apr 14, 2021 6:23:43 PM org.apache.fop.cli.Main startFOP
14-Apr-2021 18:23:43 SEVERE: Exception
14-Apr-2021 18:23:43 org.apache.fop.apps.FOPException: org.apache.fop.fo.ValidationException: Property ID "toc.N10001.minor" (found on "fo:block") previously used; ID values must be unique within a document! (See fo:block, id=toc.N10001.minor)
14-Apr-2021 18:23:43 javax.xml.transform.TransformerException: org.apache.fop.fo.ValidationException: Property ID "toc.N10001.minor" (found on "fo:block") previously used; ID values must be unique within a document! (See fo:block, id=toc.N10001.minor)
14-Apr-2021 18:23:43         at org.apache.fop.cli.InputHandler.transformTo(InputHandler.java:303)
14-Apr-2021 18:23:43         at org.apache.fop.cli.InputHandler.renderTo(InputHandler.java:130)
14-Apr-2021 18:23:43         at org.apache.fop.cli.Main.startFOP(Main.java:177)
14-Apr-2021 18:23:43         at org.apache.fop.cli.Main.main(Main.java:208)
14-Apr-2021 18:23:43 Caused by: javax.xml.transform.TransformerException: org.apache.fop.fo.ValidationException: Property ID "toc.N10001.minor" (found on "fo:block") previously used; ID values must be unique within a document! (See fo:block, id=toc.N10001.minor)
14-Apr-2021 18:23:43         at org.apache.xalan.templates.ElemCopyOf.execute(ElemCopyOf.java:210)
14-Apr-2021 18:23:43         at org.apache.xalan.transformer.TransformerImpl.executeChildTemplates(TransformerImpl.java:2411)
14-Apr-2021 18:23:43         at org.apache.xalan.templates.ElemLiteralResult.execute(ElemLiteralResult.java:1374)
14-Apr-2021 18:23:43         at org.apache.xalan.transformer.TransformerImpl.executeChildTemplates(TransformerImpl.java:2411)
14-Apr-2021 18:23:43         at org.apache.xalan.templates.ElemLiteralResult.execute(ElemLiteralResult.java:1374)
14-Apr-2021 18:23:43         at org.apache.xalan.transformer.TransformerImpl.executeChildTemplates(TransformerImpl.java:2411)
14-Apr-2021 18:23:43         at org.apache.xalan.templates.ElemTemplate.execute(ElemTemplate.java:392)
14-Apr-2021 18:23:43         at org.apache.xalan.templates.ElemCallTemplate.execute(ElemCallTemplate.java:246)
14-Apr-2021 18:23:43         at org.apache.xalan.transformer.TransformerImpl.executeChildTemplates(TransformerImpl.java:2411)
14-Apr-2021 18:23:43         at org.apache.xalan.templates.ElemIf.execute(ElemIf.java:160)
14-Apr-2021 18:23:43         at org.apache.xalan.transformer.TransformerImpl.executeChildTemplates(TransformerImpl.java:2411)
14-Apr-2021 18:23:43         at org.apache.xalan.templates.ElemTemplate.execute(ElemTemplate.java:392)
14-Apr-2021 18:23:43         at org.apache.xalan.templates.ElemCallTemplate.execute(ElemCallTemplate.java:246)
14-Apr-2021 18:23:43         at org.apache.xalan.templates.ElemApplyTemplates.transformSelectedNodes(ElemApplyTemplates.java:393)
14-Apr-2021 18:23:43         at org.apache.xalan.templates.ElemApplyTemplates.execute(ElemApplyTemplates.java:176)
14-Apr-2021 18:23:43         at org.apache.xalan.transformer.TransformerImpl.executeChildTemplates(TransformerImpl.java:2411)
14-Apr-2021 18:23:43         at org.apache.xalan.templates.ElemLiteralResult.execute(ElemLiteralResult.java:1374)
14-Apr-2021 18:23:43         at org.apache.xalan.templates.ElemApplyTemplates.transformSelectedNodes(ElemApplyTemplates.java:393)
14-Apr-2021 18:23:43         at org.apache.xalan.templates.ElemApplyTemplates.execute(ElemApplyTemplates.java:176)
14-Apr-2021 18:23:43         at org.apache.xalan.templates.ElemApplyTemplates.transformSelectedNodes(ElemApplyTemplates.java:393)
14-Apr-2021 18:23:43         at org.apache.xalan.templates.ElemApplyTemplates.execute(ElemApplyTemplates.java:176)
14-Apr-2021 18:23:43         at org.apache.xalan.transformer.TransformerImpl.executeChildTemplates(TransformerImpl.java:2411)
14-Apr-2021 18:23:43         at org.apache.xalan.templates.ElemIf.execute(ElemIf.java:160)
14-Apr-2021 18:23:43         at org.apache.xalan.transformer.TransformerImpl.executeChildTemplates(TransformerImpl.java:2411)
14-Apr-2021 18:23:43         at org.apache.xalan.templates.ElemChoose.execute(ElemChoose.java:139)
14-Apr-2021 18:23:43         at org.apache.xalan.transformer.TransformerImpl.executeChildTemplates(TransformerImpl.java:2411)
14-Apr-2021 18:23:43         at org.apache.xalan.templates.ElemChoose.execute(ElemChoose.java:139)
14-Apr-2021 18:23:43         at org.apache.xalan.transformer.TransformerImpl.executeChildTemplates(TransformerImpl.java:2411)
14-Apr-2021 18:23:43         at org.apache.xalan.templates.ElemChoose.execute(ElemChoose.java:139)
14-Apr-2021 18:23:43         at org.apache.xalan.transformer.TransformerImpl.executeChildTemplates(TransformerImpl.java:2411)
14-Apr-2021 18:23:43         at org.apache.xalan.transformer.TransformerImpl.applyTemplateToNode(TransformerImpl.java:2281)
14-Apr-2021 18:23:43         at org.apache.xalan.transformer.TransformerImpl.transformNode(TransformerImpl.java:1367)
14-Apr-2021 18:23:43         at org.apache.xalan.transformer.TransformerImpl.transform(TransformerImpl.java:709)
14-Apr-2021 18:23:43         at org.apache.xalan.transformer.TransformerImpl.transform(TransformerImpl.java:1284)
14-Apr-2021 18:23:43         at org.apache.xalan.transformer.TransformerImpl.transform(TransformerImpl.java:1262)
14-Apr-2021 18:23:43         at org.apache.fop.cli.InputHandler.transformTo(InputHandler.java:300)
14-Apr-2021 18:23:43         ... 3 more
14-Apr-2021 18:23:43 Caused by: org.apache.fop.fo.ValidationException: Property ID "toc.N10001.minor" (found on "fo:block") previously used; ID values must be unique within a document! (See fo:block, id=toc.N10001.minor)
14-Apr-2021 18:23:43         at org.apache.fop.events.ValidationExceptionFactory.createException(ValidationExceptionFactory.java:38)
14-Apr-2021 18:23:43         at org.apache.fop.events.EventExceptionManager.throwException(EventExceptionManager.java:58)
14-Apr-2021 18:23:43         at org.apache.fop.events.DefaultEventBroadcaster$1.invoke(DefaultEventBroadcaster.java:175)
14-Apr-2021 18:23:43         at com.sun.proxy.$Proxy4.idNotUnique(Unknown Source)
14-Apr-2021 18:23:43         at org.apache.fop.fo.FObj.checkId(FObj.java:173)
14-Apr-2021 18:23:43         at org.apache.fop.fo.FObj.startOfNode(FObj.java:154)
14-Apr-2021 18:23:43         at org.apache.fop.fo.flow.Block.startOfNode(Block.java:144)
14-Apr-2021 18:23:43         at org.apache.fop.fo.FOTreeBuilder$MainFOHandler.startElement(FOTreeBuilder.java:325)
14-Apr-2021 18:23:43         at org.apache.fop.fo.FOTreeBuilder.startElement(FOTreeBuilder.java:175)
14-Apr-2021 18:23:43         at org.apache.xml.serializer.ToXMLSAXHandler.closeStartTag(ToXMLSAXHandler.java:204)
14-Apr-2021 18:23:43         at org.apache.xml.serializer.ToSAXHandler.flushPending(ToSAXHandler.java:277)
14-Apr-2021 18:23:43         at org.apache.xml.serializer.ToXMLSAXHandler.startPrefixMapping(ToXMLSAXHandler.java:348)
14-Apr-2021 18:23:43         at org.apache.xml.serializer.ToXMLSAXHandler.startPrefixMapping(ToXMLSAXHandler.java:318)
14-Apr-2021 18:23:43         at org.apache.xml.dtm.ref.DTMTreeWalker.startNode(DTMTreeWalker.java:251)
14-Apr-2021 18:23:43         at org.apache.xml.dtm.ref.DTMTreeWalker.traverse(DTMTreeWalker.java:112)
14-Apr-2021 18:23:43         at org.apache.xml.dtm.ref.sax2dtm.SAX2DTM.dispatchToEvents(SAX2DTM.java:748)
14-Apr-2021 18:23:43         at org.apache.xalan.serialize.SerializerUtils.outputResultTreeFragment(SerializerUtils.java:139)
14-Apr-2021 18:23:43         at org.apache.xalan.templates.ElemCopyOf.execute(ElemCopyOf.java:190)
14-Apr-2021 18:23:43         ... 38 more
14-Apr-2021 18:23:43
14-Apr-2021 18:23:43 ---------
14-Apr-2021 18:23:43
14-Apr-2021 18:23:43 javax.xml.transform.TransformerException: org.apache.fop.fo.ValidationException: Property ID "toc.N10001.minor" (found on "fo:block") previously used; ID values must be unique within a document! (See fo:block, id=toc.N10001.minor)
14-Apr-2021 18:23:43         at org.apache.xalan.templates.ElemCopyOf.execute(ElemCopyOf.java:210)
14-Apr-2021 18:23:43         at org.apache.xalan.transformer.TransformerImpl.executeChildTemplates(TransformerImpl.java:2411)
14-Apr-2021 18:23:43         at org.apache.xalan.templates.ElemLiteralResult.execute(ElemLiteralResult.java:1374)
14-Apr-2021 18:23:43         at org.apache.xalan.transformer.TransformerImpl.executeChildTemplates(TransformerImpl.java:2411)
14-Apr-2021 18:23:43         at org.apache.xalan.templates.ElemLiteralResult.execute(ElemLiteralResult.java:1374)
14-Apr-2021 18:23:43         at org.apache.xalan.transformer.TransformerImpl.executeChildTemplates(TransformerImpl.java:2411)
14-Apr-2021 18:23:43         at org.apache.xalan.templates.ElemTemplate.execute(ElemTemplate.java:392)
14-Apr-2021 18:23:43         at org.apache.xalan.templates.ElemCallTemplate.execute(ElemCallTemplate.java:246)
14-Apr-2021 18:23:43         at org.apache.xalan.transformer.TransformerImpl.executeChildTemplates(TransformerImpl.java:2411)
14-Apr-2021 18:23:43         at org.apache.xalan.templates.ElemIf.execute(ElemIf.java:160)
14-Apr-2021 18:23:43         at org.apache.xalan.transformer.TransformerImpl.executeChildTemplates(TransformerImpl.java:2411)
14-Apr-2021 18:23:43         at org.apache.xalan.templates.ElemTemplate.execute(ElemTemplate.java:392)
14-Apr-2021 18:23:43         at org.apache.xalan.templates.ElemCallTemplate.execute(ElemCallTemplate.java:246)
14-Apr-2021 18:23:43         at org.apache.xalan.templates.ElemApplyTemplates.transformSelectedNodes(ElemApplyTemplates.java:393)
14-Apr-2021 18:23:43         at org.apache.xalan.templates.ElemApplyTemplates.execute(ElemApplyTemplates.java:176)
14-Apr-2021 18:23:43         at org.apache.xalan.transformer.TransformerImpl.executeChildTemplates(TransformerImpl.java:2411)
14-Apr-2021 18:23:43         at org.apache.xalan.templates.ElemLiteralResult.execute(ElemLiteralResult.java:1374)
14-Apr-2021 18:23:43         at org.apache.xalan.templates.ElemApplyTemplates.transformSelectedNodes(ElemApplyTemplates.java:393)
14-Apr-2021 18:23:43         at org.apache.xalan.templates.ElemApplyTemplates.execute(ElemApplyTemplates.java:176)
14-Apr-2021 18:23:43         at org.apache.xalan.templates.ElemApplyTemplates.transformSelectedNodes(ElemApplyTemplates.java:393)
14-Apr-2021 18:23:43         at org.apache.xalan.templates.ElemApplyTemplates.execute(ElemApplyTemplates.java:176)
14-Apr-2021 18:23:43         at org.apache.xalan.transformer.TransformerImpl.executeChildTemplates(TransformerImpl.java:2411)
14-Apr-2021 18:23:43         at org.apache.xalan.templates.ElemIf.execute(ElemIf.java:160)
14-Apr-2021 18:23:43         at org.apache.xalan.transformer.TransformerImpl.executeChildTemplates(TransformerImpl.java:2411)
14-Apr-2021 18:23:43         at org.apache.xalan.templates.ElemChoose.execute(ElemChoose.java:139)
14-Apr-2021 18:23:43         at org.apache.xalan.transformer.TransformerImpl.executeChildTemplates(TransformerImpl.java:2411)
14-Apr-2021 18:23:43         at org.apache.xalan.templates.ElemChoose.execute(ElemChoose.java:139)
14-Apr-2021 18:23:43         at org.apache.xalan.transformer.TransformerImpl.executeChildTemplates(TransformerImpl.java:2411)
14-Apr-2021 18:23:43         at org.apache.xalan.templates.ElemChoose.execute(ElemChoose.java:139)
14-Apr-2021 18:23:43         at org.apache.xalan.transformer.TransformerImpl.executeChildTemplates(TransformerImpl.java:2411)
14-Apr-2021 18:23:43         at org.apache.xalan.transformer.TransformerImpl.applyTemplateToNode(TransformerImpl.java:2281)
14-Apr-2021 18:23:43         at org.apache.xalan.transformer.TransformerImpl.transformNode(TransformerImpl.java:1367)
14-Apr-2021 18:23:43         at org.apache.xalan.transformer.TransformerImpl.transform(TransformerImpl.java:709)
14-Apr-2021 18:23:43         at org.apache.xalan.transformer.TransformerImpl.transform(TransformerImpl.java:1284)
14-Apr-2021 18:23:43         at org.apache.xalan.transformer.TransformerImpl.transform(TransformerImpl.java:1262)
14-Apr-2021 18:23:43         at org.apache.fop.cli.InputHandler.transformTo(InputHandler.java:300)
14-Apr-2021 18:23:43         at org.apache.fop.cli.InputHandler.renderTo(InputHandler.java:130)
14-Apr-2021 18:23:43         at org.apache.fop.cli.Main.startFOP(Main.java:177)
14-Apr-2021 18:23:43         at org.apache.fop.cli.Main.main(Main.java:208)
14-Apr-2021 18:23:43 Caused by: org.apache.fop.fo.ValidationException: Property ID "toc.N10001.minor" (found on "fo:block") previously used; ID values must be unique within a document! (See fo:block, id=toc.N10001.minor)
14-Apr-2021 18:23:43         at org.apache.fop.events.ValidationExceptionFactory.createException(ValidationExceptionFactory.java:38)
14-Apr-2021 18:23:43         at org.apache.fop.events.EventExceptionManager.throwException(EventExceptionManager.java:58)
14-Apr-2021 18:23:43         at org.apache.fop.events.DefaultEventBroadcaster$1.invoke(DefaultEventBroadcaster.java:175)
14-Apr-2021 18:23:43         at com.sun.proxy.$Proxy4.idNotUnique(Unknown Source)
14-Apr-2021 18:23:43         at org.apache.fop.fo.FObj.checkId(FObj.java:173)
14-Apr-2021 18:23:43         at org.apache.fop.fo.FObj.startOfNode(FObj.java:154)
14-Apr-2021 18:23:43         at org.apache.fop.fo.flow.Block.startOfNode(Block.java:144)
14-Apr-2021 18:23:43         at org.apache.fop.fo.FOTreeBuilder$MainFOHandler.startElement(FOTreeBuilder.java:325)
14-Apr-2021 18:23:43         at org.apache.fop.fo.FOTreeBuilder.startElement(FOTreeBuilder.java:175)
14-Apr-2021 18:23:43         at org.apache.xml.serializer.ToXMLSAXHandler.closeStartTag(ToXMLSAXHandler.java:204)
14-Apr-2021 18:23:43         at org.apache.xml.serializer.ToSAXHandler.flushPending(ToSAXHandler.java:277)
14-Apr-2021 18:23:43         at org.apache.xml.serializer.ToXMLSAXHandler.startPrefixMapping(ToXMLSAXHandler.java:348)
14-Apr-2021 18:23:43         at org.apache.xml.serializer.ToXMLSAXHandler.startPrefixMapping(ToXMLSAXHandler.java:318)
14-Apr-2021 18:23:43         at org.apache.xml.dtm.ref.DTMTreeWalker.startNode(DTMTreeWalker.java:251)
14-Apr-2021 18:23:43         at org.apache.xml.dtm.ref.DTMTreeWalker.traverse(DTMTreeWalker.java:112)
14-Apr-2021 18:23:43         at org.apache.xml.dtm.ref.sax2dtm.SAX2DTM.dispatchToEvents(SAX2DTM.java:748)
14-Apr-2021 18:23:43         at org.apache.xalan.serialize.SerializerUtils.outputResultTreeFragment(SerializerUtils.java:139)
14-Apr-2021 18:23:43         at org.apache.xalan.templates.ElemCopyOf.execute(ElemCopyOf.java:190)
14-Apr-2021 18:23:43         ... 38 more
14-Apr-2021 18:23:43 ---------
14-Apr-2021 18:23:43 org.apache.fop.fo.ValidationException: Property ID "toc.N10001.minor" (found on "fo:block") previously used; ID values must be unique within a document! (See fo:block, id=toc.N10001.minor)
14-Apr-2021 18:23:43         at org.apache.fop.events.ValidationExceptionFactory.createException(ValidationExceptionFactory.java:38)
14-Apr-2021 18:23:43         at org.apache.fop.events.EventExceptionManager.throwException(EventExceptionManager.java:58)
14-Apr-2021 18:23:43         at org.apache.fop.events.DefaultEventBroadcaster$1.invoke(DefaultEventBroadcaster.java:175)
14-Apr-2021 18:23:43         at com.sun.proxy.$Proxy4.idNotUnique(Unknown Source)
14-Apr-2021 18:23:43         at org.apache.fop.fo.FObj.checkId(FObj.java:173)
14-Apr-2021 18:23:43         at org.apache.fop.fo.FObj.startOfNode(FObj.java:154)
14-Apr-2021 18:23:43         at org.apache.fop.fo.flow.Block.startOfNode(Block.java:144)
14-Apr-2021 18:23:43         at org.apache.fop.fo.FOTreeBuilder$MainFOHandler.startElement(FOTreeBuilder.java:325)
14-Apr-2021 18:23:43         at org.apache.fop.fo.FOTreeBuilder.startElement(FOTreeBuilder.java:175)
14-Apr-2021 18:23:43         at org.apache.xml.serializer.ToXMLSAXHandler.closeStartTag(ToXMLSAXHandler.java:204)
14-Apr-2021 18:23:43         at org.apache.xml.serializer.ToSAXHandler.flushPending(ToSAXHandler.java:277)
14-Apr-2021 18:23:43         at org.apache.xml.serializer.ToXMLSAXHandler.startPrefixMapping(ToXMLSAXHandler.java:348)
14-Apr-2021 18:23:43         at org.apache.xml.serializer.ToXMLSAXHandler.startPrefixMapping(ToXMLSAXHandler.java:318)
14-Apr-2021 18:23:43         at org.apache.xml.dtm.ref.DTMTreeWalker.startNode(DTMTreeWalker.java:251)
14-Apr-2021 18:23:43         at org.apache.xml.dtm.ref.DTMTreeWalker.traverse(DTMTreeWalker.java:112)
14-Apr-2021 18:23:43         at org.apache.xml.dtm.ref.sax2dtm.SAX2DTM.dispatchToEvents(SAX2DTM.java:748)
14-Apr-2021 18:23:43         at org.apache.xalan.serialize.SerializerUtils.outputResultTreeFragment(SerializerUtils.java:139)
14-Apr-2021 18:23:43         at org.apache.xalan.templates.ElemCopyOf.execute(ElemCopyOf.java:190)
14-Apr-2021 18:23:43         at org.apache.xalan.transformer.TransformerImpl.executeChildTemplates(TransformerImpl.java:2411)
14-Apr-2021 18:23:43         at org.apache.xalan.templates.ElemLiteralResult.execute(ElemLiteralResult.java:1374)
14-Apr-2021 18:23:43         at org.apache.xalan.transformer.TransformerImpl.executeChildTemplates(TransformerImpl.java:2411)
14-Apr-2021 18:23:43         at org.apache.xalan.templates.ElemLiteralResult.execute(ElemLiteralResult.java:1374)
14-Apr-2021 18:23:43         at org.apache.xalan.transformer.TransformerImpl.executeChildTemplates(TransformerImpl.java:2411)
14-Apr-2021 18:23:43         at org.apache.xalan.templates.ElemTemplate.execute(ElemTemplate.java:392)
14-Apr-2021 18:23:43         at org.apache.xalan.templates.ElemCallTemplate.execute(ElemCallTemplate.java:246)
14-Apr-2021 18:23:43         at org.apache.xalan.transformer.TransformerImpl.executeChildTemplates(TransformerImpl.java:2411)
14-Apr-2021 18:23:43         at org.apache.xalan.templates.ElemIf.execute(ElemIf.java:160)
14-Apr-2021 18:23:43         at org.apache.xalan.transformer.TransformerImpl.executeChildTemplates(TransformerImpl.java:2411)
14-Apr-2021 18:23:43         at org.apache.xalan.templates.ElemTemplate.execute(ElemTemplate.java:392)
14-Apr-2021 18:23:43         at org.apache.xalan.templates.ElemCallTemplate.execute(ElemCallTemplate.java:246)
14-Apr-2021 18:23:43         at org.apache.xalan.templates.ElemApplyTemplates.transformSelectedNodes(ElemApplyTemplates.java:393)
14-Apr-2021 18:23:43         at org.apache.xalan.templates.ElemApplyTemplates.execute(ElemApplyTemplates.java:176)
14-Apr-2021 18:23:43         at org.apache.xalan.transformer.TransformerImpl.executeChildTemplates(TransformerImpl.java:2411)
14-Apr-2021 18:23:43         at org.apache.xalan.templates.ElemLiteralResult.execute(ElemLiteralResult.java:1374)
14-Apr-2021 18:23:43         at org.apache.xalan.templates.ElemApplyTemplates.transformSelectedNodes(ElemApplyTemplates.java:393)
14-Apr-2021 18:23:43         at org.apache.xalan.templates.ElemApplyTemplates.execute(ElemApplyTemplates.java:176)
14-Apr-2021 18:23:43         at org.apache.xalan.templates.ElemApplyTemplates.transformSelectedNodes(ElemApplyTemplates.java:393)
14-Apr-2021 18:23:43         at org.apache.xalan.templates.ElemApplyTemplates.execute(ElemApplyTemplates.java:176)
14-Apr-2021 18:23:43         at org.apache.xalan.transformer.TransformerImpl.executeChildTemplates(TransformerImpl.java:2411)
14-Apr-2021 18:23:43         at org.apache.xalan.templates.ElemIf.execute(ElemIf.java:160)
14-Apr-2021 18:23:43         at org.apache.xalan.transformer.TransformerImpl.executeChildTemplates(TransformerImpl.java:2411)
14-Apr-2021 18:23:43         at org.apache.xalan.templates.ElemChoose.execute(ElemChoose.java:139)
14-Apr-2021 18:23:43         at org.apache.xalan.transformer.TransformerImpl.executeChildTemplates(TransformerImpl.java:2411)
14-Apr-2021 18:23:43         at org.apache.xalan.templates.ElemChoose.execute(ElemChoose.java:139)
14-Apr-2021 18:23:43         at org.apache.xalan.transformer.TransformerImpl.executeChildTemplates(TransformerImpl.java:2411)
14-Apr-2021 18:23:43         at org.apache.xalan.templates.ElemChoose.execute(ElemChoose.java:139)
14-Apr-2021 18:23:43         at org.apache.xalan.transformer.TransformerImpl.executeChildTemplates(TransformerImpl.java:2411)
14-Apr-2021 18:23:43         at org.apache.xalan.transformer.TransformerImpl.applyTemplateToNode(TransformerImpl.java:2281)
14-Apr-2021 18:23:43         at org.apache.xalan.transformer.TransformerImpl.transformNode(TransformerImpl.java:1367)
14-Apr-2021 18:23:43         at org.apache.xalan.transformer.TransformerImpl.transform(TransformerImpl.java:709)
14-Apr-2021 18:23:43         at org.apache.xalan.transformer.TransformerImpl.transform(TransformerImpl.java:1284)
14-Apr-2021 18:23:43         at org.apache.xalan.transformer.TransformerImpl.transform(TransformerImpl.java:1262)
14-Apr-2021 18:23:43         at org.apache.fop.cli.InputHandler.transformTo(InputHandler.java:300)
14-Apr-2021 18:23:43         at org.apache.fop.cli.InputHandler.renderTo(InputHandler.java:130)
14-Apr-2021 18:23:43         at org.apache.fop.cli.Main.startFOP(Main.java:177)
14-Apr-2021 18:23:43         at org.apache.fop.cli.Main.main(Main.java:208)
14-Apr-2021 18:23:43
14-Apr-2021 18:23:44 Failing task since return code of [/bin/sh /home/bamboo/temp/DOC-PHPBB7-JOB1-19-ScriptBuildTask-6177852419008939010.sh] was 1 while expected 0
14-Apr-2021 18:23:44 Finished task 'Generate PDF' with result: Failed
14-Apr-2021 18:23:44 Running post build plugin 'NCover Results Collector'
14-Apr-2021 18:23:44 Running post build plugin 'Artifact Copier'
14-Apr-2021 18:23:44 Publishing an artifact: Documentation
14-Apr-2021 18:23:44 Unable to publish artifact [Documentation]:
14-Apr-2021 18:23:44 The artifact hasn't been successfully published after 333.2 ms
14-Apr-2021 18:23:44 Running post build plugin 'npm Cache Cleanup'
14-Apr-2021 18:23:44 Running post build plugin 'Clover Results Collector'
14-Apr-2021 18:23:44 Running post build plugin 'Docker Container Cleanup'
14-Apr-2021 18:23:44 Successfully removed working directory at '/home/bamboo/xml-data/build-dir/DOC-PHPBB7-JOB1'
14-Apr-2021 18:23:44 Finalising the build...
14-Apr-2021 18:23:44 Stopping timer.
14-Apr-2021 18:23:44 Build DOC-PHPBB7-JOB1-19 completed.
14-Apr-2021 18:23:44 Running on server: post build plugin 'NCover Results Collector'
14-Apr-2021 18:23:44 Running on server: post build plugin 'Build Hanging Detection Configuration'
14-Apr-2021 18:23:44 Running on server: post build plugin 'Clover Delta Calculator'
14-Apr-2021 18:23:44 Running on server: post build plugin 'Maven Dependencies Postprocessor'
14-Apr-2021 18:23:44 All post build plugins have finished
14-Apr-2021 18:23:44 Generating build results summary...
14-Apr-2021 18:23:44 Saving build results to disk...
14-Apr-2021 18:23:44 Store variable context...
14-Apr-2021 18:23:44 Indexing build results...
14-Apr-2021 18:23:44 Finished building DOC-PHPBB7-JOB1-19.