Build: #37 failed

Job: Create PDF failed

Stages & jobs

  1. Default Stage

Build log

The build generated 255 lines of output. Download or view full build log

30-Sep-2022 20:34:50 Build Documentation - phpBB Documentation - 3.3.x - Create PDF #37 (DOC-PHPBB7-JOB1-37) started building on agent Agent 2
30-Sep-2022 20:34:50
30-Sep-2022 20:34:50 Build working directory is /home/bamboo/xml-data/build-dir/DOC-PHPBB7-JOB1
30-Sep-2022 20:34:50 Executing build Documentation - phpBB Documentation - 3.3.x - Create PDF #37 (DOC-PHPBB7-JOB1-37)
30-Sep-2022 20:34:50 Starting task 'Checkout Default Repository' of type 'com.atlassian.bamboo.plugins.vcs:task.vcs.checkout'
30-Sep-2022 20:34:50 Checking out into /home/bamboo/xml-data/build-dir/DOC-PHPBB7-JOB1
30-Sep-2022 20:34:50 Updating source code to revision: b30b850edcc4e70340ce695b84c301edac51db37
30-Sep-2022 20:34:51 Fetching 'refs/heads/3.3.x' from 'https://github.com/phpbb/documentation.git'.
30-Sep-2022 20:34:52 From https://github.com/phpbb/documentation
30-Sep-2022 20:34:52    74ed324..b30b850  3.3.x      -> 3.3.x
30-Sep-2022 20:34:52 Checking out revision b30b850edcc4e70340ce695b84c301edac51db37.
30-Sep-2022 20:34:52 Creating local git repository in '/home/bamboo/xml-data/build-dir/DOC-PHPBB7-JOB1/.git'.
30-Sep-2022 20:34:52 Cloning into '/home/bamboo/xml-data/build-dir/DOC-PHPBB7-JOB1'...
30-Sep-2022 20:34:52 done.
30-Sep-2022 20:34:52 Switched to a new branch '3.3.x'
30-Sep-2022 20:34:52 Branch 3.3.x set up to track remote branch 3.3.x from origin.
30-Sep-2022 20:34:52 Updated source code to revision: b30b850edcc4e70340ce695b84c301edac51db37
30-Sep-2022 20:34:52 Finished task 'Checkout Default Repository' with result: Success
30-Sep-2022 20:34:52 Running pre-build action: VCS Version Collector
30-Sep-2022 20:34:52 Skipping execution of task 'Generate PDF' as it is disabled
30-Sep-2022 20:34:52
Substituting variable: ${bamboo.planRepository.branchName} with 3.3.x
30-Sep-2022 20:34:52
Substituting variable: ${bamboo.planRepository.branchName} with 3.3.x
30-Sep-2022 20:34:52
Substituting variable: ${bamboo.planRepository.branchName} with 3.3.x
30-Sep-2022 20:34:52
Substituting variable: ${bamboo.planRepository.branchName} with 3.3.x
30-Sep-2022 20:34:52 Starting task 'Generate PDF' of type 'com.atlassian.bamboo.plugins.scripttask:task.builder.script'
30-Sep-2022 20:34:52
Beginning to execute external process for build 'Documentation - phpBB Documentation - 3.3.x - Create PDF #37 (DOC-PHPBB7-JOB1-37)'
... running command line:
/bin/sh /home/bamboo/temp/DOC-PHPBB7-JOB1-37-ScriptBuildTask-2473021772060610137.sh
... in: /home/bamboo/xml-data/build-dir/DOC-PHPBB7-JOB1/documentation
... using extra environment variables:
bamboo_planRepository_1_branch=3.3.x
bamboo_planRepository_1_branchDisplayName=3.3.x
bamboo_repository_revision_number=b30b850edcc4e70340ce695b84c301edac51db37
bamboo_resultsUrl=https://bamboo.phpbb.com/browse/DOC-PHPBB7-JOB1-37
bamboo_capability_system_builder_command_Git=/usr/bin/git
bamboo_build_working_directory=/home/bamboo/xml-data/build-dir/DOC-PHPBB7-JOB1
bamboo_planRepository_1_name=Documentation
bamboo_buildKey=DOC-PHPBB7-JOB1
bamboo_repository_113803265_git_branch=3.3.x
bamboo_shortPlanName=phpBB Documentation
bamboo_capability_system_builder_command_fop=/usr/bin/fop
bamboo_capability_dbms_sqlite_2=true
bamboo_planRepository_name=Documentation
bamboo_buildNumber=37
bamboo_capability_system_builder_phpunit_PHPUnit=/usr/bin/phpunit
bamboo_shortJobName=Create PDF
bamboo_buildResultsUrl=https://bamboo.phpbb.com/browse/DOC-PHPBB7-JOB1-37
bamboo_planRepository_repositoryUrl=https://github.com/phpbb/documentation.git
bamboo_agentId=41779201
bamboo_repository_113803265_branch_name=3.3.x
bamboo_planName=Documentation - phpBB Documentation - 3.3.x
bamboo_shortPlanKey=PHPBB7
bamboo_shortJobKey=JOB1
bamboo_capability_dbms_mysql_55=true
bamboo_capability_system_jdk_JDK_1_7_0_65=/usr/lib/jvm/java-7-openjdk-amd64
bamboo_planRepository_revision=b30b850edcc4e70340ce695b84c301edac51db37
bamboo_buildTimeStamp=2022-09-30T20:34:15.160Z
bamboo_repository_previous_revision_number=74ed324d65c59503c62b5b9b7ef713c219944d96
bamboo_repository_113803265_name=Documentation
bamboo_capability_system_jdk_JDK_1_6_0_16=/usr/lib/jvm/java-6-sun-1.6.0.16
bamboo_capability_system_builder_mvn2_Maven_2=/usr/share/maven2
bamboo_planRepository_previousRevision=74ed324d65c59503c62b5b9b7ef713c219944d96
bamboo_repository_git_branch=3.3.x
bamboo_buildResultKey=DOC-PHPBB7-JOB1-37
bamboo_repository_branch_name=3.3.x
bamboo_buildPlanName=Documentation - phpBB Documentation - 3.3.x - Create PDF
bamboo_planRepository_1_revision=b30b850edcc4e70340ce695b84c301edac51db37
bamboo_repository_name=Documentation
bamboo_buildFailed=false
bamboo_capability_system_docker_executable=/usr/bin/docker
bamboo_planRepository_branch=3.3.x
bamboo_repository_113803265_git_repositoryUrl=https://github.com/phpbb/documentation.git
bamboo_agentWorkingDirectory=/home/bamboo/xml-data/build-dir
bamboo_capability_system_git_executable=/usr/bin/git
bamboo_repository_113803265_previous_revision_number=74ed324d65c59503c62b5b9b7ef713c219944d96
bamboo_capability_system_builder_phpunit_PHPUnit_3_4=/usr/bin/phpunit
bamboo_repository_git_username=phpbb
bamboo_planRepository_1_previousRevision=74ed324d65c59503c62b5b9b7ef713c219944d96
bamboo_planRepository_branchDisplayName=3.3.x
bamboo_planRepository_1_type=gh2
bamboo_planRepository_branchName=3.3.x
bamboo_capability_system_jdk_JDK=/usr/lib/jvm/java-6-sun
bamboo_plan_storageTag=plan-113606657
bamboo_hg_cache_directory=/home/bamboo/xml-data/build-dir/_hg-repositories-cache
bamboo_planRepository_1_username=phpbb
bamboo_planRepository_type=gh2
bamboo_git_cache_directory=/home/bamboo/xml-data/build-dir/_git-repositories-cache
bamboo_repository_git_repositoryUrl=https://github.com/phpbb/documentation.git
bamboo_capability_system_builder_ant_Ant=/usr/share/ant
bamboo_tmp_directory=/home/bamboo/temp
bamboo_repository_113803265_revision_number=b30b850edcc4e70340ce695b84c301edac51db37
bamboo_working_directory=/home/bamboo/xml-data/build-dir/DOC-PHPBB7-JOB1
bamboo_planKey=DOC-PHPBB7
bamboo_capability_local=true
bamboo_planRepository_1_repositoryUrl=https://github.com/phpbb/documentation.git
bamboo_planRepository_username=phpbb
bamboo_capability_system_jdk_JDK_1_6=/usr/lib/jvm/java-6-sun
bamboo_capability_system_jdk_JDK_1_7=/usr/lib/jvm/java-7-openjdk-amd64
bamboo_repository_113803265_git_username=phpbb
bamboo_planRepository_1_branchName=3.3.x
30-Sep-2022 20:35:16 Sep 30, 2022 8:35:16 PM org.apache.fop.cli.InputHandler warning
30-Sep-2022 20:35:16 WARNING: Making portrait pages on USletter paper (8.5inx11in)
30-Sep-2022 20:35:17 Sep 30, 2022 8:35:17 PM org.apache.fop.fo.FOTreeBuilder fatalError
30-Sep-2022 20:35:17 SEVERE: org.xml.sax.SAXParseException; systemId: file:/home/bamboo/xml-data/build-dir/DOC-PHPBB7-JOB1/documentation/xsl/pdf/fo/pagesetup.xsl; lineNumber: 689; columnNumber: 57; java.lang.reflect.UndeclaredThrowableException
30-Sep-2022 20:35:17 Sep 30, 2022 8:35:17 PM org.apache.fop.cli.Main startFOP
30-Sep-2022 20:35:17 SEVERE: Exception
30-Sep-2022 20:35:17 org.apache.fop.apps.FOPException: java.lang.reflect.UndeclaredThrowableException
30-Sep-2022 20:35:17 javax.xml.transform.TransformerException: java.lang.reflect.UndeclaredThrowableException
30-Sep-2022 20:35:17         at org.apache.fop.cli.InputHandler.transformTo(InputHandler.java:303)
30-Sep-2022 20:35:17         at org.apache.fop.cli.InputHandler.renderTo(InputHandler.java:130)
30-Sep-2022 20:35:17         at org.apache.fop.cli.Main.startFOP(Main.java:177)
30-Sep-2022 20:35:17         at org.apache.fop.cli.Main.main(Main.java:208)
30-Sep-2022 20:35:17 Caused by: javax.xml.transform.TransformerException: java.lang.reflect.UndeclaredThrowableException
30-Sep-2022 20:35:17         at org.apache.xalan.transformer.TransformerImpl.executeChildTemplates(TransformerImpl.java:2416)
30-Sep-2022 20:35:17         at org.apache.xalan.templates.ElemLiteralResult.execute(ElemLiteralResult.java:1374)
30-Sep-2022 20:35:17         at org.apache.xalan.transformer.TransformerImpl.executeChildTemplates(TransformerImpl.java:2411)
30-Sep-2022 20:35:17         at org.apache.xalan.templates.ElemIf.execute(ElemIf.java:160)
30-Sep-2022 20:35:17         at org.apache.xalan.transformer.TransformerImpl.executeChildTemplates(TransformerImpl.java:2411)
30-Sep-2022 20:35:17         at org.apache.xalan.templates.ElemLiteralResult.execute(ElemLiteralResult.java:1374)
30-Sep-2022 20:35:17         at org.apache.xalan.transformer.TransformerImpl.executeChildTemplates(TransformerImpl.java:2411)
30-Sep-2022 20:35:17         at org.apache.xalan.templates.ElemTemplate.execute(ElemTemplate.java:392)
30-Sep-2022 20:35:17         at org.apache.xalan.templates.ElemCallTemplate.execute(ElemCallTemplate.java:246)
30-Sep-2022 20:35:17         at org.apache.xalan.transformer.TransformerImpl.executeChildTemplates(TransformerImpl.java:2411)
30-Sep-2022 20:35:17         at org.apache.xalan.templates.ElemLiteralResult.execute(ElemLiteralResult.java:1374)
30-Sep-2022 20:35:17         at org.apache.xalan.templates.ElemApplyTemplates.transformSelectedNodes(ElemApplyTemplates.java:393)
30-Sep-2022 20:35:17         at org.apache.xalan.templates.ElemApplyTemplates.execute(ElemApplyTemplates.java:176)
30-Sep-2022 20:35:17         at org.apache.xalan.templates.ElemApplyTemplates.transformSelectedNodes(ElemApplyTemplates.java:393)
30-Sep-2022 20:35:17         at org.apache.xalan.templates.ElemApplyTemplates.execute(ElemApplyTemplates.java:176)
30-Sep-2022 20:35:17         at org.apache.xalan.transformer.TransformerImpl.executeChildTemplates(TransformerImpl.java:2411)
30-Sep-2022 20:35:17         at org.apache.xalan.templates.ElemIf.execute(ElemIf.java:160)
30-Sep-2022 20:35:17         at org.apache.xalan.transformer.TransformerImpl.executeChildTemplates(TransformerImpl.java:2411)
30-Sep-2022 20:35:17         at org.apache.xalan.templates.ElemChoose.execute(ElemChoose.java:139)
30-Sep-2022 20:35:17         at org.apache.xalan.transformer.TransformerImpl.executeChildTemplates(TransformerImpl.java:2411)
30-Sep-2022 20:35:17         at org.apache.xalan.templates.ElemChoose.execute(ElemChoose.java:139)
30-Sep-2022 20:35:17         at org.apache.xalan.transformer.TransformerImpl.executeChildTemplates(TransformerImpl.java:2411)
30-Sep-2022 20:35:17         at org.apache.xalan.templates.ElemChoose.execute(ElemChoose.java:139)
30-Sep-2022 20:35:17         at org.apache.xalan.transformer.TransformerImpl.executeChildTemplates(TransformerImpl.java:2411)
30-Sep-2022 20:35:17         at org.apache.xalan.transformer.TransformerImpl.applyTemplateToNode(TransformerImpl.java:2281)
30-Sep-2022 20:35:17         at org.apache.xalan.transformer.TransformerImpl.transformNode(TransformerImpl.java:1367)
30-Sep-2022 20:35:17         at org.apache.xalan.transformer.TransformerImpl.transform(TransformerImpl.java:709)
30-Sep-2022 20:35:17         at org.apache.xalan.transformer.TransformerImpl.transform(TransformerImpl.java:1284)
30-Sep-2022 20:35:17         at org.apache.xalan.transformer.TransformerImpl.transform(TransformerImpl.java:1262)
30-Sep-2022 20:35:17         at org.apache.fop.cli.InputHandler.transformTo(InputHandler.java:300)
30-Sep-2022 20:35:17         ... 3 more
30-Sep-2022 20:35:17 Caused by: java.lang.reflect.UndeclaredThrowableException
30-Sep-2022 20:35:17         at com.sun.proxy.$Proxy0.readUnsignedInt(Unknown Source)
30-Sep-2022 20:35:17         at org.apache.xmlgraphics.image.loader.impl.PreloaderEPS.preloadImage(PreloaderEPS.java:65)
30-Sep-2022 20:35:17         at org.apache.xmlgraphics.image.loader.ImageManager.preloadImage(ImageManager.java:175)
30-Sep-2022 20:35:17         at org.apache.xmlgraphics.image.loader.cache.ImageCache.needImageInfo(ImageCache.java:128)
30-Sep-2022 20:35:17         at org.apache.xmlgraphics.image.loader.ImageManager.getImageInfo(ImageManager.java:122)
30-Sep-2022 20:35:17         at org.apache.fop.fo.properties.CommonBorderPaddingBackground.getInstance(CommonBorderPaddingBackground.java:381)
30-Sep-2022 20:35:17         at org.apache.fop.fo.PropertyList.getBorderPaddingBackgroundProps(PropertyList.java:577)
30-Sep-2022 20:35:17         at org.apache.fop.fo.pagination.Region.bind(Region.java:66)
30-Sep-2022 20:35:17         at org.apache.fop.fo.pagination.RegionBody.bind(RegionBody.java:58)
30-Sep-2022 20:35:17         at org.apache.fop.fo.FObj.processNode(FObj.java:124)
30-Sep-2022 20:35:17         at org.apache.fop.fo.FOTreeBuilder$MainFOHandler.startElement(FOTreeBuilder.java:280)
30-Sep-2022 20:35:17         at org.apache.fop.fo.FOTreeBuilder.startElement(FOTreeBuilder.java:175)
30-Sep-2022 20:35:17         at org.apache.xml.serializer.ToXMLSAXHandler.closeStartTag(ToXMLSAXHandler.java:204)
30-Sep-2022 20:35:17         at org.apache.xml.serializer.ToSAXHandler.flushPending(ToSAXHandler.java:277)
30-Sep-2022 20:35:17         at org.apache.xml.serializer.ToXMLSAXHandler.endElement(ToXMLSAXHandler.java:243)
30-Sep-2022 20:35:17         at org.apache.xalan.templates.ElemLiteralResult.execute(ElemLiteralResult.java:1399)
30-Sep-2022 20:35:17         at org.apache.xalan.transformer.TransformerImpl.executeChildTemplates(TransformerImpl.java:2411)
30-Sep-2022 20:35:17         ... 32 more
30-Sep-2022 20:35:17 Caused by: java.lang.reflect.InvocationTargetException
30-Sep-2022 20:35:17         at sun.reflect.NativeMethodAccessorImpl.invoke0(Native Method)
30-Sep-2022 20:35:17         at sun.reflect.NativeMethodAccessorImpl.invoke(NativeMethodAccessorImpl.java:62)
30-Sep-2022 20:35:17         at sun.reflect.DelegatingMethodAccessorImpl.invoke(DelegatingMethodAccessorImpl.java:43)
30-Sep-2022 20:35:17         at java.lang.reflect.Method.invoke(Method.java:498)
30-Sep-2022 20:35:17         at org.apache.xmlgraphics.image.loader.impl.AbstractImageSessionContext$ObservingImageInputStreamInvocationHandler.invoke(AbstractImageSessionContext.java:219)
30-Sep-2022 20:35:17         ... 49 more
30-Sep-2022 20:35:17 Caused by: java.io.EOFException
30-Sep-2022 20:35:17         at javax.imageio.stream.ImageInputStreamImpl.readInt(ImageInputStreamImpl.java:251)
30-Sep-2022 20:35:17         at javax.imageio.stream.ImageInputStreamImpl.readUnsignedInt(ImageInputStreamImpl.java:266)
30-Sep-2022 20:35:17         ... 54 more
30-Sep-2022 20:35:17
30-Sep-2022 20:35:17 ---------
30-Sep-2022 20:35:17
30-Sep-2022 20:35:17 ; SystemID: file:/home/bamboo/xml-data/build-dir/DOC-PHPBB7-JOB1/documentation/xsl/pdf/fo/pagesetup.xsl; Line#: 689; Column#: 57
30-Sep-2022 20:35:17 javax.xml.transform.TransformerException: java.lang.reflect.UndeclaredThrowableException
30-Sep-2022 20:35:17         at org.apache.xalan.transformer.TransformerImpl.executeChildTemplates(TransformerImpl.java:2416)
30-Sep-2022 20:35:17         at org.apache.xalan.templates.ElemLiteralResult.execute(ElemLiteralResult.java:1374)
30-Sep-2022 20:35:17         at org.apache.xalan.transformer.TransformerImpl.executeChildTemplates(TransformerImpl.java:2411)
30-Sep-2022 20:35:17         at org.apache.xalan.templates.ElemIf.execute(ElemIf.java:160)
30-Sep-2022 20:35:17         at org.apache.xalan.transformer.TransformerImpl.executeChildTemplates(TransformerImpl.java:2411)
30-Sep-2022 20:35:17         at org.apache.xalan.templates.ElemLiteralResult.execute(ElemLiteralResult.java:1374)
30-Sep-2022 20:35:17         at org.apache.xalan.transformer.TransformerImpl.executeChildTemplates(TransformerImpl.java:2411)
30-Sep-2022 20:35:17         at org.apache.xalan.templates.ElemTemplate.execute(ElemTemplate.java:392)
30-Sep-2022 20:35:17         at org.apache.xalan.templates.ElemCallTemplate.execute(ElemCallTemplate.java:246)
30-Sep-2022 20:35:17         at org.apache.xalan.transformer.TransformerImpl.executeChildTemplates(TransformerImpl.java:2411)
30-Sep-2022 20:35:17         at org.apache.xalan.templates.ElemLiteralResult.execute(ElemLiteralResult.java:1374)
30-Sep-2022 20:35:17         at org.apache.xalan.templates.ElemApplyTemplates.transformSelectedNodes(ElemApplyTemplates.java:393)
30-Sep-2022 20:35:17         at org.apache.xalan.templates.ElemApplyTemplates.execute(ElemApplyTemplates.java:176)
30-Sep-2022 20:35:17         at org.apache.xalan.templates.ElemApplyTemplates.transformSelectedNodes(ElemApplyTemplates.java:393)
30-Sep-2022 20:35:17         at org.apache.xalan.templates.ElemApplyTemplates.execute(ElemApplyTemplates.java:176)
30-Sep-2022 20:35:17         at org.apache.xalan.transformer.TransformerImpl.executeChildTemplates(TransformerImpl.java:2411)
30-Sep-2022 20:35:17         at org.apache.xalan.templates.ElemIf.execute(ElemIf.java:160)
30-Sep-2022 20:35:17         at org.apache.xalan.transformer.TransformerImpl.executeChildTemplates(TransformerImpl.java:2411)
30-Sep-2022 20:35:17         at org.apache.xalan.templates.ElemChoose.execute(ElemChoose.java:139)
30-Sep-2022 20:35:17         at org.apache.xalan.transformer.TransformerImpl.executeChildTemplates(TransformerImpl.java:2411)
30-Sep-2022 20:35:17         at org.apache.xalan.templates.ElemChoose.execute(ElemChoose.java:139)
30-Sep-2022 20:35:17         at org.apache.xalan.transformer.TransformerImpl.executeChildTemplates(TransformerImpl.java:2411)
30-Sep-2022 20:35:17         at org.apache.xalan.templates.ElemChoose.execute(ElemChoose.java:139)
30-Sep-2022 20:35:17         at org.apache.xalan.transformer.TransformerImpl.executeChildTemplates(TransformerImpl.java:2411)
30-Sep-2022 20:35:17         at org.apache.xalan.transformer.TransformerImpl.applyTemplateToNode(TransformerImpl.java:2281)
30-Sep-2022 20:35:17         at org.apache.xalan.transformer.TransformerImpl.transformNode(TransformerImpl.java:1367)
30-Sep-2022 20:35:17         at org.apache.xalan.transformer.TransformerImpl.transform(TransformerImpl.java:709)
30-Sep-2022 20:35:17         at org.apache.xalan.transformer.TransformerImpl.transform(TransformerImpl.java:1284)
30-Sep-2022 20:35:17         at org.apache.xalan.transformer.TransformerImpl.transform(TransformerImpl.java:1262)
30-Sep-2022 20:35:17         at org.apache.fop.cli.InputHandler.transformTo(InputHandler.java:300)
30-Sep-2022 20:35:17         at org.apache.fop.cli.InputHandler.renderTo(InputHandler.java:130)
30-Sep-2022 20:35:17         at org.apache.fop.cli.Main.startFOP(Main.java:177)
30-Sep-2022 20:35:17         at org.apache.fop.cli.Main.main(Main.java:208)
30-Sep-2022 20:35:17 Caused by: java.lang.reflect.UndeclaredThrowableException
30-Sep-2022 20:35:17         at com.sun.proxy.$Proxy0.readUnsignedInt(Unknown Source)
30-Sep-2022 20:35:17         at org.apache.xmlgraphics.image.loader.impl.PreloaderEPS.preloadImage(PreloaderEPS.java:65)
30-Sep-2022 20:35:17         at org.apache.xmlgraphics.image.loader.ImageManager.preloadImage(ImageManager.java:175)
30-Sep-2022 20:35:17         at org.apache.xmlgraphics.image.loader.cache.ImageCache.needImageInfo(ImageCache.java:128)
30-Sep-2022 20:35:17         at org.apache.xmlgraphics.image.loader.ImageManager.getImageInfo(ImageManager.java:122)
30-Sep-2022 20:35:17         at org.apache.fop.fo.properties.CommonBorderPaddingBackground.getInstance(CommonBorderPaddingBackground.java:381)
30-Sep-2022 20:35:17         at org.apache.fop.fo.PropertyList.getBorderPaddingBackgroundProps(PropertyList.java:577)
30-Sep-2022 20:35:17         at org.apache.fop.fo.pagination.Region.bind(Region.java:66)
30-Sep-2022 20:35:17         at org.apache.fop.fo.pagination.RegionBody.bind(RegionBody.java:58)
30-Sep-2022 20:35:17         at org.apache.fop.fo.FObj.processNode(FObj.java:124)
30-Sep-2022 20:35:17         at org.apache.fop.fo.FOTreeBuilder$MainFOHandler.startElement(FOTreeBuilder.java:280)
30-Sep-2022 20:35:17         at org.apache.fop.fo.FOTreeBuilder.startElement(FOTreeBuilder.java:175)
30-Sep-2022 20:35:17         at org.apache.xml.serializer.ToXMLSAXHandler.closeStartTag(ToXMLSAXHandler.java:204)
30-Sep-2022 20:35:17         at org.apache.xml.serializer.ToSAXHandler.flushPending(ToSAXHandler.java:277)
30-Sep-2022 20:35:17         at org.apache.xml.serializer.ToXMLSAXHandler.endElement(ToXMLSAXHandler.java:243)
30-Sep-2022 20:35:17         at org.apache.xalan.templates.ElemLiteralResult.execute(ElemLiteralResult.java:1399)
30-Sep-2022 20:35:17         at org.apache.xalan.transformer.TransformerImpl.executeChildTemplates(TransformerImpl.java:2411)
30-Sep-2022 20:35:17         ... 32 more
30-Sep-2022 20:35:17 Caused by: java.lang.reflect.InvocationTargetException
30-Sep-2022 20:35:17         at sun.reflect.NativeMethodAccessorImpl.invoke0(Native Method)
30-Sep-2022 20:35:17         at sun.reflect.NativeMethodAccessorImpl.invoke(NativeMethodAccessorImpl.java:62)
30-Sep-2022 20:35:17         at sun.reflect.DelegatingMethodAccessorImpl.invoke(DelegatingMethodAccessorImpl.java:43)
30-Sep-2022 20:35:17         at java.lang.reflect.Method.invoke(Method.java:498)
30-Sep-2022 20:35:17         at org.apache.xmlgraphics.image.loader.impl.AbstractImageSessionContext$ObservingImageInputStreamInvocationHandler.invoke(AbstractImageSessionContext.java:219)
30-Sep-2022 20:35:17         ... 49 more
30-Sep-2022 20:35:17 Caused by: java.io.EOFException
30-Sep-2022 20:35:17         at javax.imageio.stream.ImageInputStreamImpl.readInt(ImageInputStreamImpl.java:251)
30-Sep-2022 20:35:17         at javax.imageio.stream.ImageInputStreamImpl.readUnsignedInt(ImageInputStreamImpl.java:266)
30-Sep-2022 20:35:17         ... 54 more
30-Sep-2022 20:35:17 ---------
30-Sep-2022 20:35:17 java.lang.reflect.UndeclaredThrowableException
30-Sep-2022 20:35:17         at com.sun.proxy.$Proxy0.readUnsignedInt(Unknown Source)
30-Sep-2022 20:35:17         at org.apache.xmlgraphics.image.loader.impl.PreloaderEPS.preloadImage(PreloaderEPS.java:65)
30-Sep-2022 20:35:17         at org.apache.xmlgraphics.image.loader.ImageManager.preloadImage(ImageManager.java:175)
30-Sep-2022 20:35:17         at org.apache.xmlgraphics.image.loader.cache.ImageCache.needImageInfo(ImageCache.java:128)
30-Sep-2022 20:35:17         at org.apache.xmlgraphics.image.loader.ImageManager.getImageInfo(ImageManager.java:122)
30-Sep-2022 20:35:17         at org.apache.fop.fo.properties.CommonBorderPaddingBackground.getInstance(CommonBorderPaddingBackground.java:381)
30-Sep-2022 20:35:17         at org.apache.fop.fo.PropertyList.getBorderPaddingBackgroundProps(PropertyList.java:577)
30-Sep-2022 20:35:17         at org.apache.fop.fo.pagination.Region.bind(Region.java:66)
30-Sep-2022 20:35:17         at org.apache.fop.fo.pagination.RegionBody.bind(RegionBody.java:58)
30-Sep-2022 20:35:17         at org.apache.fop.fo.FObj.processNode(FObj.java:124)
30-Sep-2022 20:35:17         at org.apache.fop.fo.FOTreeBuilder$MainFOHandler.startElement(FOTreeBuilder.java:280)
30-Sep-2022 20:35:17         at org.apache.fop.fo.FOTreeBuilder.startElement(FOTreeBuilder.java:175)
30-Sep-2022 20:35:17         at org.apache.xml.serializer.ToXMLSAXHandler.closeStartTag(ToXMLSAXHandler.java:204)
30-Sep-2022 20:35:17         at org.apache.xml.serializer.ToSAXHandler.flushPending(ToSAXHandler.java:277)
30-Sep-2022 20:35:17         at org.apache.xml.serializer.ToXMLSAXHandler.endElement(ToXMLSAXHandler.java:243)
30-Sep-2022 20:35:17         at org.apache.xalan.templates.ElemLiteralResult.execute(ElemLiteralResult.java:1399)
30-Sep-2022 20:35:17         at org.apache.xalan.transformer.TransformerImpl.executeChildTemplates(TransformerImpl.java:2411)
30-Sep-2022 20:35:17         at org.apache.xalan.templates.ElemLiteralResult.execute(ElemLiteralResult.java:1374)
30-Sep-2022 20:35:17         at org.apache.xalan.transformer.TransformerImpl.executeChildTemplates(TransformerImpl.java:2411)
30-Sep-2022 20:35:17         at org.apache.xalan.templates.ElemIf.execute(ElemIf.java:160)
30-Sep-2022 20:35:17         at org.apache.xalan.transformer.TransformerImpl.executeChildTemplates(TransformerImpl.java:2411)
30-Sep-2022 20:35:17         at org.apache.xalan.templates.ElemLiteralResult.execute(ElemLiteralResult.java:1374)
30-Sep-2022 20:35:17         at org.apache.xalan.transformer.TransformerImpl.executeChildTemplates(TransformerImpl.java:2411)
30-Sep-2022 20:35:17         at org.apache.xalan.templates.ElemTemplate.execute(ElemTemplate.java:392)
30-Sep-2022 20:35:17         at org.apache.xalan.templates.ElemCallTemplate.execute(ElemCallTemplate.java:246)
30-Sep-2022 20:35:17         at org.apache.xalan.transformer.TransformerImpl.executeChildTemplates(TransformerImpl.java:2411)
30-Sep-2022 20:35:17         at org.apache.xalan.templates.ElemLiteralResult.execute(ElemLiteralResult.java:1374)
30-Sep-2022 20:35:17         at org.apache.xalan.templates.ElemApplyTemplates.transformSelectedNodes(ElemApplyTemplates.java:393)
30-Sep-2022 20:35:17         at org.apache.xalan.templates.ElemApplyTemplates.execute(ElemApplyTemplates.java:176)
30-Sep-2022 20:35:17         at org.apache.xalan.templates.ElemApplyTemplates.transformSelectedNodes(ElemApplyTemplates.java:393)
30-Sep-2022 20:35:17         at org.apache.xalan.templates.ElemApplyTemplates.execute(ElemApplyTemplates.java:176)
30-Sep-2022 20:35:17         at org.apache.xalan.transformer.TransformerImpl.executeChildTemplates(TransformerImpl.java:2411)
30-Sep-2022 20:35:17         at org.apache.xalan.templates.ElemIf.execute(ElemIf.java:160)
30-Sep-2022 20:35:17         at org.apache.xalan.transformer.TransformerImpl.executeChildTemplates(TransformerImpl.java:2411)
30-Sep-2022 20:35:17         at org.apache.xalan.templates.ElemChoose.execute(ElemChoose.java:139)
30-Sep-2022 20:35:17         at org.apache.xalan.transformer.TransformerImpl.executeChildTemplates(TransformerImpl.java:2411)
30-Sep-2022 20:35:17         at org.apache.xalan.templates.ElemChoose.execute(ElemChoose.java:139)
30-Sep-2022 20:35:17         at org.apache.xalan.transformer.TransformerImpl.executeChildTemplates(TransformerImpl.java:2411)
30-Sep-2022 20:35:17         at org.apache.xalan.templates.ElemChoose.execute(ElemChoose.java:139)
30-Sep-2022 20:35:17         at org.apache.xalan.transformer.TransformerImpl.executeChildTemplates(TransformerImpl.java:2411)
30-Sep-2022 20:35:17         at org.apache.xalan.transformer.TransformerImpl.applyTemplateToNode(TransformerImpl.java:2281)
30-Sep-2022 20:35:17         at org.apache.xalan.transformer.TransformerImpl.transformNode(TransformerImpl.java:1367)
30-Sep-2022 20:35:17         at org.apache.xalan.transformer.TransformerImpl.transform(TransformerImpl.java:709)
30-Sep-2022 20:35:17         at org.apache.xalan.transformer.TransformerImpl.transform(TransformerImpl.java:1284)
30-Sep-2022 20:35:17         at org.apache.xalan.transformer.TransformerImpl.transform(TransformerImpl.java:1262)
30-Sep-2022 20:35:17         at org.apache.fop.cli.InputHandler.transformTo(InputHandler.java:300)
30-Sep-2022 20:35:17         at org.apache.fop.cli.InputHandler.renderTo(InputHandler.java:130)
30-Sep-2022 20:35:17         at org.apache.fop.cli.Main.startFOP(Main.java:177)
30-Sep-2022 20:35:17         at org.apache.fop.cli.Main.main(Main.java:208)
30-Sep-2022 20:35:17 Caused by: java.lang.reflect.InvocationTargetException
30-Sep-2022 20:35:17         at sun.reflect.NativeMethodAccessorImpl.invoke0(Native Method)
30-Sep-2022 20:35:17         at sun.reflect.NativeMethodAccessorImpl.invoke(NativeMethodAccessorImpl.java:62)
30-Sep-2022 20:35:17         at sun.reflect.DelegatingMethodAccessorImpl.invoke(DelegatingMethodAccessorImpl.java:43)
30-Sep-2022 20:35:17         at java.lang.reflect.Method.invoke(Method.java:498)
30-Sep-2022 20:35:17         at org.apache.xmlgraphics.image.loader.impl.AbstractImageSessionContext$ObservingImageInputStreamInvocationHandler.invoke(AbstractImageSessionContext.java:219)
30-Sep-2022 20:35:17         ... 49 more
30-Sep-2022 20:35:17 Caused by: java.io.EOFException
30-Sep-2022 20:35:17         at javax.imageio.stream.ImageInputStreamImpl.readInt(ImageInputStreamImpl.java:251)
30-Sep-2022 20:35:17         at javax.imageio.stream.ImageInputStreamImpl.readUnsignedInt(ImageInputStreamImpl.java:266)
30-Sep-2022 20:35:17         ... 54 more
30-Sep-2022 20:35:17
30-Sep-2022 20:35:17 Failing task since return code of [/bin/sh /home/bamboo/temp/DOC-PHPBB7-JOB1-37-ScriptBuildTask-2473021772060610137.sh] was 1 while expected 0
30-Sep-2022 20:35:17 Finished task 'Generate PDF' with result: Failed
30-Sep-2022 20:35:17 Running post build plugin 'NCover Results Collector'
30-Sep-2022 20:35:17 Running post build plugin 'Artifact Copier'
30-Sep-2022 20:35:17 Publishing an artifact: Documentation
30-Sep-2022 20:35:17 Unable to publish artifact [Documentation]:
30-Sep-2022 20:35:17 The artifact hasn't been successfully published after 9.975 ms
30-Sep-2022 20:35:17 Running post build plugin 'npm Cache Cleanup'
30-Sep-2022 20:35:17 Running post build plugin 'Clover Results Collector'
30-Sep-2022 20:35:17 Running post build plugin 'Docker Container Cleanup'
30-Sep-2022 20:35:17 Successfully removed working directory at '/home/bamboo/xml-data/build-dir/DOC-PHPBB7-JOB1'
30-Sep-2022 20:35:17 Finalising the build...
30-Sep-2022 20:35:17 Stopping timer.
30-Sep-2022 20:35:17 Build DOC-PHPBB7-JOB1-37 completed.
30-Sep-2022 20:35:17 Running on server: post build plugin 'NCover Results Collector'
30-Sep-2022 20:35:17 Running on server: post build plugin 'Build Hanging Detection Configuration'
30-Sep-2022 20:35:17 Running on server: post build plugin 'Clover Delta Calculator'
30-Sep-2022 20:35:17 Running on server: post build plugin 'Maven Dependencies Postprocessor'
30-Sep-2022 20:35:17 All post build plugins have finished
30-Sep-2022 20:35:17 Generating build results summary...
30-Sep-2022 20:35:17 Saving build results to disk...
30-Sep-2022 20:35:17 Store variable context...
30-Sep-2022 20:35:17 Indexing build results...
30-Sep-2022 20:35:17 Finished building DOC-PHPBB7-JOB1-37.