Build: #39 failed
Job: Create PDF failed
Build log
The build generated 253 lines of output. Download or view full build log.
13-Jan-2023 19:55:13 | Build Documentation - phpBB Documentation - 3.3.x - Create PDF #39 (DOC-PHPBB7-JOB1-39) started building on agent Agent 2 |
13-Jan-2023 19:55:13 | |
13-Jan-2023 19:55:13 | Build working directory is /home/bamboo/xml-data/build-dir/DOC-PHPBB7-JOB1 |
13-Jan-2023 19:55:13 | Executing build Documentation - phpBB Documentation - 3.3.x - Create PDF #39 (DOC-PHPBB7-JOB1-39) |
13-Jan-2023 19:55:13 | Starting task 'Checkout Default Repository' of type 'com.atlassian.bamboo.plugins.vcs:task.vcs.checkout' |
13-Jan-2023 19:55:13 | Checking out into /home/bamboo/xml-data/build-dir/DOC-PHPBB7-JOB1 |
13-Jan-2023 19:55:13 | Updating source code to revision: 6876a1bc27c69470d38e2ab6bd503707a53380db |
13-Jan-2023 19:55:13 | Fetching 'refs/heads/3.3.x' from 'https://github.com/phpbb/documentation.git'. |
13-Jan-2023 19:55:15 | Checking out revision 6876a1bc27c69470d38e2ab6bd503707a53380db. |
13-Jan-2023 19:55:15 | Creating local git repository in '/home/bamboo/xml-data/build-dir/DOC-PHPBB7-JOB1/.git'. |
13-Jan-2023 19:55:16 | Cloning into '/home/bamboo/xml-data/build-dir/DOC-PHPBB7-JOB1'... |
13-Jan-2023 19:55:16 | done. |
13-Jan-2023 19:55:19 | Switched to a new branch '3.3.x' |
13-Jan-2023 19:55:19 | Branch 3.3.x set up to track remote branch 3.3.x from origin. |
13-Jan-2023 19:55:19 | Updated source code to revision: 6876a1bc27c69470d38e2ab6bd503707a53380db |
13-Jan-2023 19:55:19 | Finished task 'Checkout Default Repository' with result: Success |
13-Jan-2023 19:55:19 | Running pre-build action: VCS Version Collector |
13-Jan-2023 19:55:19 | Skipping execution of task 'Generate PDF' as it is disabled |
13-Jan-2023 19:55:19 | Substituting variable: ${bamboo.planRepository.branchName} with 3.3.x |
13-Jan-2023 19:55:19 | Substituting variable: ${bamboo.planRepository.branchName} with 3.3.x |
13-Jan-2023 19:55:19 | Substituting variable: ${bamboo.planRepository.branchName} with 3.3.x |
13-Jan-2023 19:55:19 | Substituting variable: ${bamboo.planRepository.branchName} with 3.3.x |
13-Jan-2023 19:55:19 | Starting task 'Generate PDF' of type 'com.atlassian.bamboo.plugins.scripttask:task.builder.script' |
13-Jan-2023 19:55:19 | Beginning to execute external process for build 'Documentation - phpBB Documentation - 3.3.x - Create PDF #39 (DOC-PHPBB7-JOB1-39)' ... running command line: /bin/sh /home/bamboo/temp/DOC-PHPBB7-JOB1-39-ScriptBuildTask-5123879792359655377.sh ... in: /home/bamboo/xml-data/build-dir/DOC-PHPBB7-JOB1/documentation ... using extra environment variables: bamboo_planRepository_1_branch=3.3.x bamboo_planRepository_1_branchDisplayName=3.3.x bamboo_repository_revision_number=6876a1bc27c69470d38e2ab6bd503707a53380db bamboo_resultsUrl=https://bamboo.phpbb.com/browse/DOC-PHPBB7-JOB1-39 bamboo_capability_system_builder_command_Git=/usr/bin/git bamboo_build_working_directory=/home/bamboo/xml-data/build-dir/DOC-PHPBB7-JOB1 bamboo_planRepository_1_name=Documentation bamboo_buildKey=DOC-PHPBB7-JOB1 bamboo_repository_113803265_git_branch=3.3.x bamboo_shortPlanName=phpBB Documentation bamboo_capability_system_builder_command_fop=/usr/bin/fop bamboo_capability_dbms_sqlite_2=true bamboo_planRepository_name=Documentation bamboo_buildNumber=39 bamboo_capability_system_builder_phpunit_PHPUnit=/usr/bin/phpunit bamboo_shortJobName=Create PDF bamboo_buildResultsUrl=https://bamboo.phpbb.com/browse/DOC-PHPBB7-JOB1-39 bamboo_planRepository_repositoryUrl=https://github.com/phpbb/documentation.git bamboo_agentId=41779201 bamboo_repository_113803265_branch_name=3.3.x bamboo_planName=Documentation - phpBB Documentation - 3.3.x bamboo_shortPlanKey=PHPBB7 bamboo_shortJobKey=JOB1 bamboo_capability_dbms_mysql_55=true bamboo_capability_system_jdk_JDK_1_7_0_65=/usr/lib/jvm/java-7-openjdk-amd64 bamboo_planRepository_revision=6876a1bc27c69470d38e2ab6bd503707a53380db bamboo_buildTimeStamp=2023-01-13T19:55:13.121Z bamboo_repository_previous_revision_number=ec57730c175a80c1b1ece0477dc8f27ccb4dbdb8 bamboo_repository_113803265_name=Documentation bamboo_capability_system_jdk_JDK_1_6_0_16=/usr/lib/jvm/java-6-sun-1.6.0.16 bamboo_capability_system_builder_mvn2_Maven_2=/usr/share/maven2 bamboo_planRepository_previousRevision=ec57730c175a80c1b1ece0477dc8f27ccb4dbdb8 bamboo_repository_git_branch=3.3.x bamboo_buildResultKey=DOC-PHPBB7-JOB1-39 bamboo_repository_branch_name=3.3.x bamboo_buildPlanName=Documentation - phpBB Documentation - 3.3.x - Create PDF bamboo_planRepository_1_revision=6876a1bc27c69470d38e2ab6bd503707a53380db bamboo_repository_name=Documentation bamboo_buildFailed=false bamboo_capability_system_docker_executable=/usr/bin/docker bamboo_planRepository_branch=3.3.x bamboo_repository_113803265_git_repositoryUrl=https://github.com/phpbb/documentation.git bamboo_agentWorkingDirectory=/home/bamboo/xml-data/build-dir bamboo_capability_system_git_executable=/usr/bin/git bamboo_repository_113803265_previous_revision_number=ec57730c175a80c1b1ece0477dc8f27ccb4dbdb8 bamboo_capability_system_builder_phpunit_PHPUnit_3_4=/usr/bin/phpunit bamboo_repository_git_username=phpbb bamboo_planRepository_1_previousRevision=ec57730c175a80c1b1ece0477dc8f27ccb4dbdb8 bamboo_planRepository_branchDisplayName=3.3.x bamboo_planRepository_1_type=gh2 bamboo_planRepository_branchName=3.3.x bamboo_capability_system_jdk_JDK=/usr/lib/jvm/java-6-sun bamboo_plan_storageTag=plan-113606657 bamboo_hg_cache_directory=/home/bamboo/xml-data/build-dir/_hg-repositories-cache bamboo_planRepository_1_username=phpbb bamboo_planRepository_type=gh2 bamboo_git_cache_directory=/home/bamboo/xml-data/build-dir/_git-repositories-cache bamboo_repository_git_repositoryUrl=https://github.com/phpbb/documentation.git bamboo_capability_system_builder_ant_Ant=/usr/share/ant bamboo_tmp_directory=/home/bamboo/temp bamboo_repository_113803265_revision_number=6876a1bc27c69470d38e2ab6bd503707a53380db bamboo_working_directory=/home/bamboo/xml-data/build-dir/DOC-PHPBB7-JOB1 bamboo_planKey=DOC-PHPBB7 bamboo_capability_local=true bamboo_planRepository_1_repositoryUrl=https://github.com/phpbb/documentation.git bamboo_planRepository_username=phpbb bamboo_capability_system_jdk_JDK_1_6=/usr/lib/jvm/java-6-sun bamboo_capability_system_jdk_JDK_1_7=/usr/lib/jvm/java-7-openjdk-amd64 bamboo_repository_113803265_git_username=phpbb bamboo_planRepository_1_branchName=3.3.x |
13-Jan-2023 19:55:33 | Jan 13, 2023 7:55:33 PM org.apache.fop.cli.InputHandler warning |
13-Jan-2023 19:55:33 | WARNING: Making portrait pages on USletter paper (8.5inx11in) |
13-Jan-2023 19:55:34 | Jan 13, 2023 7:55:34 PM org.apache.fop.fo.FOTreeBuilder fatalError |
13-Jan-2023 19:55:34 | SEVERE: org.xml.sax.SAXParseException; systemId: file:/home/bamboo/xml-data/build-dir/DOC-PHPBB7-JOB1/documentation/xsl/pdf/fo/pagesetup.xsl; lineNumber: 689; columnNumber: 57; java.lang.reflect.UndeclaredThrowableException |
13-Jan-2023 19:55:34 | Jan 13, 2023 7:55:34 PM org.apache.fop.cli.Main startFOP |
13-Jan-2023 19:55:34 | SEVERE: Exception |
13-Jan-2023 19:55:34 | org.apache.fop.apps.FOPException: java.lang.reflect.UndeclaredThrowableException |
13-Jan-2023 19:55:34 | javax.xml.transform.TransformerException: java.lang.reflect.UndeclaredThrowableException |
13-Jan-2023 19:55:34 | at org.apache.fop.cli.InputHandler.transformTo(InputHandler.java:303) |
13-Jan-2023 19:55:34 | at org.apache.fop.cli.InputHandler.renderTo(InputHandler.java:130) |
13-Jan-2023 19:55:34 | at org.apache.fop.cli.Main.startFOP(Main.java:177) |
13-Jan-2023 19:55:34 | at org.apache.fop.cli.Main.main(Main.java:208) |
13-Jan-2023 19:55:34 | Caused by: javax.xml.transform.TransformerException: java.lang.reflect.UndeclaredThrowableException |
13-Jan-2023 19:55:34 | at org.apache.xalan.transformer.TransformerImpl.executeChildTemplates(TransformerImpl.java:2416) |
13-Jan-2023 19:55:34 | at org.apache.xalan.templates.ElemLiteralResult.execute(ElemLiteralResult.java:1374) |
13-Jan-2023 19:55:34 | at org.apache.xalan.transformer.TransformerImpl.executeChildTemplates(TransformerImpl.java:2411) |
13-Jan-2023 19:55:34 | at org.apache.xalan.templates.ElemIf.execute(ElemIf.java:160) |
13-Jan-2023 19:55:34 | at org.apache.xalan.transformer.TransformerImpl.executeChildTemplates(TransformerImpl.java:2411) |
13-Jan-2023 19:55:34 | at org.apache.xalan.templates.ElemLiteralResult.execute(ElemLiteralResult.java:1374) |
13-Jan-2023 19:55:34 | at org.apache.xalan.transformer.TransformerImpl.executeChildTemplates(TransformerImpl.java:2411) |
13-Jan-2023 19:55:34 | at org.apache.xalan.templates.ElemTemplate.execute(ElemTemplate.java:392) |
13-Jan-2023 19:55:34 | at org.apache.xalan.templates.ElemCallTemplate.execute(ElemCallTemplate.java:246) |
13-Jan-2023 19:55:34 | at org.apache.xalan.transformer.TransformerImpl.executeChildTemplates(TransformerImpl.java:2411) |
13-Jan-2023 19:55:34 | at org.apache.xalan.templates.ElemLiteralResult.execute(ElemLiteralResult.java:1374) |
13-Jan-2023 19:55:34 | at org.apache.xalan.templates.ElemApplyTemplates.transformSelectedNodes(ElemApplyTemplates.java:393) |
13-Jan-2023 19:55:34 | at org.apache.xalan.templates.ElemApplyTemplates.execute(ElemApplyTemplates.java:176) |
13-Jan-2023 19:55:34 | at org.apache.xalan.templates.ElemApplyTemplates.transformSelectedNodes(ElemApplyTemplates.java:393) |
13-Jan-2023 19:55:34 | at org.apache.xalan.templates.ElemApplyTemplates.execute(ElemApplyTemplates.java:176) |
13-Jan-2023 19:55:34 | at org.apache.xalan.transformer.TransformerImpl.executeChildTemplates(TransformerImpl.java:2411) |
13-Jan-2023 19:55:34 | at org.apache.xalan.templates.ElemIf.execute(ElemIf.java:160) |
13-Jan-2023 19:55:34 | at org.apache.xalan.transformer.TransformerImpl.executeChildTemplates(TransformerImpl.java:2411) |
13-Jan-2023 19:55:34 | at org.apache.xalan.templates.ElemChoose.execute(ElemChoose.java:139) |
13-Jan-2023 19:55:34 | at org.apache.xalan.transformer.TransformerImpl.executeChildTemplates(TransformerImpl.java:2411) |
13-Jan-2023 19:55:34 | at org.apache.xalan.templates.ElemChoose.execute(ElemChoose.java:139) |
13-Jan-2023 19:55:34 | at org.apache.xalan.transformer.TransformerImpl.executeChildTemplates(TransformerImpl.java:2411) |
13-Jan-2023 19:55:34 | at org.apache.xalan.templates.ElemChoose.execute(ElemChoose.java:139) |
13-Jan-2023 19:55:34 | at org.apache.xalan.transformer.TransformerImpl.executeChildTemplates(TransformerImpl.java:2411) |
13-Jan-2023 19:55:34 | at org.apache.xalan.transformer.TransformerImpl.applyTemplateToNode(TransformerImpl.java:2281) |
13-Jan-2023 19:55:34 | at org.apache.xalan.transformer.TransformerImpl.transformNode(TransformerImpl.java:1367) |
13-Jan-2023 19:55:34 | at org.apache.xalan.transformer.TransformerImpl.transform(TransformerImpl.java:709) |
13-Jan-2023 19:55:34 | at org.apache.xalan.transformer.TransformerImpl.transform(TransformerImpl.java:1284) |
13-Jan-2023 19:55:34 | at org.apache.xalan.transformer.TransformerImpl.transform(TransformerImpl.java:1262) |
13-Jan-2023 19:55:34 | at org.apache.fop.cli.InputHandler.transformTo(InputHandler.java:300) |
13-Jan-2023 19:55:34 | ... 3 more |
13-Jan-2023 19:55:34 | Caused by: java.lang.reflect.UndeclaredThrowableException |
13-Jan-2023 19:55:34 | at com.sun.proxy.$Proxy0.readUnsignedInt(Unknown Source) |
13-Jan-2023 19:55:34 | at org.apache.xmlgraphics.image.loader.impl.PreloaderEPS.preloadImage(PreloaderEPS.java:65) |
13-Jan-2023 19:55:34 | at org.apache.xmlgraphics.image.loader.ImageManager.preloadImage(ImageManager.java:175) |
13-Jan-2023 19:55:34 | at org.apache.xmlgraphics.image.loader.cache.ImageCache.needImageInfo(ImageCache.java:128) |
13-Jan-2023 19:55:34 | at org.apache.xmlgraphics.image.loader.ImageManager.getImageInfo(ImageManager.java:122) |
13-Jan-2023 19:55:34 | at org.apache.fop.fo.properties.CommonBorderPaddingBackground.getInstance(CommonBorderPaddingBackground.java:381) |
13-Jan-2023 19:55:34 | at org.apache.fop.fo.PropertyList.getBorderPaddingBackgroundProps(PropertyList.java:577) |
13-Jan-2023 19:55:34 | at org.apache.fop.fo.pagination.Region.bind(Region.java:66) |
13-Jan-2023 19:55:34 | at org.apache.fop.fo.pagination.RegionBody.bind(RegionBody.java:58) |
13-Jan-2023 19:55:34 | at org.apache.fop.fo.FObj.processNode(FObj.java:124) |
13-Jan-2023 19:55:34 | at org.apache.fop.fo.FOTreeBuilder$MainFOHandler.startElement(FOTreeBuilder.java:280) |
13-Jan-2023 19:55:34 | at org.apache.fop.fo.FOTreeBuilder.startElement(FOTreeBuilder.java:175) |
13-Jan-2023 19:55:34 | at org.apache.xml.serializer.ToXMLSAXHandler.closeStartTag(ToXMLSAXHandler.java:204) |
13-Jan-2023 19:55:34 | at org.apache.xml.serializer.ToSAXHandler.flushPending(ToSAXHandler.java:277) |
13-Jan-2023 19:55:34 | at org.apache.xml.serializer.ToXMLSAXHandler.endElement(ToXMLSAXHandler.java:243) |
13-Jan-2023 19:55:34 | at org.apache.xalan.templates.ElemLiteralResult.execute(ElemLiteralResult.java:1399) |
13-Jan-2023 19:55:34 | at org.apache.xalan.transformer.TransformerImpl.executeChildTemplates(TransformerImpl.java:2411) |
13-Jan-2023 19:55:34 | ... 32 more |
13-Jan-2023 19:55:34 | Caused by: java.lang.reflect.InvocationTargetException |
13-Jan-2023 19:55:34 | at sun.reflect.NativeMethodAccessorImpl.invoke0(Native Method) |
13-Jan-2023 19:55:34 | at sun.reflect.NativeMethodAccessorImpl.invoke(NativeMethodAccessorImpl.java:62) |
13-Jan-2023 19:55:34 | at sun.reflect.DelegatingMethodAccessorImpl.invoke(DelegatingMethodAccessorImpl.java:43) |
13-Jan-2023 19:55:34 | at java.lang.reflect.Method.invoke(Method.java:498) |
13-Jan-2023 19:55:34 | at org.apache.xmlgraphics.image.loader.impl.AbstractImageSessionContext$ObservingImageInputStreamInvocationHandler.invoke(AbstractImageSessionContext.java:219) |
13-Jan-2023 19:55:34 | ... 49 more |
13-Jan-2023 19:55:34 | Caused by: java.io.EOFException |
13-Jan-2023 19:55:34 | at javax.imageio.stream.ImageInputStreamImpl.readInt(ImageInputStreamImpl.java:251) |
13-Jan-2023 19:55:34 | at javax.imageio.stream.ImageInputStreamImpl.readUnsignedInt(ImageInputStreamImpl.java:266) |
13-Jan-2023 19:55:34 | ... 54 more |
13-Jan-2023 19:55:34 | |
13-Jan-2023 19:55:34 | --------- |
13-Jan-2023 19:55:34 | |
13-Jan-2023 19:55:34 | ; SystemID: file:/home/bamboo/xml-data/build-dir/DOC-PHPBB7-JOB1/documentation/xsl/pdf/fo/pagesetup.xsl; Line#: 689; Column#: 57 |
13-Jan-2023 19:55:34 | javax.xml.transform.TransformerException: java.lang.reflect.UndeclaredThrowableException |
13-Jan-2023 19:55:34 | at org.apache.xalan.transformer.TransformerImpl.executeChildTemplates(TransformerImpl.java:2416) |
13-Jan-2023 19:55:34 | at org.apache.xalan.templates.ElemLiteralResult.execute(ElemLiteralResult.java:1374) |
13-Jan-2023 19:55:34 | at org.apache.xalan.transformer.TransformerImpl.executeChildTemplates(TransformerImpl.java:2411) |
13-Jan-2023 19:55:34 | at org.apache.xalan.templates.ElemIf.execute(ElemIf.java:160) |
13-Jan-2023 19:55:34 | at org.apache.xalan.transformer.TransformerImpl.executeChildTemplates(TransformerImpl.java:2411) |
13-Jan-2023 19:55:34 | at org.apache.xalan.templates.ElemLiteralResult.execute(ElemLiteralResult.java:1374) |
13-Jan-2023 19:55:34 | at org.apache.xalan.transformer.TransformerImpl.executeChildTemplates(TransformerImpl.java:2411) |
13-Jan-2023 19:55:34 | at org.apache.xalan.templates.ElemTemplate.execute(ElemTemplate.java:392) |
13-Jan-2023 19:55:34 | at org.apache.xalan.templates.ElemCallTemplate.execute(ElemCallTemplate.java:246) |
13-Jan-2023 19:55:34 | at org.apache.xalan.transformer.TransformerImpl.executeChildTemplates(TransformerImpl.java:2411) |
13-Jan-2023 19:55:34 | at org.apache.xalan.templates.ElemLiteralResult.execute(ElemLiteralResult.java:1374) |
13-Jan-2023 19:55:34 | at org.apache.xalan.templates.ElemApplyTemplates.transformSelectedNodes(ElemApplyTemplates.java:393) |
13-Jan-2023 19:55:34 | at org.apache.xalan.templates.ElemApplyTemplates.execute(ElemApplyTemplates.java:176) |
13-Jan-2023 19:55:34 | at org.apache.xalan.templates.ElemApplyTemplates.transformSelectedNodes(ElemApplyTemplates.java:393) |
13-Jan-2023 19:55:34 | at org.apache.xalan.templates.ElemApplyTemplates.execute(ElemApplyTemplates.java:176) |
13-Jan-2023 19:55:34 | at org.apache.xalan.transformer.TransformerImpl.executeChildTemplates(TransformerImpl.java:2411) |
13-Jan-2023 19:55:34 | at org.apache.xalan.templates.ElemIf.execute(ElemIf.java:160) |
13-Jan-2023 19:55:34 | at org.apache.xalan.transformer.TransformerImpl.executeChildTemplates(TransformerImpl.java:2411) |
13-Jan-2023 19:55:34 | at org.apache.xalan.templates.ElemChoose.execute(ElemChoose.java:139) |
13-Jan-2023 19:55:34 | at org.apache.xalan.transformer.TransformerImpl.executeChildTemplates(TransformerImpl.java:2411) |
13-Jan-2023 19:55:34 | at org.apache.xalan.templates.ElemChoose.execute(ElemChoose.java:139) |
13-Jan-2023 19:55:34 | at org.apache.xalan.transformer.TransformerImpl.executeChildTemplates(TransformerImpl.java:2411) |
13-Jan-2023 19:55:34 | at org.apache.xalan.templates.ElemChoose.execute(ElemChoose.java:139) |
13-Jan-2023 19:55:34 | at org.apache.xalan.transformer.TransformerImpl.executeChildTemplates(TransformerImpl.java:2411) |
13-Jan-2023 19:55:34 | at org.apache.xalan.transformer.TransformerImpl.applyTemplateToNode(TransformerImpl.java:2281) |
13-Jan-2023 19:55:34 | at org.apache.xalan.transformer.TransformerImpl.transformNode(TransformerImpl.java:1367) |
13-Jan-2023 19:55:34 | at org.apache.xalan.transformer.TransformerImpl.transform(TransformerImpl.java:709) |
13-Jan-2023 19:55:34 | at org.apache.xalan.transformer.TransformerImpl.transform(TransformerImpl.java:1284) |
13-Jan-2023 19:55:34 | at org.apache.xalan.transformer.TransformerImpl.transform(TransformerImpl.java:1262) |
13-Jan-2023 19:55:34 | at org.apache.fop.cli.InputHandler.transformTo(InputHandler.java:300) |
13-Jan-2023 19:55:34 | at org.apache.fop.cli.InputHandler.renderTo(InputHandler.java:130) |
13-Jan-2023 19:55:34 | at org.apache.fop.cli.Main.startFOP(Main.java:177) |
13-Jan-2023 19:55:34 | at org.apache.fop.cli.Main.main(Main.java:208) |
13-Jan-2023 19:55:34 | Caused by: java.lang.reflect.UndeclaredThrowableException |
13-Jan-2023 19:55:34 | at com.sun.proxy.$Proxy0.readUnsignedInt(Unknown Source) |
13-Jan-2023 19:55:34 | at org.apache.xmlgraphics.image.loader.impl.PreloaderEPS.preloadImage(PreloaderEPS.java:65) |
13-Jan-2023 19:55:34 | at org.apache.xmlgraphics.image.loader.ImageManager.preloadImage(ImageManager.java:175) |
13-Jan-2023 19:55:34 | at org.apache.xmlgraphics.image.loader.cache.ImageCache.needImageInfo(ImageCache.java:128) |
13-Jan-2023 19:55:34 | at org.apache.xmlgraphics.image.loader.ImageManager.getImageInfo(ImageManager.java:122) |
13-Jan-2023 19:55:34 | at org.apache.fop.fo.properties.CommonBorderPaddingBackground.getInstance(CommonBorderPaddingBackground.java:381) |
13-Jan-2023 19:55:34 | at org.apache.fop.fo.PropertyList.getBorderPaddingBackgroundProps(PropertyList.java:577) |
13-Jan-2023 19:55:34 | at org.apache.fop.fo.pagination.Region.bind(Region.java:66) |
13-Jan-2023 19:55:34 | at org.apache.fop.fo.pagination.RegionBody.bind(RegionBody.java:58) |
13-Jan-2023 19:55:34 | at org.apache.fop.fo.FObj.processNode(FObj.java:124) |
13-Jan-2023 19:55:34 | at org.apache.fop.fo.FOTreeBuilder$MainFOHandler.startElement(FOTreeBuilder.java:280) |
13-Jan-2023 19:55:34 | at org.apache.fop.fo.FOTreeBuilder.startElement(FOTreeBuilder.java:175) |
13-Jan-2023 19:55:34 | at org.apache.xml.serializer.ToXMLSAXHandler.closeStartTag(ToXMLSAXHandler.java:204) |
13-Jan-2023 19:55:34 | at org.apache.xml.serializer.ToSAXHandler.flushPending(ToSAXHandler.java:277) |
13-Jan-2023 19:55:34 | at org.apache.xml.serializer.ToXMLSAXHandler.endElement(ToXMLSAXHandler.java:243) |
13-Jan-2023 19:55:34 | at org.apache.xalan.templates.ElemLiteralResult.execute(ElemLiteralResult.java:1399) |
13-Jan-2023 19:55:34 | at org.apache.xalan.transformer.TransformerImpl.executeChildTemplates(TransformerImpl.java:2411) |
13-Jan-2023 19:55:34 | ... 32 more |
13-Jan-2023 19:55:34 | Caused by: java.lang.reflect.InvocationTargetException |
13-Jan-2023 19:55:34 | at sun.reflect.NativeMethodAccessorImpl.invoke0(Native Method) |
13-Jan-2023 19:55:34 | at sun.reflect.NativeMethodAccessorImpl.invoke(NativeMethodAccessorImpl.java:62) |
13-Jan-2023 19:55:34 | at sun.reflect.DelegatingMethodAccessorImpl.invoke(DelegatingMethodAccessorImpl.java:43) |
13-Jan-2023 19:55:34 | at java.lang.reflect.Method.invoke(Method.java:498) |
13-Jan-2023 19:55:34 | at org.apache.xmlgraphics.image.loader.impl.AbstractImageSessionContext$ObservingImageInputStreamInvocationHandler.invoke(AbstractImageSessionContext.java:219) |
13-Jan-2023 19:55:34 | ... 49 more |
13-Jan-2023 19:55:34 | Caused by: java.io.EOFException |
13-Jan-2023 19:55:34 | at javax.imageio.stream.ImageInputStreamImpl.readInt(ImageInputStreamImpl.java:251) |
13-Jan-2023 19:55:34 | at javax.imageio.stream.ImageInputStreamImpl.readUnsignedInt(ImageInputStreamImpl.java:266) |
13-Jan-2023 19:55:34 | ... 54 more |
13-Jan-2023 19:55:34 | --------- |
13-Jan-2023 19:55:34 | java.lang.reflect.UndeclaredThrowableException |
13-Jan-2023 19:55:34 | at com.sun.proxy.$Proxy0.readUnsignedInt(Unknown Source) |
13-Jan-2023 19:55:34 | at org.apache.xmlgraphics.image.loader.impl.PreloaderEPS.preloadImage(PreloaderEPS.java:65) |
13-Jan-2023 19:55:34 | at org.apache.xmlgraphics.image.loader.ImageManager.preloadImage(ImageManager.java:175) |
13-Jan-2023 19:55:34 | at org.apache.xmlgraphics.image.loader.cache.ImageCache.needImageInfo(ImageCache.java:128) |
13-Jan-2023 19:55:34 | at org.apache.xmlgraphics.image.loader.ImageManager.getImageInfo(ImageManager.java:122) |
13-Jan-2023 19:55:34 | at org.apache.fop.fo.properties.CommonBorderPaddingBackground.getInstance(CommonBorderPaddingBackground.java:381) |
13-Jan-2023 19:55:34 | at org.apache.fop.fo.PropertyList.getBorderPaddingBackgroundProps(PropertyList.java:577) |
13-Jan-2023 19:55:34 | at org.apache.fop.fo.pagination.Region.bind(Region.java:66) |
13-Jan-2023 19:55:34 | at org.apache.fop.fo.pagination.RegionBody.bind(RegionBody.java:58) |
13-Jan-2023 19:55:34 | at org.apache.fop.fo.FObj.processNode(FObj.java:124) |
13-Jan-2023 19:55:34 | at org.apache.fop.fo.FOTreeBuilder$MainFOHandler.startElement(FOTreeBuilder.java:280) |
13-Jan-2023 19:55:34 | at org.apache.fop.fo.FOTreeBuilder.startElement(FOTreeBuilder.java:175) |
13-Jan-2023 19:55:34 | at org.apache.xml.serializer.ToXMLSAXHandler.closeStartTag(ToXMLSAXHandler.java:204) |
13-Jan-2023 19:55:34 | at org.apache.xml.serializer.ToSAXHandler.flushPending(ToSAXHandler.java:277) |
13-Jan-2023 19:55:34 | at org.apache.xml.serializer.ToXMLSAXHandler.endElement(ToXMLSAXHandler.java:243) |
13-Jan-2023 19:55:34 | at org.apache.xalan.templates.ElemLiteralResult.execute(ElemLiteralResult.java:1399) |
13-Jan-2023 19:55:34 | at org.apache.xalan.transformer.TransformerImpl.executeChildTemplates(TransformerImpl.java:2411) |
13-Jan-2023 19:55:34 | at org.apache.xalan.templates.ElemLiteralResult.execute(ElemLiteralResult.java:1374) |
13-Jan-2023 19:55:34 | at org.apache.xalan.transformer.TransformerImpl.executeChildTemplates(TransformerImpl.java:2411) |
13-Jan-2023 19:55:34 | at org.apache.xalan.templates.ElemIf.execute(ElemIf.java:160) |
13-Jan-2023 19:55:34 | at org.apache.xalan.transformer.TransformerImpl.executeChildTemplates(TransformerImpl.java:2411) |
13-Jan-2023 19:55:34 | at org.apache.xalan.templates.ElemLiteralResult.execute(ElemLiteralResult.java:1374) |
13-Jan-2023 19:55:34 | at org.apache.xalan.transformer.TransformerImpl.executeChildTemplates(TransformerImpl.java:2411) |
13-Jan-2023 19:55:34 | at org.apache.xalan.templates.ElemTemplate.execute(ElemTemplate.java:392) |
13-Jan-2023 19:55:34 | at org.apache.xalan.templates.ElemCallTemplate.execute(ElemCallTemplate.java:246) |
13-Jan-2023 19:55:34 | at org.apache.xalan.transformer.TransformerImpl.executeChildTemplates(TransformerImpl.java:2411) |
13-Jan-2023 19:55:34 | at org.apache.xalan.templates.ElemLiteralResult.execute(ElemLiteralResult.java:1374) |
13-Jan-2023 19:55:34 | at org.apache.xalan.templates.ElemApplyTemplates.transformSelectedNodes(ElemApplyTemplates.java:393) |
13-Jan-2023 19:55:34 | at org.apache.xalan.templates.ElemApplyTemplates.execute(ElemApplyTemplates.java:176) |
13-Jan-2023 19:55:34 | at org.apache.xalan.templates.ElemApplyTemplates.transformSelectedNodes(ElemApplyTemplates.java:393) |
13-Jan-2023 19:55:34 | at org.apache.xalan.templates.ElemApplyTemplates.execute(ElemApplyTemplates.java:176) |
13-Jan-2023 19:55:34 | at org.apache.xalan.transformer.TransformerImpl.executeChildTemplates(TransformerImpl.java:2411) |
13-Jan-2023 19:55:34 | at org.apache.xalan.templates.ElemIf.execute(ElemIf.java:160) |
13-Jan-2023 19:55:34 | at org.apache.xalan.transformer.TransformerImpl.executeChildTemplates(TransformerImpl.java:2411) |
13-Jan-2023 19:55:34 | at org.apache.xalan.templates.ElemChoose.execute(ElemChoose.java:139) |
13-Jan-2023 19:55:34 | at org.apache.xalan.transformer.TransformerImpl.executeChildTemplates(TransformerImpl.java:2411) |
13-Jan-2023 19:55:34 | at org.apache.xalan.templates.ElemChoose.execute(ElemChoose.java:139) |
13-Jan-2023 19:55:34 | at org.apache.xalan.transformer.TransformerImpl.executeChildTemplates(TransformerImpl.java:2411) |
13-Jan-2023 19:55:34 | at org.apache.xalan.templates.ElemChoose.execute(ElemChoose.java:139) |
13-Jan-2023 19:55:34 | at org.apache.xalan.transformer.TransformerImpl.executeChildTemplates(TransformerImpl.java:2411) |
13-Jan-2023 19:55:34 | at org.apache.xalan.transformer.TransformerImpl.applyTemplateToNode(TransformerImpl.java:2281) |
13-Jan-2023 19:55:34 | at org.apache.xalan.transformer.TransformerImpl.transformNode(TransformerImpl.java:1367) |
13-Jan-2023 19:55:34 | at org.apache.xalan.transformer.TransformerImpl.transform(TransformerImpl.java:709) |
13-Jan-2023 19:55:34 | at org.apache.xalan.transformer.TransformerImpl.transform(TransformerImpl.java:1284) |
13-Jan-2023 19:55:34 | at org.apache.xalan.transformer.TransformerImpl.transform(TransformerImpl.java:1262) |
13-Jan-2023 19:55:34 | at org.apache.fop.cli.InputHandler.transformTo(InputHandler.java:300) |
13-Jan-2023 19:55:34 | at org.apache.fop.cli.InputHandler.renderTo(InputHandler.java:130) |
13-Jan-2023 19:55:34 | at org.apache.fop.cli.Main.startFOP(Main.java:177) |
13-Jan-2023 19:55:34 | at org.apache.fop.cli.Main.main(Main.java:208) |
13-Jan-2023 19:55:34 | Caused by: java.lang.reflect.InvocationTargetException |
13-Jan-2023 19:55:34 | at sun.reflect.NativeMethodAccessorImpl.invoke0(Native Method) |
13-Jan-2023 19:55:34 | at sun.reflect.NativeMethodAccessorImpl.invoke(NativeMethodAccessorImpl.java:62) |
13-Jan-2023 19:55:34 | at sun.reflect.DelegatingMethodAccessorImpl.invoke(DelegatingMethodAccessorImpl.java:43) |
13-Jan-2023 19:55:34 | at java.lang.reflect.Method.invoke(Method.java:498) |
13-Jan-2023 19:55:34 | at org.apache.xmlgraphics.image.loader.impl.AbstractImageSessionContext$ObservingImageInputStreamInvocationHandler.invoke(AbstractImageSessionContext.java:219) |
13-Jan-2023 19:55:34 | ... 49 more |
13-Jan-2023 19:55:34 | Caused by: java.io.EOFException |
13-Jan-2023 19:55:34 | at javax.imageio.stream.ImageInputStreamImpl.readInt(ImageInputStreamImpl.java:251) |
13-Jan-2023 19:55:34 | at javax.imageio.stream.ImageInputStreamImpl.readUnsignedInt(ImageInputStreamImpl.java:266) |
13-Jan-2023 19:55:34 | ... 54 more |
13-Jan-2023 19:55:34 | |
13-Jan-2023 19:55:34 | Failing task since return code of [/bin/sh /home/bamboo/temp/DOC-PHPBB7-JOB1-39-ScriptBuildTask-5123879792359655377.sh] was 1 while expected 0 |
13-Jan-2023 19:55:34 | Finished task 'Generate PDF' with result: Failed |
13-Jan-2023 19:55:34 | Running post build plugin 'NCover Results Collector' |
13-Jan-2023 19:55:34 | Running post build plugin 'Artifact Copier' |
13-Jan-2023 19:55:34 | Publishing an artifact: Documentation |
13-Jan-2023 19:55:34 | Unable to publish artifact [Documentation]: |
13-Jan-2023 19:55:34 | The artifact hasn't been successfully published after 11.74 ms |
13-Jan-2023 19:55:34 | Running post build plugin 'npm Cache Cleanup' |
13-Jan-2023 19:55:34 | Running post build plugin 'Clover Results Collector' |
13-Jan-2023 19:55:34 | Running post build plugin 'Docker Container Cleanup' |
13-Jan-2023 19:55:34 | Successfully removed working directory at '/home/bamboo/xml-data/build-dir/DOC-PHPBB7-JOB1' |
13-Jan-2023 19:55:34 | Finalising the build... |
13-Jan-2023 19:55:34 | Stopping timer. |
13-Jan-2023 19:55:34 | Build DOC-PHPBB7-JOB1-39 completed. |
13-Jan-2023 19:55:34 | Running on server: post build plugin 'NCover Results Collector' |
13-Jan-2023 19:55:34 | Running on server: post build plugin 'Build Hanging Detection Configuration' |
13-Jan-2023 19:55:34 | Running on server: post build plugin 'Clover Delta Calculator' |
13-Jan-2023 19:55:34 | Running on server: post build plugin 'Maven Dependencies Postprocessor' |
13-Jan-2023 19:55:34 | All post build plugins have finished |
13-Jan-2023 19:55:34 | Generating build results summary... |
13-Jan-2023 19:55:34 | Saving build results to disk... |
13-Jan-2023 19:55:34 | Store variable context... |
13-Jan-2023 19:55:34 | Indexing build results... |
13-Jan-2023 19:55:34 | Finished building DOC-PHPBB7-JOB1-39. |