Build: #286 failed Changes by Matt Friedman <maf675@gmail.com> and Marc

Stages & jobs

  1. Default Stage

Logs

The following logs have been generated by the jobs in this plan.
  • Expand all
  • Collapse all
Job Logs
Collapse PHP 5.6 - SQLite Default Stage Download or View
26-Apr-2017 23:13:08         at com.atlassian.bamboo.task.TaskExecutorImpl.lambda$executeTasks$3(TaskExecutorImpl.java:317)
26-Apr-2017 23:13:08         at com.atlassian.bamboo.task.TaskExecutorImpl.executeTaskWithPrePostActions(TaskExecutorImpl.java:246)
26-Apr-2017 23:13:08         at com.atlassian.bamboo.task.TaskExecutorImpl.executeTasks(TaskExecutorImpl.java:317)
26-Apr-2017 23:13:08         at com.atlassian.bamboo.task.TaskExecutorImpl.execute(TaskExecutorImpl.java:118)
26-Apr-2017 23:13:08         at com.atlassian.bamboo.build.pipeline.tasks.ExecuteBuildTask.call(ExecuteBuildTask.java:74)
26-Apr-2017 23:13:08         at com.atlassian.bamboo.v2.build.agent.DefaultBuildAgent.build(DefaultBuildAgent.java:216)
26-Apr-2017 23:13:08         at com.atlassian.bamboo.v2.build.agent.BuildAgentControllerImpl$1.call(BuildAgentControllerImpl.java:139)
26-Apr-2017 23:13:08         at com.atlassian.bamboo.v2.build.agent.BuildAgentControllerImpl$1.call(BuildAgentControllerImpl.java:130)
26-Apr-2017 23:13:08         at com.atlassian.bamboo.variable.CustomVariableContextImpl.withVariableSubstitutor(CustomVariableContextImpl.java:221)
26-Apr-2017 23:13:08         at com.atlassian.bamboo.v2.build.agent.BuildAgentControllerImpl.waitAndPerformBuild(BuildAgentControllerImpl.java:129)
26-Apr-2017 23:13:08         at com.atlassian.bamboo.v2.build.agent.DefaultBuildAgent$1.run(DefaultBuildAgent.java:138)
26-Apr-2017 23:13:08         at com.atlassian.bamboo.utils.BambooRunnables$1.run(BambooRunnables.java:51)
26-Apr-2017 23:13:08         at com.atlassian.bamboo.security.ImpersonationHelper.runWith(ImpersonationHelper.java:31)
26-Apr-2017 23:13:08         at com.atlassian.bamboo.security.ImpersonationHelper.runWithSystemAuthority(ImpersonationHelper.java:20)
26-Apr-2017 23:13:08         at com.atlassian.bamboo.security.ImpersonationHelper$1.run(ImpersonationHelper.java:52)
26-Apr-2017 23:13:08         at java.lang.Thread.run(Thread.java:745)
26-Apr-2017 23:13:08 Caused by: com.atlassian.bamboo.plugins.docker.client.DockerException: Error running Docker run command
26-Apr-2017 23:13:08         at com.atlassian.bamboo.plugins.docker.client.DockerCmd.run(DockerCmd.java:103)
26-Apr-2017 23:13:08         at com.atlassian.bamboo.plugins.docker.service.RunService.execute(RunService.java:60)
26-Apr-2017 23:13:08         ... 17 more
26-Apr-2017 23:13:08 Caused by: com.atlassian.utils.process.ProcessException: Error executing /usr/bin/docker run --volume /home/bamboo/xml-data/build-dir/PHPBB3-DD32-JOB1:/data --workdir /data/phpBB --rm -u=991 -t phpbb:php-5.6 /bin/bash -c "php ../composer.phar install --dev; cd ../build; ../phpBB/vendor/bin/phing build"
26-Apr-2017 23:13:08         at com.atlassian.bamboo.plugins.docker.process.DockerTaskProcessService.execute(DockerTaskProcessService.java:60)
26-Apr-2017 23:13:08         at com.atlassian.bamboo.plugins.docker.client.DockerCmd.run(DockerCmd.java:99)
26-Apr-2017 23:13:08         ... 18 more
26-Apr-2017 23:13:08 Unable to publish artifact [Coverage HTML Report]: the source directory /home/bamboo/xml-data/build-dir/PHPBB3-DD32-JOB1/build/coverage does not exist.
Collapse PHP 5.6 - SQLite Package Default Stage Download or View
26-Apr-2017 23:13:20         at com.atlassian.bamboo.task.TaskExecutorImpl.lambda$executeTasks$3(TaskExecutorImpl.java:317)
26-Apr-2017 23:13:20         at com.atlassian.bamboo.task.TaskExecutorImpl.executeTaskWithPrePostActions(TaskExecutorImpl.java:246)
26-Apr-2017 23:13:20         at com.atlassian.bamboo.task.TaskExecutorImpl.executeTasks(TaskExecutorImpl.java:317)
26-Apr-2017 23:13:20         at com.atlassian.bamboo.task.TaskExecutorImpl.execute(TaskExecutorImpl.java:118)
26-Apr-2017 23:13:20         at com.atlassian.bamboo.build.pipeline.tasks.ExecuteBuildTask.call(ExecuteBuildTask.java:74)
26-Apr-2017 23:13:20         at com.atlassian.bamboo.v2.build.agent.DefaultBuildAgent.build(DefaultBuildAgent.java:216)
26-Apr-2017 23:13:20         at com.atlassian.bamboo.v2.build.agent.BuildAgentControllerImpl$1.call(BuildAgentControllerImpl.java:139)
26-Apr-2017 23:13:20         at com.atlassian.bamboo.v2.build.agent.BuildAgentControllerImpl$1.call(BuildAgentControllerImpl.java:130)
26-Apr-2017 23:13:20         at com.atlassian.bamboo.variable.CustomVariableContextImpl.withVariableSubstitutor(CustomVariableContextImpl.java:221)
26-Apr-2017 23:13:20         at com.atlassian.bamboo.v2.build.agent.BuildAgentControllerImpl.waitAndPerformBuild(BuildAgentControllerImpl.java:129)
26-Apr-2017 23:13:20         at com.atlassian.bamboo.v2.build.agent.DefaultBuildAgent$1.run(DefaultBuildAgent.java:138)
26-Apr-2017 23:13:20         at com.atlassian.bamboo.utils.BambooRunnables$1.run(BambooRunnables.java:51)
26-Apr-2017 23:13:20         at com.atlassian.bamboo.security.ImpersonationHelper.runWith(ImpersonationHelper.java:31)
26-Apr-2017 23:13:20         at com.atlassian.bamboo.security.ImpersonationHelper.runWithSystemAuthority(ImpersonationHelper.java:20)
26-Apr-2017 23:13:20         at com.atlassian.bamboo.security.ImpersonationHelper$1.run(ImpersonationHelper.java:52)
26-Apr-2017 23:13:20         at java.lang.Thread.run(Thread.java:745)
26-Apr-2017 23:13:20 Caused by: com.atlassian.bamboo.plugins.docker.client.DockerException: Error running Docker run command
26-Apr-2017 23:13:20         at com.atlassian.bamboo.plugins.docker.client.DockerCmd.run(DockerCmd.java:103)
26-Apr-2017 23:13:20         at com.atlassian.bamboo.plugins.docker.service.RunService.execute(RunService.java:60)
26-Apr-2017 23:13:20         ... 17 more
26-Apr-2017 23:13:20 Caused by: com.atlassian.utils.process.ProcessException: Error executing /usr/bin/docker run --volume /home/bamboo/xml-data/build-dir/PHPBB3-DD32-P5SP:/data --workdir /data/phpBB --rm -u=991 -t --volume /home/bamboo/xml-data/build-dir/_git-repositories-cache/:/home/bamboo/xml-data/build-dir/_git-repositories-cache/ phpbb:php-5.6 /bin/bash -c "php ../composer.phar install --dev; cd ../build; git fetch --tags https://github.com/phpbb/phpbb.git 2>&1; ../phpBB/vendor/bin/phing package"
26-Apr-2017 23:13:20         at com.atlassian.bamboo.plugins.docker.process.DockerTaskProcessService.execute(DockerTaskProcessService.java:60)
26-Apr-2017 23:13:20         at com.atlassian.bamboo.plugins.docker.client.DockerCmd.run(DockerCmd.java:99)
26-Apr-2017 23:13:20         ... 18 more
26-Apr-2017 23:13:20 Unable to publish artifact [Release Files]: the source directory /home/bamboo/xml-data/build-dir/PHPBB3-DD32-P5SP/build/new_version/release_files does not exist.