Build: #294 was successful

Job: PHP 5.6 - SQLite was successful

Stages & jobs

  1. Default Stage

Build log

The build generated 651 lines of output. Download or view full build log

02-May-2017 17:27:15 Build phpBB3 - Development Docker 3.2 - PHP 5.6 - SQLite #294 (PHPBB3-DD32-JOB1-294) started building on agent Default Agent
02-May-2017 17:27:15
02-May-2017 17:27:15 Build working directory is /home/bamboo/xml-data/build-dir/PHPBB3-DD32-JOB1
02-May-2017 17:27:15 Executing build phpBB3 - Development Docker 3.2 - PHP 5.6 - SQLite #294 (PHPBB3-DD32-JOB1-294)
02-May-2017 17:27:15 Starting task 'Checkout Default Repository' of type 'com.atlassian.bamboo.plugins.vcs:task.vcs.checkout'
02-May-2017 17:27:15 Updating source code to revision: 877760ef9805be8b431c2fe43ef6ab38c07ec02d
02-May-2017 17:27:16 Fetching 'refs/heads/3.2.x' from 'https://github.com/phpbb/phpbb.git'.
02-May-2017 17:27:17 Checking out revision 877760ef9805be8b431c2fe43ef6ab38c07ec02d.
02-May-2017 17:27:17 Creating local git repository in '/home/bamboo/xml-data/build-dir/PHPBB3-DD32-JOB1/.git'.
02-May-2017 17:27:17 Cloning into '/home/bamboo/xml-data/build-dir/PHPBB3-DD32-JOB1'...
02-May-2017 17:27:17 done.
02-May-2017 17:27:19 Switched to a new branch '3.2.x'
02-May-2017 17:27:19 Branch 3.2.x set up to track remote branch 3.2.x from origin.
02-May-2017 17:27:19 Updated source code to revision: 877760ef9805be8b431c2fe43ef6ab38c07ec02d
02-May-2017 17:27:19 Finished task 'Checkout Default Repository' with result: Success
02-May-2017 17:27:19 Running pre-build action: VCS Version Collector
02-May-2017 17:27:19
Substituting variable: ${bamboo.working.directory} with /home/bamboo/xml-data/build-dir/PHPBB3-DD32-JOB1
02-May-2017 17:27:19 Starting task 'Build image' of type 'com.atlassian.bamboo.plugins.bamboo-docker-plugin:task.docker.cli'
02-May-2017 17:27:19
Beginning to execute external process for build 'phpBB3 - Development Docker 3.2 - PHP 5.6 - SQLite #294 (PHPBB3-DD32-JOB1-294)'
... running command line:
/usr/bin/docker build --force-rm=true --tag=phpbb:php-5.6 /home/bamboo/xml-data/build-dir/PHPBB3-DD32-JOB1
... in: /home/bamboo/xml-data/build-dir/PHPBB3-DD32-JOB1
... using extra environment variables:
bamboo_planRepository_1_branch=3.2.x
bamboo_planRepository_1_branchDisplayName=3.2.x
bamboo_repository_revision_number=877760ef9805be8b431c2fe43ef6ab38c07ec02d
bamboo_resultsUrl=https://bamboo.phpbb.com/browse/PHPBB3-DD32-JOB1-294
bamboo_repository_75956229_previous_revision_number=521760aeb73d2801e22665a45ea0aace8741b61d
bamboo_capability_system_builder_command_Git=/usr/bin/git
bamboo_planRepository_1_name=phpBB Rhea
bamboo_build_working_directory=/home/bamboo/xml-data/build-dir/PHPBB3-DD32-JOB1
bamboo_buildKey=PHPBB3-DD32-JOB1
bamboo_capability_phpbb_tests=true
bamboo_shortPlanName=Development Docker 3.2
bamboo_repository_75956229_git_username=bantu
bamboo_capability_system_builder_command_fop=/usr/bin/fop
bamboo_capability_dbms_sqlite_2=true
bamboo_planRepository_name=phpBB Rhea
bamboo_buildNumber=294
bamboo_capability_system_builder_phpunit_PHPUnit=/usr/bin/phpunit
bamboo_shortJobName=PHP 5.6 - SQLite
bamboo_buildResultsUrl=https://bamboo.phpbb.com/browse/PHPBB3-DD32-JOB1-294
bamboo_repository_75956229_git_branch=3.2.x
bamboo_planRepository_repositoryUrl=https://github.com/phpbb/phpbb.git
bamboo_agentId=131073
bamboo_planName=phpBB3 - Development Docker 3.2
bamboo_repository_75956229_branch_name=3.2.x
bamboo_shortPlanKey=DD32
bamboo_repository_75956229_revision_number=877760ef9805be8b431c2fe43ef6ab38c07ec02d
bamboo_repository_75956229_name=phpBB Rhea
bamboo_shortJobKey=JOB1
bamboo_capability_dbms_mysql_55=true
bamboo_capability_system_jdk_JDK_1_7_0_65=/usr/lib/jvm/java-7-openjdk-amd64
bamboo_planRepository_revision=877760ef9805be8b431c2fe43ef6ab38c07ec02d
bamboo_repository_previous_revision_number=521760aeb73d2801e22665a45ea0aace8741b61d
bamboo_buildTimeStamp=2017-05-02T17:27:15.328Z
bamboo_planRepository_previousRevision=521760aeb73d2801e22665a45ea0aace8741b61d
bamboo_capability_system_builder_mvn2_Maven_2=/usr/share/maven2
bamboo_capability_system_jdk_JDK_1_6_0_16=/usr/lib/jvm/java-6-sun-1.6.0.16
bamboo_buildResultKey=PHPBB3-DD32-JOB1-294
bamboo_repository_git_branch=3.2.x
bamboo_repository_branch_name=3.2.x
bamboo_buildPlanName=phpBB3 - Development Docker 3.2 - PHP 5.6 - SQLite
bamboo_planRepository_1_revision=877760ef9805be8b431c2fe43ef6ab38c07ec02d
bamboo_repository_name=phpBB Rhea
bamboo_repository_75956229_git_repositoryUrl=https://github.com/phpbb/phpbb.git
bamboo_capability_system_docker_executable=/usr/bin/docker
bamboo_planRepository_branch=3.2.x
bamboo_agentWorkingDirectory=/home/bamboo/xml-data/build-dir
bamboo_capability_system_git_executable=/usr/bin/git
bamboo_planRepository_1_previousRevision=521760aeb73d2801e22665a45ea0aace8741b61d
bamboo_capability_system_builder_phpunit_PHPUnit_3_4=/usr/bin/phpunit
bamboo_repository_git_username=bantu
bamboo_planRepository_branchDisplayName=3.2.x
bamboo_planRepository_1_type=gitv2
bamboo_planRepository_branchName=3.2.x
bamboo_capability_system_jdk_JDK=/usr/lib/jvm/java-6-sun
bamboo_plan_storageTag=PHPBB3-DD32
bamboo_planRepository_type=gitv2
bamboo_planRepository_1_username=bantu
bamboo_repository_git_repositoryUrl=https://github.com/phpbb/phpbb.git
bamboo_capability_system_builder_ant_Ant=/usr/share/ant
bamboo_working_directory=/home/bamboo/xml-data/build-dir/PHPBB3-DD32-JOB1
bamboo_planKey=PHPBB3-DD32
bamboo_planRepository_1_repositoryUrl=https://github.com/phpbb/phpbb.git
bamboo_planRepository_username=bantu
bamboo_capability_local=true
bamboo_capability_system_jdk_JDK_1_6=/usr/lib/jvm/java-6-sun
bamboo_capability_system_jdk_JDK_1_7=/usr/lib/jvm/java-7-openjdk-amd64
bamboo_planRepository_1_branchName=3.2.x
02-May-2017 17:27:20 Sending build context to Docker daemon 19.08 MB
02-May-2017 17:27:20
02-May-2017 17:27:20 Step 1/5 : FROM php:5.6
02-May-2017 17:27:20 ---> 9054a11bc5cd
02-May-2017 17:27:20 Step 2/5 : RUN apt-get update && apt-get install -y         git         zlib1g-dev         bzip2         zip         && docker-php-ext-install -j$(nproc) zip
02-May-2017 17:27:20 ---> Using cache
02-May-2017 17:27:20 ---> e37d9a254ed4
02-May-2017 17:27:20 Step 3/5 : RUN pecl install xdebug
02-May-2017 17:27:20 ---> Using cache
02-May-2017 17:27:20 ---> 79bed6e2a1f0
02-May-2017 17:27:20 Step 4/5 : RUN docker-php-ext-enable xdebug
02-May-2017 17:27:20 ---> Using cache
02-May-2017 17:27:20 ---> ab9dca892257
02-May-2017 17:27:20 Step 5/5 : RUN echo "memory_limit = 1024M" >> /usr/local/etc/php/conf.d/memory.ini
02-May-2017 17:27:20 ---> Using cache
02-May-2017 17:27:20 ---> d7496cc92d91
02-May-2017 17:27:20 Successfully built d7496cc92d91
02-May-2017 17:27:20 Built Docker image 'phpbb:php-5.6'
02-May-2017 17:27:20 Finished task 'Build image' with result: Success
02-May-2017 17:27:20
Substituting variable: ${bamboo.working.directory} with /home/bamboo/xml-data/build-dir/PHPBB3-DD32-JOB1
02-May-2017 17:27:20 Starting task 'Run tests' of type 'com.atlassian.bamboo.plugins.bamboo-docker-plugin:task.docker.cli'
02-May-2017 17:27:20 Running image name (phpbb:php-5.6)
02-May-2017 17:27:20
Beginning to execute external process for build 'phpBB3 - Development Docker 3.2 - PHP 5.6 - SQLite #294 (PHPBB3-DD32-JOB1-294)'
... running command line:
/usr/bin/docker run --volume /home/bamboo/xml-data/build-dir/PHPBB3-DD32-JOB1:/data --workdir /data/phpBB --rm -u=991 -t phpbb:php-5.6 /bin/bash -c php ../composer.phar install --dev; cd ../build; ../phpBB/vendor/bin/phing build
... in: /home/bamboo/xml-data/build-dir/PHPBB3-DD32-JOB1
... using extra environment variables:
bamboo_planRepository_1_branch=3.2.x
bamboo_planRepository_1_branchDisplayName=3.2.x
bamboo_repository_revision_number=877760ef9805be8b431c2fe43ef6ab38c07ec02d
bamboo_resultsUrl=https://bamboo.phpbb.com/browse/PHPBB3-DD32-JOB1-294
bamboo_repository_75956229_previous_revision_number=521760aeb73d2801e22665a45ea0aace8741b61d
bamboo_capability_system_builder_command_Git=/usr/bin/git
bamboo_planRepository_1_name=phpBB Rhea
bamboo_build_working_directory=/home/bamboo/xml-data/build-dir/PHPBB3-DD32-JOB1
bamboo_buildKey=PHPBB3-DD32-JOB1
bamboo_capability_phpbb_tests=true
bamboo_shortPlanName=Development Docker 3.2
bamboo_repository_75956229_git_username=bantu
bamboo_capability_system_builder_command_fop=/usr/bin/fop
bamboo_capability_dbms_sqlite_2=true
bamboo_planRepository_name=phpBB Rhea
bamboo_buildNumber=294
bamboo_capability_system_builder_phpunit_PHPUnit=/usr/bin/phpunit
bamboo_shortJobName=PHP 5.6 - SQLite
bamboo_buildResultsUrl=https://bamboo.phpbb.com/browse/PHPBB3-DD32-JOB1-294
bamboo_repository_75956229_git_branch=3.2.x
bamboo_planRepository_repositoryUrl=https://github.com/phpbb/phpbb.git
bamboo_agentId=131073
bamboo_planName=phpBB3 - Development Docker 3.2
bamboo_repository_75956229_branch_name=3.2.x
bamboo_shortPlanKey=DD32
bamboo_repository_75956229_revision_number=877760ef9805be8b431c2fe43ef6ab38c07ec02d
bamboo_repository_75956229_name=phpBB Rhea
bamboo_shortJobKey=JOB1
bamboo_capability_dbms_mysql_55=true
bamboo_capability_system_jdk_JDK_1_7_0_65=/usr/lib/jvm/java-7-openjdk-amd64
bamboo_planRepository_revision=877760ef9805be8b431c2fe43ef6ab38c07ec02d
bamboo_repository_previous_revision_number=521760aeb73d2801e22665a45ea0aace8741b61d
bamboo_buildTimeStamp=2017-05-02T17:27:15.328Z
bamboo_planRepository_previousRevision=521760aeb73d2801e22665a45ea0aace8741b61d
bamboo_capability_system_builder_mvn2_Maven_2=/usr/share/maven2
bamboo_capability_system_jdk_JDK_1_6_0_16=/usr/lib/jvm/java-6-sun-1.6.0.16
bamboo_buildResultKey=PHPBB3-DD32-JOB1-294
bamboo_repository_git_branch=3.2.x
bamboo_repository_branch_name=3.2.x
bamboo_buildPlanName=phpBB3 - Development Docker 3.2 - PHP 5.6 - SQLite
bamboo_planRepository_1_revision=877760ef9805be8b431c2fe43ef6ab38c07ec02d
bamboo_build_commandline_com_atlassian_bamboo_plugins_bamboo_docker_plugin_task_docker_cli_3=/usr/bin/docker build --force-rm=true --tag=phpbb:php-5.6 /home/bamboo/xml-data/build-dir/PHPBB3-DD32-JOB1
bamboo_repository_name=phpBB Rhea
bamboo_repository_75956229_git_repositoryUrl=https://github.com/phpbb/phpbb.git
bamboo_capability_system_docker_executable=/usr/bin/docker
bamboo_planRepository_branch=3.2.x
bamboo_agentWorkingDirectory=/home/bamboo/xml-data/build-dir
bamboo_capability_system_git_executable=/usr/bin/git
bamboo_planRepository_1_previousRevision=521760aeb73d2801e22665a45ea0aace8741b61d
bamboo_capability_system_builder_phpunit_PHPUnit_3_4=/usr/bin/phpunit
bamboo_repository_git_username=bantu
bamboo_planRepository_branchDisplayName=3.2.x
bamboo_planRepository_1_type=gitv2
bamboo_planRepository_branchName=3.2.x
bamboo_capability_system_jdk_JDK=/usr/lib/jvm/java-6-sun
bamboo_plan_storageTag=PHPBB3-DD32
bamboo_planRepository_type=gitv2
bamboo_planRepository_1_username=bantu
bamboo_repository_git_repositoryUrl=https://github.com/phpbb/phpbb.git
bamboo_capability_system_builder_ant_Ant=/usr/share/ant
bamboo_working_directory=/home/bamboo/xml-data/build-dir/PHPBB3-DD32-JOB1
bamboo_planKey=PHPBB3-DD32
bamboo_planRepository_1_repositoryUrl=https://github.com/phpbb/phpbb.git
bamboo_planRepository_username=bantu
bamboo_capability_local=true
bamboo_capability_system_jdk_JDK_1_6=/usr/lib/jvm/java-6-sun
bamboo_capability_system_jdk_JDK_1_7=/usr/lib/jvm/java-7-openjdk-amd64
bamboo_planRepository_1_branchName=3.2.x
02-May-2017 17:27:20 You are running composer with xdebug enabled. This has a major impact on runtime performance. See https://getcomposer.org/xdebug
02-May-2017 17:27:20 You are using the deprecated option "dev". Dev packages are installed by default now.
02-May-2017 17:27:20 Cannot create cache directory /.composer/cache/repo/https---packagist.org/, or directory is not writable. Proceeding without cache
02-May-2017 17:27:20 Cannot create cache directory /.composer/cache/files/, or directory is not writable. Proceeding without cache
02-May-2017 17:27:20 Loading composer repositories with package information
02-May-2017 17:27:20 Installing dependencies (including require-dev) from lock file
02-May-2017 17:27:20   - Installing bantu/ini-get-wrapper (v1.0.1)
02-May-2017 17:27:32     Downloading: Connecting...    Downloading: 100%         
02-May-2017 17:27:45     Downloading: Connecting...    Downloading: 100%         
02-May-2017 17:27:57     Downloading: Connecting...    Downloading: 100%         
02-May-2017 17:27:57     Failed to download bantu/ini-get-wrapper from dist: The "https://api.github.com/repos/bantuXorg/php-ini-get-wrapper/zipball/4770c7feab370c62e23db4f31c112b7c6d90aee2" file could not be downloaded: php_network_getaddresses: getaddrinfo failed: Name or service not known
02-May-2017 17:27:57 failed to open stream: php_network_getaddresses: getaddrinfo failed: Name or service not known
02-May-2017 17:27:57     Now trying to download from source
02-May-2017 17:27:57   - Installing bantu/ini-get-wrapper (v1.0.1)
02-May-2017 17:27:57     Cloning 4770c7feab370c62e23db4f31c112b7c6d90aee2
02-May-2017 17:28:10
02-May-2017 17:28:10                                                                                                                          
02-May-2017 17:28:10   [RuntimeException]                                                                                                     
02-May-2017 17:28:10   Failed to clone https://github.com/bantuXorg/php-ini-get-wrapper.git via https, ssh protocols, aborting.               
02-May-2017 17:28:10   - https://github.com/bantuXorg/php-ini-get-wrapper.git                                                                 
02-May-2017 17:28:10     Cloning into '/data/phpBB/vendor/bantu/ini-get-wrapper'...                                                           
02-May-2017 17:28:10     fatal: unable to access 'https://github.com/bantuXorg/php-ini-get-wrapper.git/': Could not resolve host: github.com 
02-May-2017 17:28:10   - git@github.com:bantuXorg/php-ini-get-wrapper.git                                                                     
02-May-2017 17:28:10     Cloning into '/data/phpBB/vendor/bantu/ini-get-wrapper'...                                                           
02-May-2017 17:28:10     No user exists for uid 991                                                                                           
02-May-2017 17:28:10     fatal: Could not read from remote repository.                                                                       
02-May-2017 17:28:10                                                                                                                          
02-May-2017 17:28:10     Please make sure you have the correct access rights                                                                 
02-May-2017 17:28:10     and the repository exists.                                                                                           
02-May-2017 17:28:10                                                                                                                          
02-May-2017 17:28:10
02-May-2017 17:28:10 install [--prefer-source] [--prefer-dist] [--dry-run] [--dev] [--no-dev] [--no-plugins] [--no-custom-installers] [--no-autoloader] [--no-scripts] [--no-progress] [-v|vv|vvv|--verbose] [-o|--optimize-autoloader] [-a|--classmap-authoritative] [--ignore-platform-reqs] [--] [<packages>]...
02-May-2017 17:28:10
02-May-2017 17:28:10 /bin/bash: ../phpBB/vendor/bin/phing: No such file or directory
02-May-2017 17:28:10 Failing task since return code of [/usr/bin/docker run --volume /home/bamboo/xml-data/build-dir/PHPBB3-DD32-JOB1:/data --workdir /data/phpBB --rm -u=991 -t phpbb:php-5.6 /bin/bash -c php ../composer.phar install --dev; cd ../build; ../phpBB/vendor/bin/phing build] was 127 while expected 0
02-May-2017 17:28:10 Error occurred while running Task 'Run tests(2)' of type com.atlassian.bamboo.plugins.bamboo-docker-plugin:task.docker.cli.
02-May-2017 17:28:10 com.atlassian.bamboo.task.TaskException: Failed to execute task
02-May-2017 17:28:10         at com.atlassian.bamboo.plugins.docker.service.RunService.execute(RunService.java:71)
02-May-2017 17:28:10         at com.atlassian.bamboo.plugins.docker.tasks.cli.DockerCliTask.execute(DockerCliTask.java:60)
02-May-2017 17:28:10         at com.atlassian.bamboo.task.TaskExecutorImpl.lambda$executeTasks$3(TaskExecutorImpl.java:317)
02-May-2017 17:28:10         at com.atlassian.bamboo.task.TaskExecutorImpl.executeTaskWithPrePostActions(TaskExecutorImpl.java:246)
02-May-2017 17:28:10         at com.atlassian.bamboo.task.TaskExecutorImpl.executeTasks(TaskExecutorImpl.java:317)
02-May-2017 17:28:10         at com.atlassian.bamboo.task.TaskExecutorImpl.execute(TaskExecutorImpl.java:118)
02-May-2017 17:28:10         at com.atlassian.bamboo.build.pipeline.tasks.ExecuteBuildTask.call(ExecuteBuildTask.java:74)
02-May-2017 17:28:10         at com.atlassian.bamboo.v2.build.agent.DefaultBuildAgent.build(DefaultBuildAgent.java:216)
02-May-2017 17:28:10         at com.atlassian.bamboo.v2.build.agent.BuildAgentControllerImpl$1.call(BuildAgentControllerImpl.java:139)
02-May-2017 17:28:10         at com.atlassian.bamboo.v2.build.agent.BuildAgentControllerImpl$1.call(BuildAgentControllerImpl.java:130)
02-May-2017 17:28:10         at com.atlassian.bamboo.variable.CustomVariableContextImpl.withVariableSubstitutor(CustomVariableContextImpl.java:221)
02-May-2017 17:28:10         at com.atlassian.bamboo.v2.build.agent.BuildAgentControllerImpl.waitAndPerformBuild(BuildAgentControllerImpl.java:129)
02-May-2017 17:28:10         at com.atlassian.bamboo.v2.build.agent.DefaultBuildAgent$1.run(DefaultBuildAgent.java:138)
02-May-2017 17:28:10         at com.atlassian.bamboo.utils.BambooRunnables$1.run(BambooRunnables.java:51)
02-May-2017 17:28:10         at com.atlassian.bamboo.security.ImpersonationHelper.runWith(ImpersonationHelper.java:31)
02-May-2017 17:28:10         at com.atlassian.bamboo.security.ImpersonationHelper.runWithSystemAuthority(ImpersonationHelper.java:20)
02-May-2017 17:28:10         at com.atlassian.bamboo.security.ImpersonationHelper$1.run(ImpersonationHelper.java:52)
02-May-2017 17:28:10         at java.lang.Thread.run(Thread.java:745)
02-May-2017 17:28:10 Caused by: com.atlassian.bamboo.plugins.docker.client.DockerException: Error running Docker run command
02-May-2017 17:28:10         at com.atlassian.bamboo.plugins.docker.client.DockerCmd.run(DockerCmd.java:103)
02-May-2017 17:28:10         at com.atlassian.bamboo.plugins.docker.service.RunService.execute(RunService.java:60)
02-May-2017 17:28:10         ... 17 more
02-May-2017 17:28:10 Caused by: com.atlassian.utils.process.ProcessException: Error executing /usr/bin/docker run --volume /home/bamboo/xml-data/build-dir/PHPBB3-DD32-JOB1:/data --workdir /data/phpBB --rm -u=991 -t phpbb:php-5.6 /bin/bash -c "php ../composer.phar install --dev; cd ../build; ../phpBB/vendor/bin/phing build"
02-May-2017 17:28:10         at com.atlassian.bamboo.plugins.docker.process.DockerTaskProcessService.execute(DockerTaskProcessService.java:60)
02-May-2017 17:28:10         at com.atlassian.bamboo.plugins.docker.client.DockerCmd.run(DockerCmd.java:99)
02-May-2017 17:28:10         ... 18 more
02-May-2017 17:28:10 Starting task 'Parsing test results' of type 'com.atlassian.bamboo.plugins.testresultparser:task.testresultparser.junit'
02-May-2017 17:28:10 Parsing test results under /home/bamboo/xml-data/build-dir/PHPBB3-DD32-JOB1...
02-May-2017 17:28:10 Failing task since test cases were expected but none were found.
02-May-2017 17:28:10 Finished task 'Parsing test results' with result: Failed
02-May-2017 17:28:10 Running post build plugin 'NCover Results Collector'
02-May-2017 17:28:10 Running post build plugin 'Artifact Copier'
02-May-2017 17:28:10 Publishing an artifact: Coverage HTML Report
02-May-2017 17:28:10 Unable to publish artifact [Coverage HTML Report]: the source directory /home/bamboo/xml-data/build-dir/PHPBB3-DD32-JOB1/build/coverage does not exist.
02-May-2017 17:28:10 The artifact hasn't been successfully published after 228.2 μs
02-May-2017 17:28:10 Running post build plugin 'npm Cache Cleanup'
02-May-2017 17:28:10 Running post build plugin 'Clover Results Collector'
02-May-2017 17:28:10 Running post build plugin 'Docker Container Cleanup'
02-May-2017 17:28:10 Successfully removed working directory at '/home/bamboo/xml-data/build-dir/PHPBB3-DD32-JOB1'
02-May-2017 17:28:10 Finalising the build...
02-May-2017 17:28:10 Stopping timer.
02-May-2017 17:28:10 Build PHPBB3-DD32-JOB1-294 completed.
02-May-2017 17:28:10 Running on server: post build plugin 'NCover Results Collector'
02-May-2017 17:28:10 Running on server: post build plugin 'Build Hanging Detection Configuration'
02-May-2017 17:28:10 Running on server: post build plugin 'Clover Delta Calculator'
02-May-2017 17:28:10 Running on server: post build plugin 'Maven Dependencies Postprocessor'
02-May-2017 17:28:10 All post build plugins have finished
02-May-2017 17:28:10 Generating build results summary...
02-May-2017 17:28:10 Saving build results to disk...
02-May-2017 17:28:10 Logging substituted variables...
02-May-2017 17:28:10 Indexing build results...
02-May-2017 17:28:10 Finished building PHPBB3-DD32-JOB1-294.
02-May-2017 17:57:28 Build phpBB3 - Development Docker 3.2 - PHP 5.6 - SQLite #294 (PHPBB3-DD32-JOB1-294) started building on agent Default Agent
02-May-2017 17:57:28
02-May-2017 17:57:28 Build working directory is /home/bamboo/xml-data/build-dir/PHPBB3-DD32-JOB1
02-May-2017 17:57:28 Executing build phpBB3 - Development Docker 3.2 - PHP 5.6 - SQLite #294 (PHPBB3-DD32-JOB1-294)
02-May-2017 17:57:28 Starting task 'Checkout Default Repository' of type 'com.atlassian.bamboo.plugins.vcs:task.vcs.checkout'
02-May-2017 17:57:28 Updating source code to revision: 877760ef9805be8b431c2fe43ef6ab38c07ec02d
02-May-2017 17:57:29 Fetching 'refs/heads/3.2.x' from 'https://github.com/phpbb/phpbb.git'.
02-May-2017 17:57:29 Checking out revision 877760ef9805be8b431c2fe43ef6ab38c07ec02d.
02-May-2017 17:57:29 Creating local git repository in '/home/bamboo/xml-data/build-dir/PHPBB3-DD32-JOB1/.git'.
02-May-2017 17:57:29 Cloning into '/home/bamboo/xml-data/build-dir/PHPBB3-DD32-JOB1'...
02-May-2017 17:57:29 done.
02-May-2017 17:57:31 Switched to a new branch '3.2.x'
02-May-2017 17:57:31 Branch 3.2.x set up to track remote branch 3.2.x from origin.
02-May-2017 17:57:31 Updated source code to revision: 877760ef9805be8b431c2fe43ef6ab38c07ec02d
02-May-2017 17:57:31 Finished task 'Checkout Default Repository' with result: Success
02-May-2017 17:57:31 Running pre-build action: VCS Version Collector
02-May-2017 17:57:31
Substituting variable: ${bamboo.working.directory} with /home/bamboo/xml-data/build-dir/PHPBB3-DD32-JOB1
02-May-2017 17:57:31 Starting task 'Build image' of type 'com.atlassian.bamboo.plugins.bamboo-docker-plugin:task.docker.cli'
02-May-2017 17:57:31
Beginning to execute external process for build 'phpBB3 - Development Docker 3.2 - PHP 5.6 - SQLite #294 (PHPBB3-DD32-JOB1-294)'
... running command line:
/usr/bin/docker build --force-rm=true --tag=phpbb:php-5.6 /home/bamboo/xml-data/build-dir/PHPBB3-DD32-JOB1
... in: /home/bamboo/xml-data/build-dir/PHPBB3-DD32-JOB1
... using extra environment variables:
bamboo_planRepository_1_branch=3.2.x
bamboo_planRepository_1_branchDisplayName=3.2.x
bamboo_repository_revision_number=877760ef9805be8b431c2fe43ef6ab38c07ec02d
bamboo_resultsUrl=https://bamboo.phpbb.com/browse/PHPBB3-DD32-JOB1-294
bamboo_repository_75956229_previous_revision_number=521760aeb73d2801e22665a45ea0aace8741b61d
bamboo_capability_system_builder_command_Git=/usr/bin/git
bamboo_planRepository_1_name=phpBB Rhea
bamboo_build_working_directory=/home/bamboo/xml-data/build-dir/PHPBB3-DD32-JOB1
bamboo_buildKey=PHPBB3-DD32-JOB1
bamboo_capability_phpbb_tests=true
bamboo_shortPlanName=Development Docker 3.2
bamboo_repository_75956229_git_username=bantu
bamboo_capability_system_builder_command_fop=/usr/bin/fop
bamboo_capability_dbms_sqlite_2=true
bamboo_planRepository_name=phpBB Rhea
bamboo_buildNumber=294
bamboo_capability_system_builder_phpunit_PHPUnit=/usr/bin/phpunit
bamboo_shortJobName=PHP 5.6 - SQLite
bamboo_buildResultsUrl=https://bamboo.phpbb.com/browse/PHPBB3-DD32-JOB1-294
bamboo_repository_75956229_git_branch=3.2.x
bamboo_planRepository_repositoryUrl=https://github.com/phpbb/phpbb.git
bamboo_agentId=131073
bamboo_planName=phpBB3 - Development Docker 3.2
bamboo_repository_75956229_branch_name=3.2.x
bamboo_shortPlanKey=DD32
bamboo_repository_75956229_revision_number=877760ef9805be8b431c2fe43ef6ab38c07ec02d
bamboo_repository_75956229_name=phpBB Rhea
bamboo_shortJobKey=JOB1
bamboo_capability_dbms_mysql_55=true
bamboo_capability_system_jdk_JDK_1_7_0_65=/usr/lib/jvm/java-7-openjdk-amd64
bamboo_planRepository_revision=877760ef9805be8b431c2fe43ef6ab38c07ec02d
bamboo_repository_previous_revision_number=521760aeb73d2801e22665a45ea0aace8741b61d
bamboo_buildTimeStamp=2017-05-02T17:39:37.256Z
bamboo_capability_system_builder_mvn2_Maven_2=/usr/share/maven2
bamboo_capability_system_jdk_JDK_1_6_0_16=/usr/lib/jvm/java-6-sun-1.6.0.16
bamboo_planRepository_previousRevision=521760aeb73d2801e22665a45ea0aace8741b61d
bamboo_buildResultKey=PHPBB3-DD32-JOB1-294
bamboo_repository_git_branch=3.2.x
bamboo_repository_branch_name=3.2.x
bamboo_buildPlanName=phpBB3 - Development Docker 3.2 - PHP 5.6 - SQLite
bamboo_build_commandline_com_atlassian_bamboo_plugins_bamboo_docker_plugin_task_docker_cli_2=/usr/bin/docker run --volume /home/bamboo/xml-data/build-dir/PHPBB3-DD32-JOB1:/data --workdir /data/phpBB --rm -u=991 -t phpbb:php-5.6 /bin/bash -c php ../composer.phar install --dev; cd ../build; ../phpBB/vendor/bin/phing build
bamboo_planRepository_1_revision=877760ef9805be8b431c2fe43ef6ab38c07ec02d
bamboo_build_commandline_com_atlassian_bamboo_plugins_bamboo_docker_plugin_task_docker_cli_3=/usr/bin/docker build --force-rm=true --tag=phpbb:php-5.6 /home/bamboo/xml-data/build-dir/PHPBB3-DD32-JOB1
bamboo_repository_name=phpBB Rhea
bamboo_repository_75956229_git_repositoryUrl=https://github.com/phpbb/phpbb.git
bamboo_capability_system_docker_executable=/usr/bin/docker
bamboo_planRepository_branch=3.2.x
bamboo_agentWorkingDirectory=/home/bamboo/xml-data/build-dir
bamboo_capability_system_git_executable=/usr/bin/git
bamboo_capability_system_builder_phpunit_PHPUnit_3_4=/usr/bin/phpunit
bamboo_repository_git_username=bantu
bamboo_planRepository_1_previousRevision=521760aeb73d2801e22665a45ea0aace8741b61d
bamboo_planRepository_branchDisplayName=3.2.x
bamboo_planRepository_1_type=gitv2
bamboo_planRepository_branchName=3.2.x
bamboo_capability_system_jdk_JDK=/usr/lib/jvm/java-6-sun
bamboo_plan_storageTag=PHPBB3-DD32
bamboo_planRepository_type=gitv2
bamboo_planRepository_1_username=bantu
bamboo_repository_git_repositoryUrl=https://github.com/phpbb/phpbb.git
bamboo_capability_system_builder_ant_Ant=/usr/share/ant
bamboo_working_directory=/home/bamboo/xml-data/build-dir/PHPBB3-DD32-JOB1
bamboo_planKey=PHPBB3-DD32
bamboo_planRepository_1_repositoryUrl=https://github.com/phpbb/phpbb.git
bamboo_planRepository_username=bantu
bamboo_capability_local=true
bamboo_capability_system_jdk_JDK_1_6=/usr/lib/jvm/java-6-sun
bamboo_capability_system_jdk_JDK_1_7=/usr/lib/jvm/java-7-openjdk-amd64
bamboo_planRepository_1_branchName=3.2.x
02-May-2017 17:57:32 Sending build context to Docker daemon 19.08 MB
02-May-2017 17:57:32
02-May-2017 17:57:32 Step 1/5 : FROM php:5.6
02-May-2017 17:57:32 ---> 9054a11bc5cd
02-May-2017 17:57:32 Step 2/5 : RUN apt-get update && apt-get install -y         git         zlib1g-dev         bzip2         zip         && docker-php-ext-install -j$(nproc) zip
02-May-2017 17:57:32 ---> Using cache
02-May-2017 17:57:32 ---> e37d9a254ed4
02-May-2017 17:57:32 Step 3/5 : RUN pecl install xdebug
02-May-2017 17:57:32 ---> Using cache
02-May-2017 17:57:32 ---> 79bed6e2a1f0
02-May-2017 17:57:32 Step 4/5 : RUN docker-php-ext-enable xdebug
02-May-2017 17:57:32 ---> Using cache
02-May-2017 17:57:32 ---> ab9dca892257
02-May-2017 17:57:32 Step 5/5 : RUN echo "memory_limit = 1024M" >> /usr/local/etc/php/conf.d/memory.ini
02-May-2017 17:57:32 ---> Using cache
02-May-2017 17:57:32 ---> d7496cc92d91
02-May-2017 17:57:32 Successfully built d7496cc92d91
02-May-2017 17:57:33 Built Docker image 'phpbb:php-5.6'
02-May-2017 17:57:33 Finished task 'Build image' with result: Success
02-May-2017 17:57:33
Substituting variable: ${bamboo.working.directory} with /home/bamboo/xml-data/build-dir/PHPBB3-DD32-JOB1
02-May-2017 17:57:33 Starting task 'Run tests' of type 'com.atlassian.bamboo.plugins.bamboo-docker-plugin:task.docker.cli'
02-May-2017 17:57:33 Running image name (phpbb:php-5.6)
02-May-2017 17:57:33
Beginning to execute external process for build 'phpBB3 - Development Docker 3.2 - PHP 5.6 - SQLite #294 (PHPBB3-DD32-JOB1-294)'
... running command line:
/usr/bin/docker run --volume /home/bamboo/xml-data/build-dir/PHPBB3-DD32-JOB1:/data --workdir /data/phpBB --rm -u=991 -t phpbb:php-5.6 /bin/bash -c php ../composer.phar install --dev; cd ../build; ../phpBB/vendor/bin/phing build
... in: /home/bamboo/xml-data/build-dir/PHPBB3-DD32-JOB1
... using extra environment variables:
bamboo_planRepository_1_branch=3.2.x
bamboo_planRepository_1_branchDisplayName=3.2.x
bamboo_repository_revision_number=877760ef9805be8b431c2fe43ef6ab38c07ec02d
bamboo_resultsUrl=https://bamboo.phpbb.com/browse/PHPBB3-DD32-JOB1-294
bamboo_repository_75956229_previous_revision_number=521760aeb73d2801e22665a45ea0aace8741b61d
bamboo_capability_system_builder_command_Git=/usr/bin/git
bamboo_planRepository_1_name=phpBB Rhea
bamboo_build_working_directory=/home/bamboo/xml-data/build-dir/PHPBB3-DD32-JOB1
bamboo_buildKey=PHPBB3-DD32-JOB1
bamboo_capability_phpbb_tests=true
bamboo_shortPlanName=Development Docker 3.2
bamboo_repository_75956229_git_username=bantu
bamboo_capability_system_builder_command_fop=/usr/bin/fop
bamboo_capability_dbms_sqlite_2=true
bamboo_planRepository_name=phpBB Rhea
bamboo_buildNumber=294
bamboo_capability_system_builder_phpunit_PHPUnit=/usr/bin/phpunit
bamboo_shortJobName=PHP 5.6 - SQLite
bamboo_buildResultsUrl=https://bamboo.phpbb.com/browse/PHPBB3-DD32-JOB1-294
bamboo_repository_75956229_git_branch=3.2.x
bamboo_planRepository_repositoryUrl=https://github.com/phpbb/phpbb.git
bamboo_agentId=131073
bamboo_planName=phpBB3 - Development Docker 3.2
bamboo_repository_75956229_branch_name=3.2.x
bamboo_shortPlanKey=DD32
bamboo_repository_75956229_revision_number=877760ef9805be8b431c2fe43ef6ab38c07ec02d
bamboo_repository_75956229_name=phpBB Rhea
bamboo_shortJobKey=JOB1
bamboo_capability_dbms_mysql_55=true
bamboo_capability_system_jdk_JDK_1_7_0_65=/usr/lib/jvm/java-7-openjdk-amd64
bamboo_planRepository_revision=877760ef9805be8b431c2fe43ef6ab38c07ec02d
bamboo_repository_previous_revision_number=521760aeb73d2801e22665a45ea0aace8741b61d
bamboo_buildTimeStamp=2017-05-02T17:39:37.256Z
bamboo_capability_system_builder_mvn2_Maven_2=/usr/share/maven2
bamboo_capability_system_jdk_JDK_1_6_0_16=/usr/lib/jvm/java-6-sun-1.6.0.16
bamboo_planRepository_previousRevision=521760aeb73d2801e22665a45ea0aace8741b61d
bamboo_buildResultKey=PHPBB3-DD32-JOB1-294
bamboo_repository_git_branch=3.2.x
bamboo_repository_branch_name=3.2.x
bamboo_buildPlanName=phpBB3 - Development Docker 3.2 - PHP 5.6 - SQLite
bamboo_build_commandline_com_atlassian_bamboo_plugins_bamboo_docker_plugin_task_docker_cli_2=/usr/bin/docker run --volume /home/bamboo/xml-data/build-dir/PHPBB3-DD32-JOB1:/data --workdir /data/phpBB --rm -u=991 -t phpbb:php-5.6 /bin/bash -c php ../composer.phar install --dev; cd ../build; ../phpBB/vendor/bin/phing build
bamboo_planRepository_1_revision=877760ef9805be8b431c2fe43ef6ab38c07ec02d
bamboo_build_commandline_com_atlassian_bamboo_plugins_bamboo_docker_plugin_task_docker_cli_3=/usr/bin/docker build --force-rm=true --tag=phpbb:php-5.6 /home/bamboo/xml-data/build-dir/PHPBB3-DD32-JOB1
bamboo_repository_name=phpBB Rhea
bamboo_repository_75956229_git_repositoryUrl=https://github.com/phpbb/phpbb.git
bamboo_capability_system_docker_executable=/usr/bin/docker
bamboo_planRepository_branch=3.2.x
bamboo_agentWorkingDirectory=/home/bamboo/xml-data/build-dir
bamboo_capability_system_git_executable=/usr/bin/git
bamboo_capability_system_builder_phpunit_PHPUnit_3_4=/usr/bin/phpunit
bamboo_repository_git_username=bantu
bamboo_planRepository_1_previousRevision=521760aeb73d2801e22665a45ea0aace8741b61d
bamboo_planRepository_branchDisplayName=3.2.x
bamboo_planRepository_1_type=gitv2
bamboo_planRepository_branchName=3.2.x
bamboo_capability_system_jdk_JDK=/usr/lib/jvm/java-6-sun
bamboo_plan_storageTag=PHPBB3-DD32
bamboo_planRepository_type=gitv2
bamboo_planRepository_1_username=bantu
bamboo_repository_git_repositoryUrl=https://github.com/phpbb/phpbb.git
bamboo_capability_system_builder_ant_Ant=/usr/share/ant
bamboo_working_directory=/home/bamboo/xml-data/build-dir/PHPBB3-DD32-JOB1
bamboo_planKey=PHPBB3-DD32
bamboo_planRepository_1_repositoryUrl=https://github.com/phpbb/phpbb.git
bamboo_planRepository_username=bantu
bamboo_capability_local=true
bamboo_capability_system_jdk_JDK_1_6=/usr/lib/jvm/java-6-sun
bamboo_capability_system_jdk_JDK_1_7=/usr/lib/jvm/java-7-openjdk-amd64
bamboo_planRepository_1_branchName=3.2.x
02-May-2017 17:57:33 You are running composer with xdebug enabled. This has a major impact on runtime performance. See https://getcomposer.org/xdebug
02-May-2017 17:57:33 You are using the deprecated option "dev". Dev packages are installed by default now.
02-May-2017 17:57:33 Cannot create cache directory /.composer/cache/repo/https---packagist.org/, or directory is not writable. Proceeding without cache
02-May-2017 17:57:33 Cannot create cache directory /.composer/cache/files/, or directory is not writable. Proceeding without cache
02-May-2017 17:57:33 Loading composer repositories with package information
02-May-2017 17:57:33 Installing dependencies (including require-dev) from lock file
02-May-2017 17:57:33   - Installing bantu/ini-get-wrapper (v1.0.1)
02-May-2017 17:57:36     Downloading: Connecting...    Downloading: 0%               Downloading: 100%    Downloading: 100%
02-May-2017 17:57:36
02-May-2017 17:57:36   - Installing google/recaptcha (1.1.2)
02-May-2017 17:57:37     Downloading: Connecting...    Downloading: 0%               Downloading: 30%    Downloading: 55%    Downloading: 60%    Downloading: 85%    Downloading: 90%    Downloading: 100%    Downloading: 100%
02-May-2017 17:57:37
02-May-2017 17:57:37   - Installing react/promise (v2.4.1)
02-May-2017 17:57:38     Downloading: Connecting...    Downloading: 0%               Downloading: 15%    Downloading: 30%    Downloading: 50%    Downloading: 65%    Downloading: 80%    Downloading: 95%    Downloading: 100%
02-May-2017 17:57:38
02-May-2017 17:57:38   - Installing guzzlehttp/streams (3.0.0)
02-May-2017 17:57:39     Downloading: Connecting...    Downloading: 0%               Downloading: 25%    Downloading: 35%    Downloading: 45%    Downloading: 55%    Downloading: 90%    Downloading: 100%    Downloading: 100%
02-May-2017 17:57:39
02-May-2017 17:57:39   - Installing guzzlehttp/ringphp (1.1.0)
02-May-2017 17:57:41     Downloading: Connecting...    Downloading: 0%               Downloading: 10%    Downloading: 15%    Downloading: 25%    Downloading: 35%    Downloading: 45%    Downloading: 50%    Downloading: 60%    Downloading: 70%    Downloading: 75%    Downloading: 85%    Downloading: 95%    Downloading: 100%
02-May-2017 17:57:41
02-May-2017 17:57:41   - Installing lusitanian/oauth (v0.8.10)
02-May-2017 17:57:42     Downloading: Connecting...    Downloading: 0%               Downloading: 5%    Downloading: 15%    Downloading: 20%    Downloading: 25%    Downloading: 30%    Downloading: 35%    Downloading: 40%    Downloading: 45%    Downloading: 50%    Downloading: 55%    Downloading: 60%    Downloading: 65%    Downloading: 70%    Downloading: 75%    Downloading: 80%    Downloading: 85%    Downloading: 90%    Downloading: 95%    Downloading: 100%
02-May-2017 17:57:42
02-May-2017 17:57:42   - Installing marc1706/fast-image-size (v1.1.3)
02-May-2017 17:57:43     Downloading: Connecting...    Downloading: 0%               Downloading: 20%    Downloading: 40%    Downloading: 60%    Downloading: 80%    Downloading: 100%    Downloading: 100%
02-May-2017 17:57:43
02-May-2017 17:57:43   - Installing paragonie/random_compat (v1.4.1)
02-May-2017 17:57:44     Downloading: Connecting...    Downloading: 0%               Downloading: 20%    Downloading: 35%    Downloading: 50%    Downloading: 70%    Downloading: 90%    Downloading: 100%
02-May-2017 17:57:44
02-May-2017 17:57:44   - Installing patchwork/utf8 (v1.3.1)
02-May-2017 17:57:45     Downloading: Connecting...    Downloading: 0%               Downloading: 5%    Downloading: 10%    Downloading: 15%    Downloading: 20%    Downloading: 25%    Downloading: 30%    Downloading: 35%    Downloading: 40%    Downloading: 45%    Downloading: 50%    Downloading: 55%    Downloading: 60%    Downloading: 65%    Downloading: 70%    Downloading: 75%    Downloading: 80%    Downloading: 85%    Downloading: 90%    Downloading: 95%    Downloading: 100%    Downloading: 100%
02-May-2017 17:57:45
02-May-2017 17:57:45   - Installing s9e/text-formatter (0.9.1)
02-May-2017 17:57:47     Downloading: Connecting...    Downloading: 0%               Downloading: 5%    Downloading: 10%    Downloading: 15%    Downloading: 20%    Downloading: 25%    Downloading: 30%    Downloading: 35%    Downloading: 40%    Downloading: 45%    Downloading: 50%    Downloading: 55%    Downloading: 60%    Downloading: 65%    Downloading: 70%    Downloading: 75%    Downloading: 90%    Downloading: 95%    Downloading: 100%    Downloading: 100%
02-May-2017 17:57:47
02-May-2017 17:57:47   - Installing symfony/filesystem (v2.8.14)
02-May-2017 17:57:48     Downloading: Connecting...    Downloading: 0%               Downloading: 55%    Downloading: 100%
02-May-2017 17:57:48
02-May-2017 17:57:48   - Installing symfony/config (v2.8.14)
02-May-2017 17:57:49     Downloading: Connecting...    Downloading: 0%               Downloading: 5%    Downloading: 10%    Downloading: 15%    Downloading: 20%    Downloading: 25%    Downloading: 30%    Downloading: 35%    Downloading: 40%    Downloading: 45%    Downloading: 50%    Downloading: 55%    Downloading: 60%    Downloading: 65%    Downloading: 70%    Downloading: 75%    Downloading: 80%    Downloading: 85%    Downloading: 90%    Downloading: 100%    Downloading: 100%
02-May-2017 17:57:49
02-May-2017 17:57:49   - Installing ircmaxell/password-compat (v1.0.4)
02-May-2017 17:57:50     Downloading: Connecting...    Downloading: 0%               Downloading: 100%
02-May-2017 17:57:50
02-May-2017 17:57:50   - Installing symfony/polyfill-php55 (v1.3.0)
02-May-2017 17:57:51     Downloading: Connecting...    Downloading: 0%               Downloading: 55%    Downloading: 100%    Downloading: 100%
02-May-2017 17:57:51
02-May-2017 17:57:51   - Installing symfony/polyfill-php54 (v1.3.0)
02-May-2017 17:57:52     Downloading: Connecting...    Downloading: 0%               Downloading: 45%    Downloading: 100%    Downloading: 100%
02-May-2017 17:57:52
02-May-2017 17:57:52   - Installing symfony/polyfill-mbstring (v1.3.0)
02-May-2017 17:57:53     Downloading: Connecting...    Downloading: 0%               Downloading: 35%    Downloading: 70%    Downloading: 90%    Downloading: 100%
02-May-2017 17:57:53
02-May-2017 17:57:53   - Installing symfony/http-foundation (v2.8.14)
02-May-2017 17:57:54     Downloading: Connecting...    Downloading: 0%               Downloading: 5%    Downloading: 10%    Downloading: 15%    Downloading: 20%    Downloading: 25%    Downloading: 30%    Downloading: 35%    Downloading: 40%    Downloading: 45%    Downloading: 50%    Downloading: 55%    Downloading: 60%    Downloading: 65%    Downloading: 70%    Downloading: 75%    Downloading: 80%    Downloading: 85%    Downloading: 90%    Downloading: 95%    Downloading: 100%    Downloading: 100%
02-May-2017 17:57:54
02-May-2017 17:57:54   - Installing symfony/event-dispatcher (v2.8.14)
02-May-2017 17:57:55     Downloading: Connecting...    Downloading: 0%               Downloading: 5%    Downloading: 10%    Downloading: 75%    Downloading: 80%    Downloading: 85%    Downloading: 90%    Downloading: 100%
02-May-2017 17:57:55
02-May-2017 17:57:55   - Installing psr/log (1.0.2)
02-May-2017 17:57:56     Downloading: Connecting...    Downloading: 0%               Downloading: 15%    Downloading: 100%    Downloading: 100%
02-May-2017 17:57:56
02-May-2017 17:57:56   - Installing symfony/debug (v2.8.14)
02-May-2017 17:57:57     Downloading: Connecting...    Downloading: 0%               Downloading: 20%    Downloading: 25%    Downloading: 30%    Downloading: 45%    Downloading: 50%    Downloading: 65%    Downloading: 70%    Downloading: 85%    Downloading: 90%    Downloading: 100%    Downloading: 100%
02-May-2017 17:57:57
02-May-2017 17:57:57   - Installing symfony/http-kernel (v2.8.14)
02-May-2017 17:57:59     Downloading: Connecting...    Downloading: 0%               Downloading: 5%    Downloading: 10%    Downloading: 15%    Downloading: 20%    Downloading: 25%    Downloading: 30%    Downloading: 35%    Downloading: 40%    Downloading: 45%    Downloading: 50%    Downloading: 55%    Downloading: 60%    Downloading: 65%    Downloading: 70%    Downloading: 75%    Downloading: 80%    Downloading: 85%    Downloading: 90%    Downloading: 95%    Downloading: 100%    Downloading: 100%
02-May-2017 17:57:59
02-May-2017 17:57:59   - Installing symfony/dependency-injection (v2.8.14)
02-May-2017 17:58:00     Downloading: Connecting...    Downloading: 0%               Downloading: 5%    Downloading: 10%    Downloading: 15%    Downloading: 20%    Downloading: 25%    Downloading: 30%    Downloading: 35%    Downloading: 40%    Downloading: 45%    Downloading: 50%    Downloading: 55%    Downloading: 60%    Downloading: 65%    Downloading: 70%    Downloading: 75%    Downloading: 80%    Downloading: 85%    Downloading: 90%    Downloading: 95%    Downloading: 100%    Downloading: 100%
02-May-2017 17:58:00
02-May-2017 17:58:00   - Installing zendframework/zend-stdlib (2.5.1)
02-May-2017 17:58:01     Downloading: Connecting...    Downloading: 0%               Downloading: 10%    Downloading: 15%    Downloading: 20%    Downloading: 25%    Downloading: 35%    Downloading: 45%    Downloading: 50%    Downloading: 55%    Downloading: 60%    Downloading: 65%    Downloading: 70%    Downloading: 80%    Downloading: 85%    Downloading: 90%    Downloading: 95%    Downloading: 100%
02-May-2017 17:58:01
02-May-2017 17:58:01   - Installing zendframework/zend-eventmanager (2.5.1)
02-May-2017 17:58:03     Downloading: Connecting...    Downloading: 0%               Downloading: 25%    Downloading: 50%    Downloading: 60%    Downloading: 85%    Downloading: 100%    Downloading: 100%
02-May-2017 17:58:03
02-May-2017 17:58:03   - Installing zendframework/zend-code (2.5.1)
02-May-2017 17:58:04     Downloading: Connecting...    Downloading: 0%               Downloading: 5%    Downloading: 10%    Downloading: 15%    Downloading: 25%    Downloading: 30%    Downloading: 40%    Downloading: 45%    Downloading: 55%    Downloading: 60%    Downloading: 65%    Downloading: 70%    Downloading: 75%    Downloading: 80%    Downloading: 85%    Downloading: 90%    Downloading: 100%
02-May-2017 17:58:04
02-May-2017 17:58:04   - Installing ocramius/proxy-manager (1.0.2)
02-May-2017 17:58:06     Downloading: Connecting...    Downloading: 0%               Downloading: 5%    Downloading: 10%    Downloading: 15%    Downloading: 20%    Downloading: 25%    Downloading: 30%    Downloading: 35%    Downloading: 40%    Downloading: 45%    Downloading: 50%    Downloading: 55%    Downloading: 60%    Downloading: 65%    Downloading: 70%    Downloading: 75%    Downloading: 80%    Downloading: 85%    Downloading: 90%    Downloading: 95%    Downloading: 100%    Downloading: 100%
02-May-2017 17:58:06
02-May-2017 17:58:06   - Installing symfony/proxy-manager-bridge (v2.8.14)
02-May-2017 17:58:07     Downloading: Connecting...    Downloading: 0%               Downloading: 100%    Downloading: 100%
02-May-2017 17:58:07
02-May-2017 17:58:07   - Installing symfony/routing (v2.8.14)
02-May-2017 17:58:08     Downloading: Connecting...    Downloading: 0%               Downloading: 5%    Downloading: 10%    Downloading: 15%    Downloading: 20%    Downloading: 25%    Downloading: 30%    Downloading: 35%    Downloading: 40%    Downloading: 45%    Downloading: 50%    Downloading: 55%    Downloading: 60%    Downloading: 65%    Downloading: 70%    Downloading: 75%    Downloading: 80%    Downloading: 85%    Downloading: 90%    Downloading: 95%    Downloading: 100%    Downloading: 100%
02-May-2017 17:58:08
02-May-2017 17:58:08   - Installing twig/twig (v1.24.2)
02-May-2017 17:58:10     Downloading: Connecting...    Downloading: 0%               Downloading: 5%    Downloading: 10%    Downloading: 15%    Downloading: 20%    Downloading: 25%    Downloading: 30%    Downloading: 35%    Downloading: 40%    Downloading: 45%    Downloading: 50%    Downloading: 55%    Downloading: 60%    Downloading: 65%    Downloading: 70%    Downloading: 75%    Downloading: 80%    Downloading: 85%    Downloading: 90%    Downloading: 95%    Downloading: 100%    Downloading: 100%
02-May-2017 17:58:10
02-May-2017 17:58:10   - Installing symfony/twig-bridge (v2.8.11)
02-May-2017 17:58:11     Downloading: Connecting...    Downloading: 0%               Downloading: 10%    Downloading: 20%    Downloading: 25%    Downloading: 35%    Downloading: 45%    Downloading: 55%    Downloading: 60%    Downloading: 65%    Downloading: 70%    Downloading: 75%    Downloading: 80%    Downloading: 90%    Downloading: 100%
02-May-2017 17:58:11
02-May-2017 17:58:11   - Installing symfony/dom-crawler (v2.8.14)
02-May-2017 17:58:12     Downloading: Connecting...    Downloading: 0%               Downloading: 15%    Downloading: 35%    Downloading: 50%    Downloading: 70%    Downloading: 85%    Downloading: 100%
02-May-2017 17:58:12
02-May-2017 17:58:12   - Installing symfony/css-selector (v2.8.14)
02-May-2017 17:58:13     Downloading: Connecting...    Downloading: 0%               Downloading: 5%    Downloading: 10%    Downloading: 25%    Downloading: 30%    Downloading: 35%    Downloading: 40%    Downloading: 60%    Downloading: 65%    Downloading: 70%    Downloading: 85%    Downloading: 90%    Downloading: 95%    Downloading: 100%
02-May-2017 17:58:13
02-May-2017 17:58:13   - Installing symfony/browser-kit (v2.8.14)
02-May-2017 17:58:14     Downloading: Connecting...    Downloading: 0%               Downloading: 50%    Downloading: 80%    Downloading: 85%    Downloading: 100%    Downloading: 100%
02-May-2017 17:58:15
02-May-2017 17:58:15   - Installing guzzlehttp/guzzle (5.3.1)
02-May-2017 17:58:16     Downloading: Connecting...    Downloading: 0%               Downloading: 5%    Downloading: 10%    Downloading: 15%    Downloading: 20%    Downloading: 25%    Downloading: 30%    Downloading: 35%    Downloading: 40%    Downloading: 45%    Downloading: 50%    Downloading: 55%    Downloading: 60%    Downloading: 65%    Downloading: 70%    Downloading: 75%    Downloading: 80%    Downloading: 85%    Downloading: 90%    Downloading: 95%    Downloading: 100%    Downloading: 100%
02-May-2017 17:58:16
02-May-2017 17:58:16   - Installing fabpot/goutte (v2.0.4)
02-May-2017 17:58:17     Downloading: Connecting...    Downloading: 0%               Downloading: 15%    Downloading: 30%    Downloading: 100%    Downloading: 100%
02-May-2017 17:58:17
02-May-2017 17:58:17   - Installing facebook/webdriver (1.1.3)
02-May-2017 17:58:18     Downloading: Connecting...    Downloading: 0%               Downloading: 5%    Downloading: 10%    Downloading: 15%    Downloading: 20%    Downloading: 25%    Downloading: 30%    Downloading: 35%    Downloading: 40%    Downloading: 45%    Downloading: 50%    Downloading: 55%    Downloading: 60%    Downloading: 65%    Downloading: 70%    Downloading: 75%    Downloading: 80%    Downloading: 85%    Downloading: 90%    Downloading: 95%    Downloading: 100%    Downloading: 100%
02-May-2017 17:58:18
02-May-2017 17:58:18   - Installing symfony/process (v2.8.14)
02-May-2017 17:58:19     Downloading: Connecting...    Downloading: 0%               Downloading: 15%    Downloading: 30%    Downloading: 40%    Downloading: 65%    Downloading: 80%    Downloading: 90%    Downloading: 100%    Downloading: 100%
02-May-2017 17:58:19
02-May-2017 17:58:19   - Installing symfony/console (v2.8.14)
02-May-2017 17:58:21     Downloading: Connecting...    Downloading: 0%               Downloading: 5%    Downloading: 10%    Downloading: 15%    Downloading: 20%    Downloading: 25%    Downloading: 30%    Downloading: 35%    Downloading: 40%    Downloading: 45%    Downloading: 50%    Downloading: 55%    Downloading: 60%    Downloading: 65%    Downloading: 70%    Downloading: 75%    Downloading: 80%    Downloading: 85%    Downloading: 90%    Downloading: 95%    Downloading: 100%    Downloading: 100%
02-May-2017 17:58:21
02-May-2017 17:58:21   - Installing laravel/homestead (v2.2.2)
02-May-2017 17:58:22     Downloading: Connecting...    Downloading: 0%               Downloading: 40%    Downloading: 45%    Downloading: 100%    Downloading: 100%
02-May-2017 17:58:22
02-May-2017 17:58:22   - Installing phing/phing (2.4.14)
02-May-2017 17:58:23     Downloading: Connecting...    Downloading: 0%               Downloading: 5%    Downloading: 10%    Downloading: 15%    Downloading: 20%    Downloading: 25%    Downloading: 30%    Downloading: 35%    Downloading: 40%    Downloading: 45%    Downloading: 50%    Downloading: 55%    Downloading: 60%    Downloading: 65%    Downloading: 70%    Downloading: 75%    Downloading: 80%    Downloading: 85%    Downloading: 90%    Downloading: 95%    Downloading: 100%    Downloading: 100%
02-May-2017 17:58:24
02-May-2017 17:58:24   - Installing phpdocumentor/reflection-docblock (2.0.4)
02-May-2017 17:58:25     Downloading: Connecting...    Downloading: 0%               Downloading: 15%    Downloading: 20%    Downloading: 30%    Downloading: 35%    Downloading: 50%    Downloading: 55%    Downloading: 70%    Downloading: 85%    Downloading: 90%    Downloading: 100%
02-May-2017 17:58:25
02-May-2017 17:58:25   - Installing symfony/yaml (v2.8.14)
02-May-2017 17:58:26     Downloading: Connecting...    Downloading: 0%               Downloading: 5%    Downloading: 20%    Downloading: 25%    Downloading: 30%    Downloading: 35%    Downloading: 55%    Downloading: 60%    Downloading: 75%    Downloading: 80%    Downloading: 100%    Downloading: 100%
02-May-2017 17:58:26
02-May-2017 17:58:26   - Installing sebastian/version (1.0.6)
02-May-2017 17:58:27     Downloading: Connecting...    Downloading: 0%               Downloading: 100%    Downloading: 100%
02-May-2017 17:58:27
02-May-2017 17:58:27   - Installing sebastian/global-state (1.1.1)
02-May-2017 17:58:28     Downloading: Connecting...    Downloading: 0%               Downloading: 40%    Downloading: 50%    Downloading: 90%    Downloading: 100%
02-May-2017 17:58:28
02-May-2017 17:58:28   - Installing sebastian/recursion-context (1.0.4)
02-May-2017 17:58:29     Downloading: Connecting...    Downloading: 0%               Downloading: 100%    Downloading: 100%
02-May-2017 17:58:29
02-May-2017 17:58:29   - Installing sebastian/exporter (1.2.2)
02-May-2017 17:58:30     Downloading: Connecting...    Downloading: 0%               Downloading: 100%
02-May-2017 17:58:30
02-May-2017 17:58:30   - Installing sebastian/environment (1.3.8)
02-May-2017 17:58:31     Downloading: Connecting...    Downloading: 0%               Downloading: 15%    Downloading: 30%    Downloading: 45%    Downloading: 60%    Downloading: 75%    Downloading: 100%    Downloading: 100%
02-May-2017 17:58:31
02-May-2017 17:58:31   - Installing sebastian/diff (1.4.1)
02-May-2017 17:58:32     Downloading: Connecting...    Downloading: 0%               Downloading: 15%    Downloading: 30%    Downloading: 45%    Downloading: 100%    Downloading: 100%
02-May-2017 17:58:32
02-May-2017 17:58:32   - Installing sebastian/comparator (1.2.2)
02-May-2017 17:58:33     Downloading: Connecting...    Downloading: 0%               Downloading: 10%    Downloading: 20%    Downloading: 30%    Downloading: 40%    Downloading: 45%    Downloading: 55%    Downloading: 65%    Downloading: 75%    Downloading: 85%    Downloading: 95%    Downloading: 100%    Downloading: 100%
02-May-2017 17:58:33
02-May-2017 17:58:33   - Installing phpunit/php-text-template (1.2.1)
02-May-2017 17:58:34     Downloading: Connecting...    Downloading: 0%               Downloading: 35%    Downloading: 100%    Downloading: 100%
02-May-2017 17:58:34
02-May-2017 17:58:34   - Installing doctrine/instantiator (1.0.5)
02-May-2017 17:58:35     Downloading: Connecting...    Downloading: 0%               Downloading: 15%    Downloading: 30%    Downloading: 45%    Downloading: 50%    Downloading: 65%    Downloading: 80%    Downloading: 95%    Downloading: 100%    Downloading: 100%
02-May-2017 17:58:36
02-May-2017 17:58:36   - Installing phpunit/phpunit-mock-objects (2.3.8)
02-May-2017 17:58:37     Downloading: Connecting...    Downloading: 0%               Downloading: 5%    Downloading: 20%    Downloading: 25%    Downloading: 30%    Downloading: 45%    Downloading: 50%    Downloading: 55%    Downloading: 70%    Downloading: 75%    Downloading: 80%    Downloading: 85%    Downloading: 95%    Downloading: 100%
02-May-2017 17:58:37
02-May-2017 17:58:37   - Installing phpunit/php-timer (1.0.8)
02-May-2017 17:58:38     Downloading: Connecting...    Downloading: 0%               Downloading: 100%    Downloading: 100%
02-May-2017 17:58:38
02-May-2017 17:58:38   - Installing phpunit/php-file-iterator (1.4.2)
02-May-2017 17:58:39     Downloading: Connecting...    Downloading: 0%               Downloading: 20%    Downloading: 40%    Downloading: 60%    Downloading: 100%    Downloading: 100%
02-May-2017 17:58:39
02-May-2017 17:58:39   - Installing phpunit/php-token-stream (1.4.9)
02-May-2017 17:58:40     Downloading: Connecting...    Downloading: 0%               Downloading: 5%    Downloading: 10%    Downloading: 15%    Downloading: 20%    Downloading: 100%
02-May-2017 17:58:40
02-May-2017 17:58:40   - Installing phpunit/php-code-coverage (2.2.4)
02-May-2017 17:58:41     Downloading: Connecting...    Downloading: 0%               Downloading: 5%    Downloading: 10%    Downloading: 15%    Downloading: 20%    Downloading: 25%    Downloading: 30%    Downloading: 35%    Downloading: 40%    Downloading: 45%    Downloading: 50%    Downloading: 55%    Downloading: 60%    Downloading: 65%    Downloading: 70%    Downloading: 85%    Downloading: 90%    Downloading: 95%    Downloading: 100%    Downloading: 100%
02-May-2017 17:58:42
02-May-2017 17:58:42   - Installing phpspec/prophecy (v1.6.2)
02-May-2017 17:58:43     Downloading: Connecting...    Downloading: 0%               Downloading: 5%    Downloading: 10%    Downloading: 15%    Downloading: 20%    Downloading: 25%    Downloading: 30%    Downloading: 35%    Downloading: 40%    Downloading: 45%    Downloading: 50%    Downloading: 55%    Downloading: 60%    Downloading: 65%    Downloading: 70%    Downloading: 75%    Downloading: 80%    Downloading: 85%    Downloading: 90%    Downloading: 95%    Downloading: 100%    Downloading: 100%
02-May-2017 17:58:43
02-May-2017 17:58:43   - Installing phpunit/phpunit (4.8.31)
02-May-2017 17:58:45     Downloading: Connecting...    Downloading: 0%               Downloading: 5%    Downloading: 10%    Downloading: 15%    Downloading: 20%    Downloading: 25%    Downloading: 30%    Downloading: 35%    Downloading: 40%    Downloading: 45%    Downloading: 50%    Downloading: 55%    Downloading: 60%    Downloading: 65%    Downloading: 75%    Downloading: 85%    Downloading: 90%    Downloading: 95%    Downloading: 100%    Downloading: 100%
02-May-2017 17:58:45
02-May-2017 17:58:45   - Installing phpunit/dbunit (1.3.2)
02-May-2017 17:58:46     Downloading: Connecting...    Downloading: 0%               Downloading: 5%    Downloading: 10%    Downloading: 15%    Downloading: 20%    Downloading: 25%    Downloading: 30%    Downloading: 35%    Downloading: 40%    Downloading: 45%    Downloading: 50%    Downloading: 55%    Downloading: 60%    Downloading: 65%    Downloading: 70%    Downloading: 75%    Downloading: 80%    Downloading: 85%    Downloading: 90%    Downloading: 95%    Downloading: 100%    Downloading: 100%
02-May-2017 17:58:46
02-May-2017 17:58:46   - Installing symfony/finder (v2.8.14)
02-May-2017 17:58:47     Downloading: Connecting...    Downloading: 0%               Downloading: 5%    Downloading: 20%    Downloading: 25%    Downloading: 30%    Downloading: 35%    Downloading: 40%    Downloading: 45%    Downloading: 50%    Downloading: 65%    Downloading: 70%    Downloading: 75%    Downloading: 90%    Downloading: 95%    Downloading: 100%
02-May-2017 17:58:47
02-May-2017 17:58:47   - Installing pimple/pimple (v1.0.2)
02-May-2017 17:58:48     Downloading: Connecting...    Downloading: 0%               Downloading: 45%    Downloading: 75%    Downloading: 100%    Downloading: 100%
02-May-2017 17:58:48
02-May-2017 17:58:48   - Installing nikic/php-parser (v0.9.5)
02-May-2017 17:58:50     Downloading: Connecting...    Downloading: 0%               Downloading: 5%    Downloading: 10%    Downloading: 15%    Downloading: 20%    Downloading: 25%    Downloading: 30%    Downloading: 35%    Downloading: 40%    Downloading: 45%    Downloading: 50%    Downloading: 55%    Downloading: 60%    Downloading: 65%    Downloading: 70%    Downloading: 75%    Downloading: 80%    Downloading: 85%    Downloading: 90%    Downloading: 95%    Downloading: 100%    Downloading: 100%
02-May-2017 17:58:50
02-May-2017 17:58:50   - Installing michelf/php-markdown (1.7.0)
02-May-2017 17:58:51     Downloading: Connecting...    Downloading: 0%               Downloading: 25%    Downloading: 35%    Downloading: 60%    Downloading: 70%    Downloading: 95%    Downloading: 100%    Downloading: 100%
02-May-2017 17:58:51
02-May-2017 17:58:51   - Installing sami/sami (v1.4.1)
02-May-2017 17:58:52     Downloading: Connecting...    Downloading: 0%               Downloading: 10%    Downloading: 15%    Downloading: 20%    Downloading: 30%    Downloading: 35%    Downloading: 40%    Downloading: 45%    Downloading: 50%    Downloading: 55%    Downloading: 60%    Downloading: 65%    Downloading: 75%    Downloading: 85%    Downloading: 90%    Downloading: 95%    Downloading: 100%    Downloading: 100%
02-May-2017 17:58:52
02-May-2017 17:58:52   - Installing squizlabs/php_codesniffer (2.7.1)
02-May-2017 17:58:53     Downloading: Connecting...    Downloading: 0%               Downloading: 5%    Downloading: 10%    Downloading: 15%    Downloading: 20%    Downloading: 25%    Downloading: 30%    Downloading: 35%    Downloading: 40%    Downloading: 45%    Downloading: 50%    Downloading: 55%    Downloading: 60%    Downloading: 65%    Downloading: 70%    Downloading: 75%    Downloading: 80%    Downloading: 85%    Downloading: 90%    Downloading: 95%    Downloading: 100%    Downloading: 100%
02-May-2017 17:58:54
02-May-2017 17:58:55 lusitanian/oauth suggests installing predis/predis (Allows using the Redis storage backend.)
02-May-2017 17:58:55 paragonie/random_compat suggests installing ext-libsodium (Provides a modern crypto API that can be used to generate random bytes.)
02-May-2017 17:58:55 patchwork/utf8 suggests installing ext-intl (Use Intl for best performance)
02-May-2017 17:58:55 patchwork/utf8 suggests installing ext-wfio (Use WFIO for UTF-8 filesystem access on Windows)
02-May-2017 17:58:55 s9e/text-formatter suggests installing ext-intl (Allows international URLs to be accepted by the URL filter)
02-May-2017 17:58:55 s9e/text-formatter suggests installing ext-xsl (Enables the XSLT renderer)
02-May-2017 17:58:55 symfony/http-kernel suggests installing symfony/class-loader ()
02-May-2017 17:58:55 symfony/http-kernel suggests installing symfony/var-dumper ()
02-May-2017 17:58:55 symfony/dependency-injection suggests installing symfony/expression-language (For using expressions in service container configuration)
02-May-2017 17:58:55 zendframework/zend-stdlib suggests installing zendframework/zend-filter (To support naming strategy hydrator usage)
02-May-2017 17:58:55 zendframework/zend-stdlib suggests installing zendframework/zend-serializer (Zend\Serializer component)
02-May-2017 17:58:55 zendframework/zend-stdlib suggests installing zendframework/zend-servicemanager (To support hydrator plugin manager usage)
02-May-2017 17:58:55 zendframework/zend-code suggests installing doctrine/common (Doctrine\Common >=2.1 for annotation features)
02-May-2017 17:58:55 ocramius/proxy-manager suggests installing ocramius/generated-hydrator (To have very fast object to array to object conversion for ghost objects)
02-May-2017 17:58:55 ocramius/proxy-manager suggests installing zendframework/zend-json (To have the JsonRpc adapter (Remote Object feature))
02-May-2017 17:58:55 ocramius/proxy-manager suggests installing zendframework/zend-soap (To have the Soap adapter (Remote Object feature))
02-May-2017 17:58:55 ocramius/proxy-manager suggests installing zendframework/zend-xmlrpc (To have the XmlRpc adapter (Remote Object feature))
02-May-2017 17:58:55 symfony/routing suggests installing doctrine/annotations (For using the annotation loader)
02-May-2017 17:58:55 symfony/routing suggests installing symfony/expression-language (For using expression matching)
02-May-2017 17:58:55 symfony/twig-bridge suggests installing symfony/asset (For using the AssetExtension)
02-May-2017 17:58:55 symfony/twig-bridge suggests installing symfony/expression-language (For using the ExpressionExtension)
02-May-2017 17:58:55 symfony/twig-bridge suggests installing symfony/form (For using the FormExtension)
02-May-2017 17:58:55 symfony/twig-bridge suggests installing symfony/security (For using the SecurityExtension)
02-May-2017 17:58:55 symfony/twig-bridge suggests installing symfony/stopwatch (For using the StopwatchExtension)
02-May-2017 17:58:55 symfony/twig-bridge suggests installing symfony/templating (For using the TwigEngine)
02-May-2017 17:58:55 symfony/twig-bridge suggests installing symfony/translation (For using the TranslationExtension)
02-May-2017 17:58:55 symfony/twig-bridge suggests installing symfony/var-dumper (For using the DumpExtension)
02-May-2017 17:58:55 facebook/webdriver suggests installing phpdocumentor/phpdocumentor (2.*)
02-May-2017 17:58:55 phpdocumentor/reflection-docblock suggests installing dflydev/markdown (~1.0)
02-May-2017 17:58:55 phpdocumentor/reflection-docblock suggests installing erusev/parsedown (~1.0)
02-May-2017 17:58:55 sebastian/global-state suggests installing ext-uopz (*)
02-May-2017 17:58:55 phpunit/phpunit-mock-objects suggests installing ext-soap (*)
02-May-2017 17:58:55 phpunit/phpunit suggests installing phpunit/php-invoker (~1.1)
02-May-2017 17:58:55 Generating autoload files
02-May-2017 17:58:57 Buildfile: /data/build/build.xml
02-May-2017 17:58:58
02-May-2017 17:58:58 phpBB > clean:
02-May-2017 17:58:58
02-May-2017 17:58:58    [delete] Directory /data/build/logs does not exist or is not a directory.
02-May-2017 17:58:58    [delete] Directory /data/build/api does not exist or is not a directory.
02-May-2017 17:58:58    [delete] Directory /data/build/codebrowser does not exist or is not a directory.
02-May-2017 17:58:58    [delete] Directory /data/build/coverage does not exist or is not a directory.
02-May-2017 17:58:58    [delete] Directory /data/build/cpd does not exist or is not a directory.
02-May-2017 17:58:58    [delete] Directory /data/build/dependencies does not exist or is not a directory.
02-May-2017 17:58:58    [delete] Directory /data/build/new_version does not exist or is not a directory.
02-May-2017 17:58:58    [delete] Directory /data/build/old_versions does not exist or is not a directory.
02-May-2017 17:58:58    [delete] Directory /data/build/save does not exist or is not a directory.
02-May-2017 17:58:58
02-May-2017 17:58:58 phpBB > prepare:
02-May-2017 17:58:58
02-May-2017 17:58:58     [mkdir] Created dir: /data/build/logs
02-May-2017 17:58:58     [mkdir] Created dir: /data/build/api
02-May-2017 17:58:58     [mkdir] Created dir: /data/build/codebrowser
02-May-2017 17:58:58     [mkdir] Created dir: /data/build/coverage
02-May-2017 17:58:58     [mkdir] Created dir: /data/build/cpd
02-May-2017 17:58:58     [mkdir] Created dir: /data/build/dependencies
02-May-2017 17:58:58     [mkdir] Created dir: /data/build/new_version
02-May-2017 17:58:58     [mkdir] Created dir: /data/build/new_version/files
02-May-2017 17:58:58     [mkdir] Created dir: /data/build/new_version/patches
02-May-2017 17:58:58     [mkdir] Created dir: /data/build/new_version/release_files
02-May-2017 17:58:58     [mkdir] Created dir: /data/build/new_version/update
02-May-2017 17:58:58     [mkdir] Created dir: /data/build/old_versions
02-May-2017 17:58:58     [mkdir] Created dir: /data/build/save
02-May-2017 17:58:58
02-May-2017 17:58:58 phpBB > composer:
02-May-2017 17:58:58
02-May-2017 17:58:58 You are running composer with xdebug enabled. This has a major impact on runtime performance. See https://getcomposer.org/xdebug
02-May-2017 17:58:58 Cannot create cache directory /.composer/cache/repo/https---packagist.org/, or directory is not writable. Proceeding without cache
02-May-2017 17:58:58 Cannot create cache directory /.composer/cache/files/, or directory is not writable. Proceeding without cache
02-May-2017 17:58:58 Loading composer repositories with package information
02-May-2017 17:58:58 Installing dependencies (including require-dev) from lock file
02-May-2017 17:58:58 Nothing to install or update
02-May-2017 17:58:58 Generating autoload files
02-May-2017 17:59:00
02-May-2017 17:59:00 phpBB > test:
02-May-2017 17:59:00
02-May-2017 17:59:05 PHPUnit 4.8.31 by Sebastian Bergmann and contributors.
02-May-2017 17:59:05
02-May-2017 18:00:57 .............................................................   61 / 6892 (  0%)
02-May-2017 18:01:30 .............................................................  122 / 6892 (  1%)
02-May-2017 18:02:02 ...I.....SSSS............SSSS.........S...S..................  183 / 6892 (  2%)
02-May-2017 18:03:03 ....................................................S........  244 / 6892 (  3%)
02-May-2017 18:05:13 .............................................................  305 / 6892 (  4%)
02-May-2017 18:06:00 .............................................................  366 / 6892 (  5%)
02-May-2017 18:06:49 .............................................................  427 / 6892 (  6%)
02-May-2017 18:07:57 .............................................................  488 / 6892 (  7%)
02-May-2017 18:09:03 .............................................................  549 / 6892 (  7%)
02-May-2017 18:10:07 .............................................................  610 / 6892 (  8%)
02-May-2017 18:11:18 .............................................................  671 / 6892 (  9%)
02-May-2017 18:12:33 .............................................................  732 / 6892 ( 10%)
02-May-2017 18:13:58 .............................................................  793 / 6892 ( 11%)
02-May-2017 18:15:23 .............................................................  854 / 6892 ( 12%)
02-May-2017 18:16:41 .............................................................  915 / 6892 ( 13%)
02-May-2017 18:17:49 .............................................................  976 / 6892 ( 14%)
02-May-2017 18:18:47 ............................................................. 1037 / 6892 ( 15%)
02-May-2017 18:19:46 ..................................I.......................... 1098 / 6892 ( 15%)
02-May-2017 18:20:46 ............................................................. 1159 / 6892 ( 16%)
02-May-2017 18:21:30 ............................................................. 1220 / 6892 ( 17%)
02-May-2017 18:22:12 .S.S.S....................................................... 1281 / 6892 ( 18%)
02-May-2017 18:22:48 ............................................................. 1342 / 6892 ( 19%)
02-May-2017 18:23:40 ............................................................. 1403 / 6892 ( 20%)
02-May-2017 18:24:19 ............................................................. 1464 / 6892 ( 21%)
02-May-2017 18:25:02 ............................................................. 1525 / 6892 ( 22%)
02-May-2017 18:25:44 ............................................................. 1586 / 6892 ( 23%)
02-May-2017 18:26:28 ............................................................. 1647 / 6892 ( 23%)
02-May-2017 18:27:04 ............................................................. 1708 / 6892 ( 24%)
02-May-2017 18:27:46 ............................................................. 1769 / 6892 ( 25%)
02-May-2017 18:28:50 ............................................................. 1830 / 6892 ( 26%)
02-May-2017 18:29:55 ............................................................. 1891 / 6892 ( 27%)
02-May-2017 18:31:04 ............................................................. 1952 / 6892 ( 28%)
02-May-2017 18:32:18 ............................................................. 2013 / 6892 ( 29%)
02-May-2017 18:33:37 ............................................................. 2074 / 6892 ( 30%)
02-May-2017 18:34:35 ............................................................. 2135 / 6892 ( 30%)
02-May-2017 18:35:31 ............................................................. 2196 / 6892 ( 31%)
02-May-2017 18:36:09 ............................................................. 2257 / 6892 ( 32%)
02-May-2017 18:37:01 ........................................I.II................. 2318 / 6892 ( 33%)
02-May-2017 18:38:07 ............................................................. 2379 / 6892 ( 34%)
02-May-2017 18:39:18 ............................................................. 2440 / 6892 ( 35%)
02-May-2017 18:40:31 ............................................................. 2501 / 6892 ( 36%)
02-May-2017 18:41:54 ............................................................. 2562 / 6892 ( 37%)
02-May-2017 18:42:43 ............................................................. 2623 / 6892 ( 38%)
02-May-2017 18:43:45 ............................................................. 2684 / 6892 ( 38%)
02-May-2017 18:44:23 ...............SSSSSSSSS..................................... 2745 / 6892 ( 39%)
02-May-2017 18:45:09 ............................................................. 2806 / 6892 ( 40%)
02-May-2017 18:46:56 ............................................................. 2867 / 6892 ( 41%)
02-May-2017 18:48:26 ....................................................S........ 2928 / 6892 ( 42%)
02-May-2017 18:50:07 ............................................................. 2989 / 6892 ( 43%)
02-May-2017 18:53:33 ............................................................. 3050 / 6892 ( 44%)
02-May-2017 18:55:11 ............................................................. 3111 / 6892 ( 45%)
02-May-2017 18:56:41 ............................................................. 3172 / 6892 ( 46%)
02-May-2017 18:57:52 ............................................................. 3233 / 6892 ( 46%)
02-May-2017 18:59:20 ............................................................. 3294 / 6892 ( 47%)
02-May-2017 19:00:37 ............................................................. 3355 / 6892 ( 48%)
02-May-2017 19:02:12 ............................................................. 3416 / 6892 ( 49%)
02-May-2017 19:03:25 ............................................................. 3477 / 6892 ( 50%)
02-May-2017 19:04:45 ............................................................. 3538 / 6892 ( 51%)
02-May-2017 19:06:03 ............................................................. 3599 / 6892 ( 52%)
02-May-2017 19:07:16 ............................................................. 3660 / 6892 ( 53%)
02-May-2017 19:08:51 ............................................................. 3721 / 6892 ( 53%)
02-May-2017 19:10:31 ............................................................. 3782 / 6892 ( 54%)
02-May-2017 19:11:18 ............................................................. 3843 / 6892 ( 55%)
02-May-2017 19:12:12 ............................................................. 3904 / 6892 ( 56%)
02-May-2017 19:13:23 ............................................................. 3965 / 6892 ( 57%)
02-May-2017 19:14:23 ............................................................. 4026 / 6892 ( 58%)
02-May-2017 19:17:52 ............................................................. 4087 / 6892 ( 59%)
02-May-2017 19:18:39 ............................................................. 4148 / 6892 ( 60%)
02-May-2017 19:19:37 ............................................................. 4209 / 6892 ( 61%)
02-May-2017 19:20:21 ............................................................. 4270 / 6892 ( 61%)
02-May-2017 19:21:06 ............................................................. 4331 / 6892 ( 62%)
02-May-2017 19:21:49 ............................................................. 4392 / 6892 ( 63%)
02-May-2017 19:22:32 ............................................................. 4453 / 6892 ( 64%)
02-May-2017 19:23:16 ............................................................. 4514 / 6892 ( 65%)
02-May-2017 19:23:59 ............................................................. 4575 / 6892 ( 66%)
02-May-2017 19:24:43 ............................................................. 4636 / 6892 ( 67%)
02-May-2017 19:25:27 ............................................................. 4697 / 6892 ( 68%)
02-May-2017 19:29:51 ............................................................. 4758 / 6892 ( 69%)
02-May-2017 19:32:15 ...............S............................................. 4819 / 6892 ( 69%)
02-May-2017 19:33:35 ............................................................. 4880 / 6892 ( 70%)
02-May-2017 19:34:38 ............................................................. 4941 / 6892 ( 71%)
02-May-2017 19:35:27 ............................................................. 5002 / 6892 ( 72%)
02-May-2017 19:36:14 ............................................................. 5063 / 6892 ( 73%)
02-May-2017 19:37:01 ............................................................. 5124 / 6892 ( 74%)
02-May-2017 19:37:21 ...........................SSSSSSSSSSSSSSSSSSSSSSSSSSSSSSSSSS 5185 / 6892 ( 75%)
02-May-2017 19:37:21 SSSSSSSSSSSSSSSSSSSSSSSSSSSSSSSSSSSSSSSSSSSSSSSSSSSSSSSSSSSSS 5246 / 6892 ( 76%)
02-May-2017 19:37:21 SSSSSSSSSSSSSSSSSSSSSSSSSSSSSSSSSSSSSSSSSSSSSSSSSSSSSSSSSSSSS 5307 / 6892 ( 77%)
02-May-2017 19:37:21 SSSSSSSSSSSSSSSSSSSSSSSSSSSSSSSSSSSSSSSSSSSSSSSSSSSSSSSSSSSSS 5368 / 6892 ( 77%)
02-May-2017 19:37:36 SSSSSSSSSSSSSSSSSSSSSSSSSSSSSSSSSSSSSSSSSSS.................. 5429 / 6892 ( 78%)
02-May-2017 19:38:24 ............................................................. 5490 / 6892 ( 79%)
02-May-2017 19:39:12 ............................................................. 5551 / 6892 ( 80%)
02-May-2017 19:40:00 ............................................................. 5612 / 6892 ( 81%)
02-May-2017 19:40:48 ............................................................. 5673 / 6892 ( 82%)
02-May-2017 19:41:36 ............................................................. 5734 / 6892 ( 83%)
02-May-2017 19:42:24 ............................................................. 5795 / 6892 ( 84%)
02-May-2017 19:43:13 ............................................................. 5856 / 6892 ( 84%)
02-May-2017 19:44:01 ............................................................. 5917 / 6892 ( 85%)
02-May-2017 19:44:48 ............................................................. 5978 / 6892 ( 86%)
02-May-2017 19:45:37 ............................................................. 6039 / 6892 ( 87%)
02-May-2017 19:46:25 ............................................................. 6100 / 6892 ( 88%)
02-May-2017 19:47:13 ............................................................. 6161 / 6892 ( 89%)
02-May-2017 19:48:00 ............................................................. 6222 / 6892 ( 90%)
02-May-2017 19:48:48 ............................................................. 6283 / 6892 ( 91%)
02-May-2017 19:49:36 ............................................................. 6344 / 6892 ( 92%)
02-May-2017 19:50:23 ............................................................. 6405 / 6892 ( 92%)
02-May-2017 19:51:11 ............................................................. 6466 / 6892 ( 93%)
02-May-2017 19:52:00 ............................................................. 6527 / 6892 ( 94%)
02-May-2017 19:52:47 ............................................................. 6588 / 6892 ( 95%)
02-May-2017 19:53:35 ............................................................. 6649 / 6892 ( 96%)
02-May-2017 19:54:24 ............................................................. 6710 / 6892 ( 97%)
02-May-2017 19:55:12 ............................................................. 6771 / 6892 ( 98%)
02-May-2017 19:56:01 ............................................................. 6832 / 6892 ( 99%)
02-May-2017 19:56:46 ..........................................................SS
02-May-2017 19:56:46
02-May-2017 19:56:46 Time: 1.96 hours, Memory: 546.00MB
02-May-2017 19:56:46
02-May-2017 19:56:46 OK, but incomplete, skipped, or risky tests!
02-May-2017 19:56:46 Tests: 9170, Assertions: 20476, Skipped: 287, Incomplete: 5.
02-May-2017 19:56:46
02-May-2017 19:58:43 Generating code coverage report in Clover XML format ... done
02-May-2017 19:58:43
02-May-2017 20:00:32 Generating code coverage report in HTML format ... done
02-May-2017 20:00:34
02-May-2017 20:00:34 phpBB > docs:
02-May-2017 20:00:34
02-May-2017 20:00:34 Updating project
02-May-2017 20:02:12
02-May-2017 20:02:12 phpBB > build:
02-May-2017 20:02:12
02-May-2017 20:02:12
02-May-2017 20:02:12 BUILD FINISHED
02-May-2017 20:02:12
02-May-2017 20:02:12 Total time: 123 minutes  14.38 seconds
02-May-2017 20:02:12
02-May-2017 20:02:12 Finished task 'Run tests' with result: Success
02-May-2017 20:02:12
Substituting variable: ${bamboo.working.directory} with /home/bamboo/xml-data/build-dir/PHPBB3-DD32-JOB1
02-May-2017 20:02:12 Starting task 'Run sniffs' of type 'com.atlassian.bamboo.plugins.bamboo-docker-plugin:task.docker.cli'
02-May-2017 20:02:12 Running image name (phpbb:php-5.6)
02-May-2017 20:02:12
Beginning to execute external process for build 'phpBB3 - Development Docker 3.2 - PHP 5.6 - SQLite #294 (PHPBB3-DD32-JOB1-294)'
... running command line:
/usr/bin/docker run --volume /home/bamboo/xml-data/build-dir/PHPBB3-DD32-JOB1:/data --workdir /data/build --rm -u=991 phpbb:php-5.6 ../phpBB/vendor/bin/phing sniff
... in: /home/bamboo/xml-data/build-dir/PHPBB3-DD32-JOB1
... using extra environment variables:
bamboo_planRepository_1_branch=3.2.x
bamboo_planRepository_1_branchDisplayName=3.2.x
bamboo_repository_revision_number=877760ef9805be8b431c2fe43ef6ab38c07ec02d
bamboo_resultsUrl=https://bamboo.phpbb.com/browse/PHPBB3-DD32-JOB1-294
bamboo_repository_75956229_previous_revision_number=521760aeb73d2801e22665a45ea0aace8741b61d
bamboo_capability_system_builder_command_Git=/usr/bin/git
bamboo_planRepository_1_name=phpBB Rhea
bamboo_build_working_directory=/home/bamboo/xml-data/build-dir/PHPBB3-DD32-JOB1
bamboo_buildKey=PHPBB3-DD32-JOB1
bamboo_capability_phpbb_tests=true
bamboo_shortPlanName=Development Docker 3.2
bamboo_repository_75956229_git_username=bantu
bamboo_capability_system_builder_command_fop=/usr/bin/fop
bamboo_capability_dbms_sqlite_2=true
bamboo_planRepository_name=phpBB Rhea
bamboo_buildNumber=294
bamboo_capability_system_builder_phpunit_PHPUnit=/usr/bin/phpunit
bamboo_shortJobName=PHP 5.6 - SQLite
bamboo_buildResultsUrl=https://bamboo.phpbb.com/browse/PHPBB3-DD32-JOB1-294
bamboo_repository_75956229_git_branch=3.2.x
bamboo_planRepository_repositoryUrl=https://github.com/phpbb/phpbb.git
bamboo_agentId=131073
bamboo_planName=phpBB3 - Development Docker 3.2
bamboo_repository_75956229_branch_name=3.2.x
bamboo_shortPlanKey=DD32
bamboo_repository_75956229_revision_number=877760ef9805be8b431c2fe43ef6ab38c07ec02d
bamboo_repository_75956229_name=phpBB Rhea
bamboo_shortJobKey=JOB1
bamboo_capability_dbms_mysql_55=true
bamboo_capability_system_jdk_JDK_1_7_0_65=/usr/lib/jvm/java-7-openjdk-amd64
bamboo_planRepository_revision=877760ef9805be8b431c2fe43ef6ab38c07ec02d
bamboo_repository_previous_revision_number=521760aeb73d2801e22665a45ea0aace8741b61d
bamboo_buildTimeStamp=2017-05-02T17:39:37.256Z
bamboo_capability_system_builder_mvn2_Maven_2=/usr/share/maven2
bamboo_capability_system_jdk_JDK_1_6_0_16=/usr/lib/jvm/java-6-sun-1.6.0.16
bamboo_planRepository_previousRevision=521760aeb73d2801e22665a45ea0aace8741b61d
bamboo_buildResultKey=PHPBB3-DD32-JOB1-294
bamboo_repository_git_branch=3.2.x
bamboo_repository_branch_name=3.2.x
bamboo_buildPlanName=phpBB3 - Development Docker 3.2 - PHP 5.6 - SQLite
bamboo_build_commandline_com_atlassian_bamboo_plugins_bamboo_docker_plugin_task_docker_cli_2=/usr/bin/docker run --volume /home/bamboo/xml-data/build-dir/PHPBB3-DD32-JOB1:/data --workdir /data/phpBB --rm -u=991 -t phpbb:php-5.6 /bin/bash -c php ../composer.phar install --dev; cd ../build; ../phpBB/vendor/bin/phing build
bamboo_planRepository_1_revision=877760ef9805be8b431c2fe43ef6ab38c07ec02d
bamboo_build_commandline_com_atlassian_bamboo_plugins_bamboo_docker_plugin_task_docker_cli_3=/usr/bin/docker build --force-rm=true --tag=phpbb:php-5.6 /home/bamboo/xml-data/build-dir/PHPBB3-DD32-JOB1
bamboo_repository_name=phpBB Rhea
bamboo_repository_75956229_git_repositoryUrl=https://github.com/phpbb/phpbb.git
bamboo_capability_system_docker_executable=/usr/bin/docker
bamboo_planRepository_branch=3.2.x
bamboo_agentWorkingDirectory=/home/bamboo/xml-data/build-dir
bamboo_capability_system_git_executable=/usr/bin/git
bamboo_capability_system_builder_phpunit_PHPUnit_3_4=/usr/bin/phpunit
bamboo_repository_git_username=bantu
bamboo_planRepository_1_previousRevision=521760aeb73d2801e22665a45ea0aace8741b61d
bamboo_planRepository_branchDisplayName=3.2.x
bamboo_planRepository_1_type=gitv2
bamboo_planRepository_branchName=3.2.x
bamboo_capability_system_jdk_JDK=/usr/lib/jvm/java-6-sun
bamboo_plan_storageTag=PHPBB3-DD32
bamboo_planRepository_type=gitv2
bamboo_planRepository_1_username=bantu
bamboo_repository_git_repositoryUrl=https://github.com/phpbb/phpbb.git
bamboo_capability_system_builder_ant_Ant=/usr/share/ant
bamboo_working_directory=/home/bamboo/xml-data/build-dir/PHPBB3-DD32-JOB1
bamboo_planKey=PHPBB3-DD32
bamboo_planRepository_1_repositoryUrl=https://github.com/phpbb/phpbb.git
bamboo_planRepository_username=bantu
bamboo_capability_local=true
bamboo_capability_system_jdk_JDK_1_6=/usr/lib/jvm/java-6-sun
bamboo_capability_system_jdk_JDK_1_7=/usr/lib/jvm/java-7-openjdk-amd64
bamboo_planRepository_1_branchName=3.2.x
02-May-2017 20:02:12 Buildfile: /data/build/build.xml
02-May-2017 20:02:12
02-May-2017 20:02:12 phpBB > sniff:
02-May-2017 20:02:12
02-May-2017 20:02:20 ............................................................  60 / 677 (9%)
02-May-2017 20:02:22 ............................................................ 120 / 677 (18%)
02-May-2017 20:02:23 ............................................................ 180 / 677 (27%)
02-May-2017 20:02:24 ............................................................ 240 / 677 (35%)
02-May-2017 20:02:30 ............................................................ 300 / 677 (44%)
02-May-2017 20:02:35 ............................................................ 360 / 677 (53%)
02-May-2017 20:02:41 ............................................................ 420 / 677 (62%)
02-May-2017 20:02:44 ............................................................ 480 / 677 (71%)
02-May-2017 20:02:48 ............................................................ 540 / 677 (80%)
02-May-2017 20:02:53 ............................................................ 600 / 677 (89%)
02-May-2017 20:02:55 ............................................................ 660 / 677 (97%)
02-May-2017 20:02:56 .................
02-May-2017 20:02:56
02-May-2017 20:02:56 Time: 43.4 secs; Memory: 76.5Mb
02-May-2017 20:02:56
02-May-2017 20:03:04 ............................................................  60 / 206 (29%)
02-May-2017 20:03:25 ............................................................ 120 / 206 (58%)
02-May-2017 20:03:41 ............................................................ 180 / 206 (87%)
02-May-2017 20:03:48 ..........................
02-May-2017 20:03:48
02-May-2017 20:03:48 Time: 52.34 secs; Memory: 60.25Mb
02-May-2017 20:03:48
02-May-2017 20:03:48
02-May-2017 20:03:48
02-May-2017 20:03:48 Time: 17ms; Memory: 3.5Mb
02-May-2017 20:03:48
02-May-2017 20:03:48
02-May-2017 20:03:48 BUILD FINISHED
02-May-2017 20:03:48
02-May-2017 20:03:48 Total time: 2 minutes  36.15 seconds
02-May-2017 20:03:48
02-May-2017 20:03:48 Finished task 'Run sniffs' with result: Success
02-May-2017 20:03:48 Starting task 'Parsing test results' of type 'com.atlassian.bamboo.plugins.testresultparser:task.testresultparser.junit'
02-May-2017 20:03:48 Parsing test results under /home/bamboo/xml-data/build-dir/PHPBB3-DD32-JOB1...
02-May-2017 20:03:48 Finished task 'Parsing test results' with result: Success
02-May-2017 20:03:48 Running post build plugin 'NCover Results Collector'
02-May-2017 20:03:48 Running post build plugin 'Artifact Copier'
02-May-2017 20:03:48 Publishing an artifact: Coverage HTML Report
02-May-2017 20:03:50 Finished publishing of artifact Job artifact: [Coverage HTML Report], pattern: [**/*.*] anchored at: [build/coverage/] in 1.903 s
02-May-2017 20:03:50 Running post build plugin 'npm Cache Cleanup'
02-May-2017 20:03:50 Running post build plugin 'Clover Results Collector'
02-May-2017 20:03:50 Running post build plugin 'Docker Container Cleanup'
02-May-2017 20:03:51 Successfully removed working directory at '/home/bamboo/xml-data/build-dir/PHPBB3-DD32-JOB1'
02-May-2017 20:03:51 Finalising the build...
02-May-2017 20:03:51 Stopping timer.
02-May-2017 20:03:51 Build PHPBB3-DD32-JOB1-294 completed.
02-May-2017 20:03:51 Running on server: post build plugin 'NCover Results Collector'
02-May-2017 20:03:51 Running on server: post build plugin 'Build Hanging Detection Configuration'
02-May-2017 20:03:51 Running on server: post build plugin 'Clover Delta Calculator'
02-May-2017 20:03:51 Running on server: post build plugin 'Maven Dependencies Postprocessor'
02-May-2017 20:03:51 All post build plugins have finished
02-May-2017 20:03:51 Generating build results summary...
02-May-2017 20:03:55 Saving build results to disk...
02-May-2017 20:03:55 Logging substituted variables...
02-May-2017 20:03:55 Indexing build results...
02-May-2017 20:03:55 Finished building PHPBB3-DD32-JOB1-294.