Build: #690 failed

Job: PHP 5.6 - SQLite Package failed

Stages & jobs

  1. Default Stage

Build log

The build generated 180 lines of output. Download or view full build log

21-Mar-2020 16:49:03 Build phpBB3 - Development Docker 3.2 - PHP 5.6 - SQLite Package #690 (PHPBB3-DD32-P5SP-690) started building on agent Docker
21-Mar-2020 16:49:03
21-Mar-2020 16:49:03 Build working directory is /home/bamboo/xml-data/build-dir/PHPBB3-DD32-P5SP
21-Mar-2020 16:49:03 Executing build phpBB3 - Development Docker 3.2 - PHP 5.6 - SQLite Package #690 (PHPBB3-DD32-P5SP-690)
21-Mar-2020 16:49:03 Starting task 'Checkout Default Repository' of type 'com.atlassian.bamboo.plugins.vcs:task.vcs.checkout'
21-Mar-2020 16:49:03 Checking out into /home/bamboo/xml-data/build-dir/PHPBB3-DD32-P5SP
21-Mar-2020 16:49:03 Updating source code to revision: 0fa0013a69118e0126389c921ed59b2c918517e5
21-Mar-2020 16:49:04 Fetching 'refs/heads/3.2.x' from 'https://github.com/phpbb/phpbb.git'.
21-Mar-2020 16:49:07 Checking out revision 0fa0013a69118e0126389c921ed59b2c918517e5.
21-Mar-2020 16:49:07 Creating local git repository in '/home/bamboo/xml-data/build-dir/PHPBB3-DD32-P5SP/.git'.
21-Mar-2020 16:49:07 Cloning into '/home/bamboo/xml-data/build-dir/PHPBB3-DD32-P5SP'...
21-Mar-2020 16:49:07 done.
21-Mar-2020 16:49:24 Branch 3.2.x set up to track remote branch 3.2.x from origin.
21-Mar-2020 16:49:24 Switched to a new branch '3.2.x'
21-Mar-2020 16:49:24 Updated source code to revision: 0fa0013a69118e0126389c921ed59b2c918517e5
21-Mar-2020 16:49:24 Finished task 'Checkout Default Repository' with result: Success
21-Mar-2020 16:49:24 Running pre-build action: VCS Version Collector
21-Mar-2020 16:49:24
Substituting variable: ${bamboo.working.directory} with /home/bamboo/xml-data/build-dir/PHPBB3-DD32-P5SP
21-Mar-2020 16:49:24 Starting task 'Build image' of type 'com.atlassian.bamboo.plugins.bamboo-docker-plugin:task.docker.cli'
21-Mar-2020 16:49:24
Beginning to execute external process for build 'phpBB3 - Development Docker 3.2 - PHP 5.6 - SQLite Package #690 (PHPBB3-DD32-P5SP-690)'
... running command line:
/usr/bin/docker build --force-rm=true --tag=phpbb:php-5.6 /home/bamboo/xml-data/build-dir/PHPBB3-DD32-P5SP
... in: /home/bamboo/xml-data/build-dir/PHPBB3-DD32-P5SP
... using extra environment variables:
bamboo_planRepository_1_branch=3.2.x
bamboo_planRepository_1_branchDisplayName=3.2.x
bamboo_repository_revision_number=0fa0013a69118e0126389c921ed59b2c918517e5
bamboo_resultsUrl=https://bamboo.phpbb.com/browse/PHPBB3-DD32-P5SP-690
bamboo_repository_75956229_previous_revision_number=0788754a5f79541590ecc3ab0cd93605fd3b6237
bamboo_capability_system_builder_command_Git=/usr/bin/git
bamboo_build_working_directory=/home/bamboo/xml-data/build-dir/PHPBB3-DD32-P5SP
bamboo_planRepository_1_name=phpBB Rhea
bamboo_buildKey=PHPBB3-DD32-P5SP
bamboo_repository_75956229_git_username=bantu
bamboo_shortPlanName=Development Docker 3.2
bamboo_planRepository_name=phpBB Rhea
bamboo_buildNumber=690
bamboo_capability_system_builder_phpunit_PHPUnit=/usr/bin/phpunit
bamboo_shortJobName=PHP 5.6 - SQLite Package
bamboo_buildResultsUrl=https://bamboo.phpbb.com/browse/PHPBB3-DD32-P5SP-690
bamboo_repository_75956229_git_branch=3.2.x
bamboo_planRepository_repositoryUrl=https://github.com/phpbb/phpbb.git
bamboo_agentId=65929217
bamboo_planName=phpBB3 - Development Docker 3.2
bamboo_repository_75956229_branch_name=3.2.x
bamboo_shortPlanKey=DD32
bamboo_repository_75956229_revision_number=0fa0013a69118e0126389c921ed59b2c918517e5
bamboo_repository_75956229_name=phpBB Rhea
bamboo_shortJobKey=P5SP
bamboo_capability_system_jdk_JDK_1_7_0_65=/usr/lib/jvm/java-7-openjdk-amd64
bamboo_planRepository_revision=0fa0013a69118e0126389c921ed59b2c918517e5
bamboo_buildTimeStamp=2020-03-21T16:20:15.375Z
bamboo_repository_previous_revision_number=0788754a5f79541590ecc3ab0cd93605fd3b6237
bamboo_capability_system_jdk_JDK_1_6_0_16=/usr/lib/jvm/java-6-sun-1.6.0.16
bamboo_capability_system_builder_mvn2_Maven_2=/usr/share/maven2
bamboo_planRepository_previousRevision=0788754a5f79541590ecc3ab0cd93605fd3b6237
bamboo_repository_git_branch=3.2.x
bamboo_buildResultKey=PHPBB3-DD32-P5SP-690
bamboo_repository_branch_name=3.2.x
bamboo_buildPlanName=phpBB3 - Development Docker 3.2 - PHP 5.6 - SQLite Package
bamboo_planRepository_1_revision=0fa0013a69118e0126389c921ed59b2c918517e5
bamboo_repository_name=phpBB Rhea
bamboo_repository_75956229_git_repositoryUrl=https://github.com/phpbb/phpbb.git
bamboo_buildFailed=false
bamboo_capability_system_docker_executable=/usr/bin/docker
bamboo_planRepository_branch=3.2.x
bamboo_agentWorkingDirectory=/home/bamboo/xml-data/build-dir
bamboo_capability_system_git_executable=/usr/bin/git
bamboo_capability_system_builder_phpunit_PHPUnit_3_4=/usr/bin/phpunit
bamboo_repository_git_username=bantu
bamboo_planRepository_1_previousRevision=0788754a5f79541590ecc3ab0cd93605fd3b6237
bamboo_planRepository_branchDisplayName=3.2.x
bamboo_planRepository_1_type=gitv2
bamboo_planRepository_branchName=3.2.x
bamboo_capability_system_jdk_JDK=/usr/lib/jvm/java-6-sun
bamboo_plan_storageTag=PHPBB3-DD32
bamboo_hg_cache_directory=/home/bamboo/xml-data/build-dir/_hg-repositories-cache
bamboo_planRepository_1_username=bantu
bamboo_planRepository_type=gitv2
bamboo_git_cache_directory=/home/bamboo/xml-data/build-dir/_git-repositories-cache
bamboo_repository_git_repositoryUrl=https://github.com/phpbb/phpbb.git
bamboo_capability_system_builder_ant_Ant=/usr/share/ant
bamboo_tmp_directory=/home/bamboo/temp
bamboo_working_directory=/home/bamboo/xml-data/build-dir/PHPBB3-DD32-P5SP
bamboo_planKey=PHPBB3-DD32
bamboo_capability_local=true
bamboo_planRepository_1_repositoryUrl=https://github.com/phpbb/phpbb.git
bamboo_planRepository_username=bantu
bamboo_capability_system_jdk_JDK_1_6=/usr/lib/jvm/java-6-sun
bamboo_capability_system_jdk_JDK_1_7=/usr/lib/jvm/java-7-openjdk-amd64
bamboo_planRepository_1_branchName=3.2.x
21-Mar-2020 16:49:25 Sending build context to Docker daemon  20.09MB
21-Mar-2020 16:49:25
21-Mar-2020 16:49:25 Step 1/6 : FROM php:5.6
21-Mar-2020 16:49:25 ---> 36c3c974e6ee
21-Mar-2020 16:49:25 Step 2/6 : RUN apt-get update && apt-get install -y         git         zlib1g-dev         bzip2         zip         && docker-php-ext-install -j$(nproc) zip
21-Mar-2020 16:49:25 ---> Using cache
21-Mar-2020 16:49:25 ---> 49ecfda0a7eb
21-Mar-2020 16:49:25 Step 3/6 : RUN pecl install xdebug-2.5.5
21-Mar-2020 16:49:25 ---> Using cache
21-Mar-2020 16:49:25 ---> 7e41c68e3574
21-Mar-2020 16:49:25 Step 4/6 : RUN docker-php-ext-enable xdebug
21-Mar-2020 16:49:25 ---> Using cache
21-Mar-2020 16:49:25 ---> e7c3cbfbef21
21-Mar-2020 16:49:25 Step 5/6 : RUN echo "memory_limit = 1024M" >> /usr/local/etc/php/conf.d/memory.ini
21-Mar-2020 16:49:25 ---> Using cache
21-Mar-2020 16:49:25 ---> 5688e303ede2
21-Mar-2020 16:49:25 Step 6/6 : RUN git config --system user.name Docker && git config --system user.email docker@localhost
21-Mar-2020 16:49:25 ---> Running in de97c521d9a9
21-Mar-2020 16:49:31 Removing intermediate container de97c521d9a9
21-Mar-2020 16:49:31 ---> bbdaeb377552
21-Mar-2020 16:49:31 Successfully built bbdaeb377552
21-Mar-2020 16:49:31 Successfully tagged phpbb:php-5.6
21-Mar-2020 16:49:31 Built Docker image 'phpbb:php-5.6'
21-Mar-2020 16:49:31 Finished task 'Build image' with result: Success
21-Mar-2020 16:49:31
Substituting variable: ${bamboo.working.directory} with /home/bamboo/xml-data/build-dir/PHPBB3-DD32-P5SP
21-Mar-2020 16:49:31 Starting task 'Package release files' of type 'com.atlassian.bamboo.plugins.bamboo-docker-plugin:task.docker.cli'
21-Mar-2020 16:49:31 Running image name (phpbb:php-5.6)
21-Mar-2020 16:49:31
Beginning to execute external process for build 'phpBB3 - Development Docker 3.2 - PHP 5.6 - SQLite Package #690 (PHPBB3-DD32-P5SP-690)'
... running command line:
/usr/bin/docker run --volume /home/bamboo/xml-data/build-dir/PHPBB3-DD32-P5SP:/data --workdir /data/phpBB --rm -u=991 --dns=8.8.8.8 -t --volume /home/bamboo/xml-data/build-dir/_git-repositories-cache/:/home/bamboo/xml-data/build-dir/_git-repositories-cache/ phpbb:php-5.6 /bin/bash -c php ../composer.phar install --dev; cd ../build; git fetch --tags https://github.com/phpbb/phpbb.git 2>&1; ../phpBB/vendor/bin/phing package
... in: /home/bamboo/xml-data/build-dir/PHPBB3-DD32-P5SP
... using extra environment variables:
bamboo_planRepository_1_branch=3.2.x
bamboo_planRepository_1_branchDisplayName=3.2.x
bamboo_repository_revision_number=0fa0013a69118e0126389c921ed59b2c918517e5
bamboo_resultsUrl=https://bamboo.phpbb.com/browse/PHPBB3-DD32-P5SP-690
bamboo_repository_75956229_previous_revision_number=0788754a5f79541590ecc3ab0cd93605fd3b6237
bamboo_capability_system_builder_command_Git=/usr/bin/git
bamboo_build_working_directory=/home/bamboo/xml-data/build-dir/PHPBB3-DD32-P5SP
bamboo_planRepository_1_name=phpBB Rhea
bamboo_buildKey=PHPBB3-DD32-P5SP
bamboo_repository_75956229_git_username=bantu
bamboo_shortPlanName=Development Docker 3.2
bamboo_planRepository_name=phpBB Rhea
bamboo_buildNumber=690
bamboo_capability_system_builder_phpunit_PHPUnit=/usr/bin/phpunit
bamboo_shortJobName=PHP 5.6 - SQLite Package
bamboo_buildResultsUrl=https://bamboo.phpbb.com/browse/PHPBB3-DD32-P5SP-690
bamboo_repository_75956229_git_branch=3.2.x
bamboo_planRepository_repositoryUrl=https://github.com/phpbb/phpbb.git
bamboo_agentId=65929217
bamboo_planName=phpBB3 - Development Docker 3.2
bamboo_repository_75956229_branch_name=3.2.x
bamboo_shortPlanKey=DD32
bamboo_repository_75956229_revision_number=0fa0013a69118e0126389c921ed59b2c918517e5
bamboo_repository_75956229_name=phpBB Rhea
bamboo_shortJobKey=P5SP
bamboo_capability_system_jdk_JDK_1_7_0_65=/usr/lib/jvm/java-7-openjdk-amd64
bamboo_planRepository_revision=0fa0013a69118e0126389c921ed59b2c918517e5
bamboo_buildTimeStamp=2020-03-21T16:20:15.375Z
bamboo_repository_previous_revision_number=0788754a5f79541590ecc3ab0cd93605fd3b6237
bamboo_capability_system_jdk_JDK_1_6_0_16=/usr/lib/jvm/java-6-sun-1.6.0.16
bamboo_capability_system_builder_mvn2_Maven_2=/usr/share/maven2
bamboo_planRepository_previousRevision=0788754a5f79541590ecc3ab0cd93605fd3b6237
bamboo_repository_git_branch=3.2.x
bamboo_buildResultKey=PHPBB3-DD32-P5SP-690
bamboo_repository_branch_name=3.2.x
bamboo_buildPlanName=phpBB3 - Development Docker 3.2 - PHP 5.6 - SQLite Package
bamboo_planRepository_1_revision=0fa0013a69118e0126389c921ed59b2c918517e5
bamboo_build_commandline_com_atlassian_bamboo_plugins_bamboo_docker_plugin_task_docker_cli_3=/usr/bin/docker build --force-rm=true --tag=phpbb:php-5.6 /home/bamboo/xml-data/build-dir/PHPBB3-DD32-P5SP
bamboo_repository_name=phpBB Rhea
bamboo_repository_75956229_git_repositoryUrl=https://github.com/phpbb/phpbb.git
bamboo_buildFailed=false
bamboo_capability_system_docker_executable=/usr/bin/docker
bamboo_planRepository_branch=3.2.x
bamboo_agentWorkingDirectory=/home/bamboo/xml-data/build-dir
bamboo_capability_system_git_executable=/usr/bin/git
bamboo_capability_system_builder_phpunit_PHPUnit_3_4=/usr/bin/phpunit
bamboo_repository_git_username=bantu
bamboo_planRepository_1_previousRevision=0788754a5f79541590ecc3ab0cd93605fd3b6237
bamboo_planRepository_branchDisplayName=3.2.x
bamboo_planRepository_1_type=gitv2
bamboo_planRepository_branchName=3.2.x
bamboo_capability_system_jdk_JDK=/usr/lib/jvm/java-6-sun
bamboo_plan_storageTag=PHPBB3-DD32
bamboo_hg_cache_directory=/home/bamboo/xml-data/build-dir/_hg-repositories-cache
bamboo_planRepository_1_username=bantu
bamboo_planRepository_type=gitv2
bamboo_git_cache_directory=/home/bamboo/xml-data/build-dir/_git-repositories-cache
bamboo_repository_git_repositoryUrl=https://github.com/phpbb/phpbb.git
bamboo_capability_system_builder_ant_Ant=/usr/share/ant
bamboo_tmp_directory=/home/bamboo/temp
bamboo_working_directory=/home/bamboo/xml-data/build-dir/PHPBB3-DD32-P5SP
bamboo_planKey=PHPBB3-DD32
bamboo_capability_local=true
bamboo_planRepository_1_repositoryUrl=https://github.com/phpbb/phpbb.git
bamboo_planRepository_username=bantu
bamboo_capability_system_jdk_JDK_1_6=/usr/lib/jvm/java-6-sun
bamboo_capability_system_jdk_JDK_1_7=/usr/lib/jvm/java-7-openjdk-amd64
bamboo_planRepository_1_branchName=3.2.x
21-Mar-2020 16:49:32 Cannot create cache directory /.composer/cache/repo/https---repo.packagist.org/, or directory is not writable. Proceeding without cache
21-Mar-2020 16:49:32 Cannot create cache directory /.composer/cache/files/, or directory is not writable. Proceeding without cache
21-Mar-2020 16:49:32 You are using the deprecated option "dev". Dev packages are installed by default now.
21-Mar-2020 16:49:32 Loading composer repositories with package information
21-Mar-2020 16:49:32 Installing dependencies (including require-dev) from lock file
21-Mar-2020 16:49:33 Package operations: 68 installs, 0 updates, 0 removals
21-Mar-2020 16:49:33   - Installing bantu/ini-get-wrapper (v1.0.1): Downloading (connecting...)Downloading (100%)         
21-Mar-2020 16:49:33   - Installing google/recaptcha (1.1.2): Downloading (connecting...)Downloading (100%)         
21-Mar-2020 16:49:34   - Installing react/promise (v2.7.1): Downloading (connecting...)Downloading (0%)           Downloading (5%)Downloading (15%)Downloading (40%)Downloading (45%)Downloading (55%)Downloading (60%)Downloading (65%)Downloading (70%)Downloading (75%)Downloading (80%)Downloading (100%)
21-Mar-2020 16:49:34   - Installing guzzlehttp/streams (3.0.0): Downloading (connecting...)Downloading (0%)           Downloading (25%)Downloading (35%)Downloading (55%)Downloading (65%)Downloading (90%)Downloading (100%)
21-Mar-2020 16:49:35   - Installing guzzlehttp/ringphp (1.1.1): Downloading (connecting...)Downloading (0%)           Downloading (10%)Downloading (30%)Downloading (40%)Downloading (50%)Downloading (65%)Downloading (75%)Downloading (85%)Downloading (95%)Downloading (100%)
21-Mar-2020 16:49:35   - Installing lusitanian/oauth (v0.8.11): Downloading (connecting...)Downloading (100%)         
21-Mar-2020 16:49:36   - Installing marc1706/fast-image-size (v1.1.6): Downloading (connecting...)Downloading (100%)         
21-Mar-2020 16:49:36   - Installing paragonie/random_compat (v2.0.18): Downloading (connecting...)Downloading (0%)           Downloading (25%)Downloading (35%)Downloading (60%)Downloading (100%)
21-Mar-2020 16:49:37   - Installing patchwork/utf8 (v1.3.2): Downloading (connecting...)Downloading (100%)         
21-Mar-2020 16:49:38   - Installing s9e/text-formatter (1.4.5): Downloading (connecting...)Downloading (100%)         
21-Mar-2020 16:49:38   - Installing symfony/polyfill-ctype (v1.14.0): Downloading (connecting...)Downloading (0%)           Downloading (100%)
21-Mar-2020 16:49:39   - Installing symfony/filesystem (v2.8.52): Downloading (connecting...)Downloading (100%)         
21-Mar-2020 16:49:39   - Installing symfony/config (v2.8.52): Downloading (connecting...)Downloading (100%)         
21-Mar-2020 16:49:40   - Installing symfony/polyfill-util (v1.14.0): Downloading (connecting...)Downloading (100%)         
21-Mar-2020 16:49:40   - Installing symfony/polyfill-php56 (v1.14.0): Downloading (connecting...)Downloading (100%)         
21-Mar-2020 16:49:41   - Installing ircmaxell/password-compat (v1.0.4): Downloading (connecting...)Downloading (0%)           Downloading (100%)
21-Mar-2020 16:49:41   - Installing symfony/polyfill-php55 (v1.14.0): Downloading (connecting...)Downloading (100%)         
21-Mar-2020 16:49:42   - Installing symfony/polyfill-php54 (v1.14.0): Downloading (connecting...)Downloading (100%)         
21-Mar-2020 16:49:42   - Installing symfony/polyfill-mbstring (v1.14.0): Downloading (connecting...)Downloading (0%)           Downloading (30%)Downloading (45%)Downloading (75%)Downloading (100%)
21-Mar-2020 16:49:43   - Installing symfony/http-foundation (v2.8.52): Downloading (connecting...)Downloading (100%)         
21-Mar-2020 16:49:43   - Installing symfony/event-dispatcher (v2.8.52): Downloading (connecting...)Downloading (100%)         
21-Mar-2020 16:49:44   - Installing psr/log (1.1.2): Downloading (connecting...)Downloading (0%)           Downloading (25%)Downloading (95%)Downloading (100%)
21-Mar-2020 16:49:44   - Installing symfony/debug (v2.8.52): Downloading (connecting...)Downloading (100%)         
21-Mar-2020 16:49:45   - Installing symfony/http-kernel (v2.8.52): Downloading (connecting...)Downloading (100%)         
21-Mar-2020 16:49:45   - Installing symfony/dependency-injection (v2.8.52): Downloading (connecting...)Downloading (100%)         
21-Mar-2020 16:49:46   - Installing zendframework/zend-stdlib (2.5.1): Downloading (connecting...)Downloading (100%)         
21-Mar-2020 16:49:47   - Installing zendframework/zend-eventmanager (2.5.1): Downloading (connecting...)Downloading (100%)         
21-Mar-2020 16:49:47   - Installing zendframework/zend-code (2.5.1): Downloading (connecting...)Downloading (100%)         
21-Mar-2020 16:49:48   - Installing ocramius/proxy-manager (1.0.2): Downloading (connecting...)Downloading (100%)         
21-Mar-2020 16:49:48   - Installing symfony/proxy-manager-bridge (v2.8.52): Downloading (connecting...)Downloading (100%)         
21-Mar-2020 16:49:49   - Installing symfony/routing (v2.8.52): Downloading (connecting...)Downloading (100%)         
21-Mar-2020 16:49:50   - Installing twig/twig (v1.42.2): Downloading (connecting...)Downloading (100%)         
21-Mar-2020 16:49:51   - Installing symfony/twig-bridge (v2.8.52): Downloading (connecting...)Downloading (100%)         
21-Mar-2020 16:49:51   - Installing symfony/dom-crawler (v2.8.52): Downloading (connecting...)Downloading (100%)         
21-Mar-2020 16:49:52   - Installing symfony/css-selector (v2.8.52): Downloading (connecting...)Downloading (100%)         
21-Mar-2020 16:49:52   - Installing symfony/browser-kit (v2.8.52): Downloading (connecting...)Downloading (100%)         
21-Mar-2020 16:49:53   - Installing guzzlehttp/guzzle (5.3.4): Downloading (connecting...)Downloading (100%)         
21-Mar-2020 16:49:53   - Installing fabpot/goutte (v2.0.4): Downloading (connecting...)Downloading (100%)         
21-Mar-2020 16:49:54   - Installing facebook/webdriver (1.1.3): Downloading (connecting...)Downloading (0%)           Downloading (100%)
21-Mar-2020 16:49:55   - Installing symfony/process (v2.8.52): Downloading (connecting...)Downloading (100%)         
21-Mar-2020 16:49:56   - Installing symfony/console (v2.8.52): Downloading (connecting...)Downloading (100%)         
21-Mar-2020 16:49:56   - Installing laravel/homestead (v2.2.2): Downloading (connecting...)Downloading (100%)         
21-Mar-2020 16:49:57   - Installing phing/phing (2.4.14): Downloading (connecting...)Downloading (100%)         
21-Mar-2020 16:49:58   - Installing phpdocumentor/reflection-docblock (2.0.5): Downloading (connecting...)Downloading (100%)         
21-Mar-2020 16:49:58   - Installing symfony/yaml (v2.8.52): Downloading (connecting...)Downloading (100%)         
21-Mar-2020 16:49:59   - Installing sebastian/version (1.0.6): Downloading (connecting...)Downloading (0%)           Downloading (100%)
21-Mar-2020 16:49:59   - Installing sebastian/global-state (1.1.1): Downloading (connecting...)Downloading (0%)           GitHub API limit (0 calls/hr) is exhausted, could not fetch https://api.github.com/repos/sebastianbergmann/global-state/zipball/bc37d50fea7d017d3d340f230811c9f1d7280af4. Create a GitHub OAuth token to go over the API rate limit. You can also wait until ? for the rate limit to reset.
21-Mar-2020 16:49:59
21-Mar-2020 16:49:59 Head to https://github.com/settings/tokens/new?scopes=repo&description=Composer+on+aecb9363a313+2020-03-21+1649
21-Mar-2020 16:49:59 to retrieve a token. It will be stored in "/.composer/auth.json" for future use by Composer.
02-May-2020 08:49:59 Error occurred while running Task 'Package release files(2)' of type com.atlassian.bamboo.plugins.bamboo-docker-plugin:task.docker.cli.
02-May-2020 08:49:59 com.atlassian.bamboo.task.TaskException: Failed to execute task
02-May-2020 08:49:59         at com.atlassian.bamboo.plugins.docker.service.RunService.execute(RunService.java:75)
02-May-2020 08:49:59         at com.atlassian.bamboo.plugins.docker.tasks.cli.DockerCliTask.execute(DockerCliTask.java:70)
02-May-2020 08:49:59         at com.atlassian.bamboo.task.TaskExecutorImpl.lambda$executeTasks$3(TaskExecutorImpl.java:285)
02-May-2020 08:49:59         at com.atlassian.bamboo.task.TaskExecutorImpl.executeTaskWithPrePostActions(TaskExecutorImpl.java:224)
02-May-2020 08:49:59         at com.atlassian.bamboo.task.TaskExecutorImpl.executeTasks(TaskExecutorImpl.java:285)
02-May-2020 08:49:59         at com.atlassian.bamboo.task.TaskExecutorImpl.execute(TaskExecutorImpl.java:112)
02-May-2020 08:49:59         at com.atlassian.bamboo.build.pipeline.tasks.ExecuteBuildTask.call(ExecuteBuildTask.java:71)
02-May-2020 08:49:59         at com.atlassian.bamboo.v2.build.agent.DefaultBuildAgent.executeBuildPhase(DefaultBuildAgent.java:203)
02-May-2020 08:49:59         at com.atlassian.bamboo.v2.build.agent.DefaultBuildAgent.build(DefaultBuildAgent.java:175)
02-May-2020 08:49:59         at com.atlassian.bamboo.v2.build.agent.BuildAgentControllerImpl.lambda$waitAndPerformBuild$0(BuildAgentControllerImpl.java:122)
02-May-2020 08:49:59         at com.atlassian.bamboo.variable.CustomVariableContextImpl.withVariableSubstitutor(CustomVariableContextImpl.java:185)
02-May-2020 08:49:59         at com.atlassian.bamboo.v2.build.agent.BuildAgentControllerImpl.waitAndPerformBuild(BuildAgentControllerImpl.java:117)
02-May-2020 08:49:59         at com.atlassian.bamboo.v2.build.agent.DefaultBuildAgent$1.run(DefaultBuildAgent.java:126)
02-May-2020 08:49:59         at com.atlassian.bamboo.utils.BambooRunnables$1.run(BambooRunnables.java:48)
02-May-2020 08:49:59         at com.atlassian.bamboo.security.ImpersonationHelper.runWith(ImpersonationHelper.java:26)
02-May-2020 08:49:59         at com.atlassian.bamboo.security.ImpersonationHelper.runWithSystemAuthority(ImpersonationHelper.java:17)
02-May-2020 08:49:59         at com.atlassian.bamboo.security.ImpersonationHelper$1.run(ImpersonationHelper.java:41)
02-May-2020 08:49:59         at java.lang.Thread.run(Thread.java:748)
02-May-2020 08:49:59 Caused by: com.atlassian.bamboo.docker.DockerException: Error running Docker run command
02-May-2020 08:49:59         at com.atlassian.bamboo.docker.DockerContainerServiceImpl.run(DockerContainerServiceImpl.java:118)
02-May-2020 08:49:59         at sun.reflect.GeneratedMethodAccessor1922.invoke(Unknown Source)
02-May-2020 08:49:59         at sun.reflect.DelegatingMethodAccessorImpl.invoke(DelegatingMethodAccessorImpl.java:43)
02-May-2020 08:49:59         at java.lang.reflect.Method.invoke(Method.java:498)
02-May-2020 08:49:59         at com.atlassian.plugin.util.ContextClassLoaderSettingInvocationHandler.invoke(ContextClassLoaderSettingInvocationHandler.java:26)
02-May-2020 08:49:59         at com.sun.proxy.$Proxy401.run(Unknown Source)
02-May-2020 08:49:59         at sun.reflect.GeneratedMethodAccessor1922.invoke(Unknown Source)
02-May-2020 08:49:59         at sun.reflect.DelegatingMethodAccessorImpl.invoke(DelegatingMethodAccessorImpl.java:43)
02-May-2020 08:49:59         at java.lang.reflect.Method.invoke(Method.java:498)
02-May-2020 08:49:59         at org.springframework.aop.support.AopUtils.invokeJoinpointUsingReflection(AopUtils.java:302)
02-May-2020 08:49:59         at org.eclipse.gemini.blueprint.service.importer.support.internal.aop.ServiceInvoker.doInvoke(ServiceInvoker.java:56)
02-May-2020 08:49:59         at org.eclipse.gemini.blueprint.service.importer.support.internal.aop.ServiceInvoker.invoke(ServiceInvoker.java:60)
02-May-2020 08:49:59         at org.springframework.aop.framework.ReflectiveMethodInvocation.proceed(ReflectiveMethodInvocation.java:179)
02-May-2020 08:49:59         at org.springframework.aop.support.DelegatingIntroductionInterceptor.doProceed(DelegatingIntroductionInterceptor.java:133)
02-May-2020 08:49:59         at org.springframework.aop.support.DelegatingIntroductionInterceptor.invoke(DelegatingIntroductionInterceptor.java:121)
02-May-2020 08:49:59         at org.springframework.aop.framework.ReflectiveMethodInvocation.proceed(ReflectiveMethodInvocation.java:179)
02-May-2020 08:49:59         at org.eclipse.gemini.blueprint.service.util.internal.aop.ServiceTCCLInterceptor.invokeUnprivileged(ServiceTCCLInterceptor.java:70)
02-May-2020 08:49:59         at org.eclipse.gemini.blueprint.service.util.internal.aop.ServiceTCCLInterceptor.invoke(ServiceTCCLInterceptor.java:53)
02-May-2020 08:49:59         at org.springframework.aop.framework.ReflectiveMethodInvocation.proceed(ReflectiveMethodInvocation.java:179)
02-May-2020 08:49:59         at org.eclipse.gemini.blueprint.service.importer.support.LocalBundleContextAdvice.invoke(LocalBundleContextAdvice.java:57)
02-May-2020 08:49:59         at org.springframework.aop.framework.ReflectiveMethodInvocation.proceed(ReflectiveMethodInvocation.java:179)
02-May-2020 08:49:59         at org.springframework.aop.support.DelegatingIntroductionInterceptor.doProceed(DelegatingIntroductionInterceptor.java:133)
02-May-2020 08:49:59         at org.springframework.aop.support.DelegatingIntroductionInterceptor.invoke(DelegatingIntroductionInterceptor.java:121)
02-May-2020 08:49:59         at org.springframework.aop.framework.ReflectiveMethodInvocation.proceed(ReflectiveMethodInvocation.java:179)
02-May-2020 08:49:59         at org.springframework.aop.framework.JdkDynamicAopProxy.invoke(JdkDynamicAopProxy.java:207)
02-May-2020 08:49:59         at com.sun.proxy.$Proxy646.run(Unknown Source)
02-May-2020 08:49:59         at com.atlassian.bamboo.plugins.docker.client.DockerCmd.run(DockerCmd.java:51)
02-May-2020 08:49:59         at com.atlassian.bamboo.plugins.docker.service.RunService.execute(RunService.java:64)
02-May-2020 08:49:59         ... 17 more
02-May-2020 08:49:59 Caused by: com.atlassian.utils.process.ProcessException: Error executing /usr/bin/docker run --volume /home/bamboo/xml-data/build-dir/PHPBB3-DD32-P5SP:/data --workdir /data/phpBB --rm -u=991 --dns=8.8.8.8 -t --volume /home/bamboo/xml-data/build-dir/_git-repositories-cache/:/home/bamboo/xml-data/build-dir/_git-repositories-cache/ phpbb:php-5.6 /bin/bash -c "php ../composer.phar install --dev; cd ../build; git fetch --tags https://github.com/phpbb/phpbb.git 2>&1; ../phpBB/vendor/bin/phing package"
02-May-2020 08:49:59         at com.atlassian.bamboo.docker.DockerContainerServiceImpl.execute(DockerContainerServiceImpl.java:252)
02-May-2020 08:49:59         at com.atlassian.bamboo.docker.DockerContainerServiceImpl.run(DockerContainerServiceImpl.java:106)
02-May-2020 08:49:59         ... 44 more
02-May-2020 08:49:59 Running post build plugin 'NCover Results Collector'
02-May-2020 08:49:59 Running post build plugin 'Artifact Copier'
02-May-2020 08:49:59 Publishing an artifact: Release Files
02-May-2020 08:49:59 Unable to publish artifact [Release Files]: the source directory /home/bamboo/xml-data/build-dir/PHPBB3-DD32-P5SP/build/new_version/release_files does not exist.
02-May-2020 08:49:59 The artifact hasn't been successfully published after 361.5 μs
02-May-2020 08:49:59 Running post build plugin 'npm Cache Cleanup'
02-May-2020 08:49:59 Running post build plugin 'Clover Results Collector'
02-May-2020 08:49:59 Running post build plugin 'Docker Container Cleanup'
02-May-2020 08:50:00 Successfully removed working directory at '/home/bamboo/xml-data/build-dir/PHPBB3-DD32-P5SP'
02-May-2020 08:50:00 Finalising the build...
02-May-2020 08:50:00 Stopping timer.
02-May-2020 08:50:00 Build PHPBB3-DD32-P5SP-690 completed.
02-May-2020 08:50:00 Running on server: post build plugin 'NCover Results Collector'
02-May-2020 08:50:00 Running on server: post build plugin 'Build Hanging Detection Configuration'
02-May-2020 08:50:00 Running on server: post build plugin 'Clover Delta Calculator'
02-May-2020 08:50:00 Running on server: post build plugin 'Maven Dependencies Postprocessor'
02-May-2020 08:50:00 All post build plugins have finished
02-May-2020 08:50:00 Generating build results summary...
02-May-2020 08:50:00 Saving build results to disk...
02-May-2020 08:50:00 Logging substituted variables...
02-May-2020 08:50:00 Indexing build results...
02-May-2020 08:50:00 Finished building PHPBB3-DD32-P5SP-690.