Tests pending pull requests

Build: #4717 failed Manual run by Build Robot

Build result summary

Details

Completed
Duration
5 minutes
Flags
Custom build
Labels
pr_3487
Agent
Default Agent
Revision
6322970766bd9fa78327fa2ca6a6a43d73b680ee 6322970766bd9fa78327fa2ca6a6a43d73b680ee
Total tests
4066
Failing since
#4712 (Manual run by Build Robot – )
Fixed in
#4720 (Manual run by Build Robot)

Tests

Responsible

This build has been failing since #4712
No one has taken responsibility

Custom variables

Name Value
PRnumber 3487

Tests

Existing test failures 4
Status Test Failing since View job Duration
phpbb_session_check_ban_test::test_check_is_banned with data set #0 ('All false values, should not be banned', false, false, false, false, false)
Exception: Could not find service: filesystem

/home/bamboo/xml-data/build-dir/131073/PHPBB3-PR-JOB1/tests/mock/container_builder.php:58
/home/bamboo/xml-data/build-dir/131073/PHPBB3-PR-JOB1/phpBB/phpbb/cache/driver/file.php:38
/home/bamboo/xml-data/build-dir/131073/PHPBB3-PR-JOB1/tests/session/check_ban_test.php:54
phpbb_session_check_ban_test::test_check_is_banned with data set #2 ('IP Banned, should be banned', false, '127.1.1.1', false, false, true)
Exception: Could not find service: filesystem

/home/bamboo/xml-data/build-dir/131073/PHPBB3-PR-JOB1/tests/mock/container_builder.php:58
/home/bamboo/xml-data/build-dir/131073/PHPBB3-PR-JOB1/phpBB/phpbb/cache/driver/file.php:38
/home/bamboo/xml-data/build-dir/131073/PHPBB3-PR-JOB1/tests/session/check_ban_test.php:54
phpbb_session_check_ban_test::test_check_is_banned with data set #1 ('Matching values in the database, should be banned', 4, '127.0.0.1', 'bar@example.org', true, true)
Exception: Could not find service: filesystem

/home/bamboo/xml-data/build-dir/131073/PHPBB3-PR-JOB1/tests/mock/container_builder.php:58
/home/bamboo/xml-data/build-dir/131073/PHPBB3-PR-JOB1/phpBB/phpbb/cache/driver/file.php:38
/home/bamboo/xml-data/build-dir/131073/PHPBB3-PR-JOB1/tests/session/check_ban_test.php:54
phpbb_session_extract_page_test::test_extract_current_page with data set #6 ('./../phpBB/', '/test/test.php', 'page=1&test=2', '/test/', '', array('test.php', 'page=1&test=2', '/test/', 0))
implode(): Invalid arguments passed

/home/bamboo/xml-data/build-dir/131073/PHPBB3-PR-JOB1/phpBB/phpbb/filesystem/filesystem.php:809
/home/bamboo/xml-data/build-dir/131073/PHPBB3-PR-JOB1/phpBB/phpbb/filesystem/filesystem.php:719
/home/bamboo/xml-data/build-dir/131073/PHPBB3-PR-JOB1/phpBB/phpbb/filesystem/filesystem.php:500
/home/bamboo/xml-data/build-dir/131073/PHPBB3-PR-JOB1/phpBB/phpbb/session.php:95
/home/bamboo/xml-data/build-dir/131073/PHPBB3-PR-JOB1/tests/session/extract_page_test.php:166
Fixed tests 565
Status Test Failing since View job Duration
Successful phpbb_avatar_manager_test test_get_enabled_drivers History
Failing since build #4716 (Manual run by Build Robot) Build and Test Job < 1 sec
Successful phpbb_avatar_manager_test test_get_all_drivers History
Failing since build #4716 (Manual run by Build Robot) Build and Test Job < 1 sec
Successful phpbb_avatar_manager_test::test_clean_row test_prepare_driver_name History
Failing since build #4716 (Manual run by Build Robot) Build and Test Job < 1 sec
Successful phpbb_avatar_manager_test::test_clean_row test_clean_row with data set #0 History
Failing since build #4716 (Manual run by Build Robot) Build and Test Job < 1 sec
Successful phpbb_avatar_manager_test::test_clean_row test_clean_row with data set #1 History
Failing since build #4716 (Manual run by Build Robot) Build and Test Job < 1 sec
Successful phpbb_avatar_manager_test::test_clean_row test_clean_row with data set #2 History
Failing since build #4716 (Manual run by Build Robot) Build and Test Job < 1 sec
Successful phpbb_avatar_manager_test::test_clean_row test_clean_row with data set #3 History
Failing since build #4716 (Manual run by Build Robot) Build and Test Job < 1 sec
Successful phpbb_avatar_manager_test::test_clean_row test_clean_row with data set #4 History
Failing since build #4716 (Manual run by Build Robot) Build and Test Job < 1 sec
Successful phpbb_avatar_manager_test::test_clean_row test_localize_errors History
Failing since build #4716 (Manual run by Build Robot) Build and Test Job < 1 sec
Successful phpbb_avatar_manager_test::test_clean_row test_clean_driver_name History
Failing since build #4716 (Manual run by Build Robot) Build and Test Job < 1 sec
Successful phpbb_avatar_manager_test::test_get_driver_all test_get_avatar_settings History
Failing since build #4716 (Manual run by Build Robot) Build and Test Job < 1 sec
Successful phpbb_avatar_manager_test::test_get_driver_all test_get_driver_all with data set #1 History
Failing since build #4716 (Manual run by Build Robot) Build and Test Job < 1 sec
Successful phpbb_avatar_manager_test::test_get_driver_all test_get_driver_all with data set #2 History
Failing since build #4716 (Manual run by Build Robot) Build and Test Job < 1 sec
Successful phpbb_avatar_manager_test::test_get_driver_all test_get_driver_all with data set #3 History
Failing since build #4716 (Manual run by Build Robot) Build and Test Job < 1 sec
Successful phpbb_avatar_manager_test::test_get_driver_all test_get_driver_all with data set #4 History
Failing since build #4716 (Manual run by Build Robot) Build and Test Job < 1 sec
Successful phpbb_avatar_manager_test::test_get_driver_all test_get_driver_all with data set #0 History
Failing since build #4716 (Manual run by Build Robot) Build and Test Job < 1 sec
Successful phpbb_avatar_manager_test::test_get_driver_all test_get_driver_all with data set #5 History
Failing since build #4716 (Manual run by Build Robot) Build and Test Job < 1 sec
Successful phpbb_avatar_manager_test::test_get_driver_enabled test_get_driver_enabled with data set #6 History
Failing since build #4716 (Manual run by Build Robot) Build and Test Job < 1 sec
Successful phpbb_avatar_manager_test::test_get_driver_enabled test_get_driver_enabled with data set #5 History
Failing since build #4716 (Manual run by Build Robot) Build and Test Job < 1 sec
Successful phpbb_avatar_manager_test::test_get_driver_enabled test_get_driver_enabled with data set #1 History
Failing since build #4716 (Manual run by Build Robot) Build and Test Job < 1 sec
Successful phpbb_avatar_manager_test::test_get_driver_enabled test_get_driver_enabled with data set #2 History
Failing since build #4716 (Manual run by Build Robot) Build and Test Job < 1 sec
Successful phpbb_avatar_manager_test::test_get_driver_enabled test_get_driver_enabled with data set #3 History
Failing since build #4716 (Manual run by Build Robot) Build and Test Job < 1 sec
Successful phpbb_avatar_manager_test::test_get_driver_enabled test_get_driver_enabled with data set #4 History
Failing since build #4716 (Manual run by Build Robot) Build and Test Job < 1 sec
Successful phpbb_avatar_manager_test::test_get_driver_enabled test_get_driver_enabled with data set #0 History
Failing since build #4716 (Manual run by Build Robot) Build and Test Job < 1 sec
Successful phpbb_avatar_manager_test::test_handle_avatar_delete test_user_group_avatar_deleted History
Failing since build #4716 (Manual run by Build Robot) Build and Test Job < 1 sec
Successful phpbb_avatar_manager_test::test_handle_avatar_delete test_handle_avatar_delete with data set #0 History
Failing since build #4716 (Manual run by Build Robot) Build and Test Job < 1 sec
Successful phpbb_avatar_manager_test::test_handle_avatar_delete test_handle_avatar_delete with data set #1 History
Failing since build #4716 (Manual run by Build Robot) Build and Test Job < 1 sec
Successful phpbb_controller_controller_test test_router_find_files History
Failing since build #4716 (Manual run by Build Robot) Build and Test Job < 1 sec
Successful phpbb_controller_helper_route_adm_subdir_test::test_helper_url_absolute test_helper_url_absolute with data set #10 History
Failing since build #4716 (Manual run by Build Robot) Build and Test Job < 1 sec
Successful phpbb_controller_helper_route_adm_subdir_test::test_helper_url_absolute test_helper_url_absolute with data set #11 History
Failing since build #4716 (Manual run by Build Robot) Build and Test Job < 1 sec
Successful phpbb_controller_helper_route_adm_subdir_test::test_helper_url_absolute test_helper_url_absolute with data set #12 History
Failing since build #4716 (Manual run by Build Robot) Build and Test Job < 1 sec
Successful phpbb_controller_helper_route_adm_subdir_test::test_helper_url_absolute test_helper_url_absolute with data set #13 History
Failing since build #4716 (Manual run by Build Robot) Build and Test Job < 1 sec
Successful phpbb_controller_helper_route_adm_subdir_test::test_helper_url_absolute test_helper_url_absolute with data set #14 History
Failing since build #4716 (Manual run by Build Robot) Build and Test Job < 1 sec
Successful phpbb_controller_helper_route_adm_subdir_test::test_helper_url_absolute test_helper_url_absolute with data set #15 History
Failing since build #4716 (Manual run by Build Robot) Build and Test Job < 1 sec
Successful phpbb_controller_helper_route_adm_subdir_test::test_helper_url_absolute test_helper_url_absolute with data set #2 History
Failing since build #4716 (Manual run by Build Robot) Build and Test Job < 1 sec
Successful phpbb_controller_helper_route_adm_subdir_test::test_helper_url_absolute test_helper_url_absolute with data set #3 History
Failing since build #4716 (Manual run by Build Robot) Build and Test Job < 1 sec
Successful phpbb_controller_helper_route_adm_subdir_test::test_helper_url_absolute test_helper_url_absolute with data set #4 History
Failing since build #4716 (Manual run by Build Robot) Build and Test Job < 1 sec
Successful phpbb_controller_helper_route_adm_subdir_test::test_helper_url_absolute test_helper_url_absolute with data set #5 History
Failing since build #4716 (Manual run by Build Robot) Build and Test Job < 1 sec
Successful phpbb_controller_helper_route_adm_subdir_test::test_helper_url_absolute test_helper_url_absolute with data set #6 History
Failing since build #4716 (Manual run by Build Robot) Build and Test Job < 1 sec
Successful phpbb_controller_helper_route_adm_subdir_test::test_helper_url_absolute test_helper_url_absolute with data set #7 History
Failing since build #4716 (Manual run by Build Robot) Build and Test Job < 1 sec
Successful phpbb_controller_helper_route_adm_subdir_test::test_helper_url_absolute test_helper_url_absolute with data set #8 History
Failing since build #4716 (Manual run by Build Robot) Build and Test Job < 1 sec
Successful phpbb_controller_helper_route_adm_subdir_test::test_helper_url_absolute test_helper_url_absolute with data set #9 History
Failing since build #4716 (Manual run by Build Robot) Build and Test Job < 1 sec
Successful phpbb_controller_helper_route_adm_subdir_test::test_helper_url_absolute test_helper_url_absolute with data set #1 History
Failing since build #4716 (Manual run by Build Robot) Build and Test Job < 1 sec
Successful phpbb_controller_helper_route_adm_subdir_test::test_helper_url_absolute test_helper_url_absolute with data set #0 History
Failing since build #4716 (Manual run by Build Robot) Build and Test Job < 1 sec
Successful phpbb_controller_helper_route_adm_subdir_test::test_helper_url_absolute_with_rewrite test_helper_url_absolute_with_rewrite with data set #10 History
Failing since build #4716 (Manual run by Build Robot) Build and Test Job < 1 sec
Successful phpbb_controller_helper_route_adm_subdir_test::test_helper_url_absolute_with_rewrite test_helper_url_absolute_with_rewrite with data set #11 History
Failing since build #4716 (Manual run by Build Robot) Build and Test Job < 1 sec
Successful phpbb_controller_helper_route_adm_subdir_test::test_helper_url_absolute_with_rewrite test_helper_url_absolute_with_rewrite with data set #12 History
Failing since build #4716 (Manual run by Build Robot) Build and Test Job < 1 sec
Successful phpbb_controller_helper_route_adm_subdir_test::test_helper_url_absolute_with_rewrite test_helper_url_absolute_with_rewrite with data set #14 History
Failing since build #4716 (Manual run by Build Robot) Build and Test Job < 1 sec
Successful phpbb_controller_helper_route_adm_subdir_test::test_helper_url_absolute_with_rewrite test_helper_url_absolute_with_rewrite with data set #13 History
Failing since build #4716 (Manual run by Build Robot) Build and Test Job < 1 sec
Successful phpbb_controller_helper_route_adm_subdir_test::test_helper_url_absolute_with_rewrite test_helper_url_absolute_with_rewrite with data set #15 History
Failing since build #4716 (Manual run by Build Robot) Build and Test Job < 1 sec