Tests pending pull requests

Build: #4766 failed Manual run by Build Robot

Build result summary

Details

Completed
Duration
5 minutes
Flags
Custom build
Labels
pr_3487
Agent
Default Agent
Revision
6322970766bd9fa78327fa2ca6a6a43d73b680ee 6322970766bd9fa78327fa2ca6a6a43d73b680ee
Total tests
4072
Failing since
#4764 (Manual run by Build Robot – )
Fixed in
#4769 (Manual run by Build Robot)

Tests

Responsible

This build has been failing since #4764
No one has taken responsibility

Custom variables

Name Value
PRnumber 3487

Tests

New test failures 5
Status Test View job Duration
Collapse Failed phpbb_filesystem_realpath_test::test_realpath_absolute_links test_realpath_absolute_links with data set #0 History
Build and Test Job < 1 sec
phpbb_filesystem_realpath_test::test_realpath_absolute_links with data set #0 ('/home/bamboo/xml-data/build-dir/131073/PHPBB3-PR-JOB1/tests/filesystem', '/home/bamboo/xml-data/build-dir/131073/PHPBB3-PR-JOB1/tests/filesystem')
ReflectionException: Non-object passed to Invoke()

/home/bamboo/xml-data/build-dir/131073/PHPBB3-PR-JOB1/tests/filesystem/realpath_test.php:54
Collapse Failed phpbb_filesystem_realpath_test::test_realpath_absolute_links test_realpath_absolute_links with data set #4 History
Build and Test Job < 1 sec
phpbb_filesystem_realpath_test::test_realpath_absolute_links with data set #4 ('/home/bamboo/xml-data/build-dir/131073/PHPBB3-PR-JOB1/tests/filesystem/realpath_test.php', '/home/bamboo/xml-data/build-dir/131073/PHPBB3-PR-JOB1/tests/filesystem/realpath_test.php')
ReflectionException: Non-object passed to Invoke()

/home/bamboo/xml-data/build-dir/131073/PHPBB3-PR-JOB1/tests/filesystem/realpath_test.php:54
Collapse Failed phpbb_filesystem_realpath_test::test_realpath_absolute_links test_realpath_absolute_links with data set #3 History
Build and Test Job < 1 sec
phpbb_filesystem_realpath_test::test_realpath_absolute_links with data set #3 ('/home/bamboo/xml-data/build-dir/131073/PHPBB3-PR-JOB1/tests/filesystem/non_existent', false)
ReflectionException: Non-object passed to Invoke()

/home/bamboo/xml-data/build-dir/131073/PHPBB3-PR-JOB1/tests/filesystem/realpath_test.php:54
Collapse Failed phpbb_filesystem_realpath_test::test_realpath_absolute_links test_realpath_absolute_links with data set #2 History
Build and Test Job < 1 sec
phpbb_filesystem_realpath_test::test_realpath_absolute_links with data set #2 ('/home/bamboo/xml-data/build-dir/131073/PHPBB3-PR-JOB1/tests/filesystem/././', '/home/bamboo/xml-data/build-dir/131073/PHPBB3-PR-JOB1/tests/filesystem')
ReflectionException: Non-object passed to Invoke()

/home/bamboo/xml-data/build-dir/131073/PHPBB3-PR-JOB1/tests/filesystem/realpath_test.php:54
Collapse Failed phpbb_filesystem_realpath_test::test_realpath_absolute_links test_realpath_absolute_links with data set #1 History
Build and Test Job < 1 sec
phpbb_filesystem_realpath_test::test_realpath_absolute_links with data set #1 ('/home/bamboo/xml-data/build-dir/131073/PHPBB3-PR-JOB1/tests/filesystem/../filesystem/../filesystem', '/home/bamboo/xml-data/build-dir/131073/PHPBB3-PR-JOB1/tests/filesystem')
ReflectionException: Non-object passed to Invoke()

/home/bamboo/xml-data/build-dir/131073/PHPBB3-PR-JOB1/tests/filesystem/realpath_test.php:54