Tests pending pull requests

Build: #6063 failed Manual run by Build Robot

Build result summary

Details

Completed
Duration
9 minutes
Flags
Custom build
Labels
pr_3995
Agent
Default Agent
Revision
6a7567459d62c8c186c5b1b36dc5345e5d36461a 6a7567459d62c8c186c5b1b36dc5345e5d36461a
Total tests
6313
Fixed in
#6065 (Manual run by Build Robot)

Responsible

No one has taken responsibility for this failure

Custom variables

Name Value
PRnumber 3995
PRref master

Tests

New test failures 791
Status Test View job Duration
Collapse Failed phpbb_attachment_delete_test::test_attachment_delete test_attachment_delete with data set #7 History
Build and Test Job < 1 sec
phpbb_attachment_delete_test::test_attachment_delete with data set #7 ('topic', 1, true, 3)
PHPUnit_Extensions_Database_Operation_Exception: COMPOSITE[TRUNCATE] operation failed on query: 
                DELETE FROM "phpbb_topics"
             using args: Array
(
)
 [SQLSTATE[HY000]: General error: 1 no such table: phpbb_topics]

(2 more lines...)
Collapse Failed phpbb_attachment_delete_test::test_attachment_delete test_attachment_delete with data set #8 History
Build and Test Job < 1 sec
phpbb_attachment_delete_test::test_attachment_delete with data set #8 ('user', 1, false, 0)
PHPUnit_Extensions_Database_Operation_Exception: COMPOSITE[TRUNCATE] operation failed on query: 
                DELETE FROM "phpbb_topics"
             using args: Array
(
)
 [SQLSTATE[HY000]: General error: 1 no such table: phpbb_topics]

(2 more lines...)
Collapse Failed phpbb_attachment_delete_test::test_attachment_delete test_attachment_delete with data set #5 History
Build and Test Job < 1 sec
phpbb_attachment_delete_test::test_attachment_delete with data set #5 ('post', 5, false, 0)
PHPUnit_Extensions_Database_Operation_Exception: COMPOSITE[TRUNCATE] operation failed on query: 
                DELETE FROM "phpbb_topics"
             using args: Array
(
)
 [SQLSTATE[HY000]: General error: 1 no such table: phpbb_topics]

(2 more lines...)
Collapse Failed phpbb_attachment_delete_test::test_attachment_delete test_attachment_delete with data set #6 History
Build and Test Job < 1 sec
phpbb_attachment_delete_test::test_attachment_delete with data set #6 ('topic', 5, false, 0)
PHPUnit_Extensions_Database_Operation_Exception: COMPOSITE[TRUNCATE] operation failed on query: 
                DELETE FROM "phpbb_topics"
             using args: Array
(
)
 [SQLSTATE[HY000]: General error: 1 no such table: phpbb_topics]

(2 more lines...)
Collapse Failed phpbb_attachment_delete_test::test_attachment_delete test_attachment_delete with data set #0 History
Build and Test Job < 1 sec
phpbb_attachment_delete_test::test_attachment_delete with data set #0 ('attach', '', false, false)
PHPUnit_Extensions_Database_Operation_Exception: COMPOSITE[TRUNCATE] operation failed on query: 
                DELETE FROM "phpbb_topics"
             using args: Array
(
)
 [SQLSTATE[HY000]: General error: 1 no such table: phpbb_topics]

(2 more lines...)
Collapse Failed phpbb_attachment_delete_test::test_attachment_delete test_attachment_delete with data set #3 History
Build and Test Job < 1 sec
phpbb_attachment_delete_test::test_attachment_delete with data set #3 ('attach', array(1, 2), false, 2)
PHPUnit_Extensions_Database_Operation_Exception: COMPOSITE[TRUNCATE] operation failed on query: 
                DELETE FROM "phpbb_topics"
             using args: Array
(
)
 [SQLSTATE[HY000]: General error: 1 no such table: phpbb_topics]

(2 more lines...)
Collapse Failed phpbb_attachment_delete_test::test_attachment_delete test_attachment_delete with data set #4 History
Build and Test Job < 1 sec
phpbb_attachment_delete_test::test_attachment_delete with data set #4 ('attach', array(1, 2), true, 2)
PHPUnit_Extensions_Database_Operation_Exception: COMPOSITE[TRUNCATE] operation failed on query: 
                DELETE FROM "phpbb_topics"
             using args: Array
(
)
 [SQLSTATE[HY000]: General error: 1 no such table: phpbb_topics]

(2 more lines...)
Collapse Failed phpbb_attachment_delete_test::test_attachment_delete test_attachment_delete with data set #1 History
Build and Test Job < 1 sec
phpbb_attachment_delete_test::test_attachment_delete with data set #1 ('meh', 5, false, 0)
PHPUnit_Extensions_Database_Operation_Exception: COMPOSITE[TRUNCATE] operation failed on query: 
                DELETE FROM "phpbb_topics"
             using args: Array
(
)
 [SQLSTATE[HY000]: General error: 1 no such table: phpbb_topics]

(2 more lines...)
Collapse Failed phpbb_attachment_delete_test::test_attachment_delete test_attachment_delete with data set #2 History
Build and Test Job < 1 sec
phpbb_attachment_delete_test::test_attachment_delete with data set #2 ('attach', array(5), false, 0)
PHPUnit_Extensions_Database_Operation_Exception: COMPOSITE[TRUNCATE] operation failed on query: 
                DELETE FROM "phpbb_topics"
             using args: Array
(
)
 [SQLSTATE[HY000]: General error: 1 no such table: phpbb_topics]

(2 more lines...)
Collapse Failed phpbb_attachment_delete_test::test_attachment_delete_success test_attachment_delete_success with data set #0 History
Build and Test Job < 1 sec
phpbb_attachment_delete_test::test_attachment_delete_success with data set #0 (true, true, true)
PHPUnit_Extensions_Database_Operation_Exception: COMPOSITE[TRUNCATE] operation failed on query: 
                DELETE FROM "phpbb_topics"
             using args: Array
(
)
 [SQLSTATE[HY000]: General error: 1 no such table: phpbb_topics]

(2 more lines...)
Collapse Failed phpbb_attachment_delete_test::test_attachment_delete_success test_attachment_delete_success with data set #1 History
Build and Test Job < 1 sec
phpbb_attachment_delete_test::test_attachment_delete_success with data set #1 (true, false, false)
PHPUnit_Extensions_Database_Operation_Exception: COMPOSITE[TRUNCATE] operation failed on query: 
                DELETE FROM "phpbb_topics"
             using args: Array
(
)
 [SQLSTATE[HY000]: General error: 1 no such table: phpbb_topics]

(2 more lines...)
Collapse Failed phpbb_attachment_delete_test::test_attachment_delete_success test_attachment_delete_success with data set #2 History
Build and Test Job < 1 sec
phpbb_attachment_delete_test::test_attachment_delete_success with data set #2 (true, true, false, true)
PHPUnit_Extensions_Database_Operation_Exception: COMPOSITE[TRUNCATE] operation failed on query: 
                DELETE FROM "phpbb_topics"
             using args: Array
(
)
 [SQLSTATE[HY000]: General error: 1 no such table: phpbb_topics]

(2 more lines...)
Collapse Failed phpbb_attachment_resync_test::test_resync test_resync with data set #1 History
Build and Test Job < 1 sec
phpbb_attachment_resync_test::test_resync with data set #1 ('post', array(1), 'post_id', 'posts', array('1'), array('1'))
PHPUnit_Extensions_Database_Operation_Exception: COMPOSITE[TRUNCATE] operation failed on query: 
                DELETE FROM "phpbb_topics"
             using args: Array
(
)
 [SQLSTATE[HY000]: General error: 1 no such table: phpbb_topics]

(2 more lines...)
Collapse Failed phpbb_attachment_resync_test::test_resync test_resync with data set #0 History
Build and Test Job < 1 sec
phpbb_attachment_resync_test::test_resync with data set #0 ('', array(1), 'post_id', 'posts', array('1'), array('1'))
PHPUnit_Extensions_Database_Operation_Exception: COMPOSITE[TRUNCATE] operation failed on query: 
                DELETE FROM "phpbb_topics"
             using args: Array
(
)
 [SQLSTATE[HY000]: General error: 1 no such table: phpbb_topics]

(2 more lines...)
Collapse Failed phpbb_attachment_resync_test::test_resync test_resync with data set #3 History
Build and Test Job < 1 sec
phpbb_attachment_resync_test::test_resync with data set #3 ('topic', array(1), 'topic_id', 'topics', array('1'), array('1'))
PHPUnit_Extensions_Database_Operation_Exception: COMPOSITE[TRUNCATE] operation failed on query: 
                DELETE FROM "phpbb_topics"
             using args: Array
(
)
 [SQLSTATE[HY000]: General error: 1 no such table: phpbb_topics]

(2 more lines...)
Collapse Failed phpbb_attachment_resync_test::test_resync test_resync with data set #2 History
Build and Test Job < 1 sec
phpbb_attachment_resync_test::test_resync with data set #2 ('post', array(2), 'post_id', 'posts', array('1'), array('0'))
PHPUnit_Extensions_Database_Operation_Exception: COMPOSITE[TRUNCATE] operation failed on query: 
                DELETE FROM "phpbb_topics"
             using args: Array
(
)
 [SQLSTATE[HY000]: General error: 1 no such table: phpbb_topics]

(2 more lines...)
Collapse Failed phpbb_attachment_resync_test::test_resync test_resync with data set #5 History
Build and Test Job < 1 sec
phpbb_attachment_resync_test::test_resync with data set #5 ('message', array(1), 'msg_id', 'privmsgs', array('1'), array('1'))
PHPUnit_Extensions_Database_Operation_Exception: COMPOSITE[TRUNCATE] operation failed on query: 
                DELETE FROM "phpbb_topics"
             using args: Array
(
)
 [SQLSTATE[HY000]: General error: 1 no such table: phpbb_topics]

(2 more lines...)
Collapse Failed phpbb_attachment_resync_test::test_resync test_resync with data set #4 History
Build and Test Job < 1 sec
phpbb_attachment_resync_test::test_resync with data set #4 ('topic', array(2), 'topic_id', 'topics', array('1'), array('0'))
PHPUnit_Extensions_Database_Operation_Exception: COMPOSITE[TRUNCATE] operation failed on query: 
                DELETE FROM "phpbb_topics"
             using args: Array
(
)
 [SQLSTATE[HY000]: General error: 1 no such table: phpbb_topics]

(2 more lines...)
Collapse Failed phpbb_attachment_resync_test::test_resync test_resync with data set #6 History
Build and Test Job < 1 sec
phpbb_attachment_resync_test::test_resync with data set #6 ('message', array(2), 'msg_id', 'privmsgs', array('1'), array('0'))
PHPUnit_Extensions_Database_Operation_Exception: COMPOSITE[TRUNCATE] operation failed on query: 
                DELETE FROM "phpbb_topics"
             using args: Array
(
)
 [SQLSTATE[HY000]: General error: 1 no such table: phpbb_topics]

(2 more lines...)
Collapse Failed phpbb_attachment_upload_test::test_image_upload test_image_upload with data set #0 History
Build and Test Job < 1 sec
phpbb_attachment_upload_test::test_image_upload with data set #0 (false, false, array(), array(array('The image file you tried to attach is invalid.'), false, 1))
PHPUnit_Extensions_Database_Operation_Exception: COMPOSITE[TRUNCATE] operation failed on query: 
                DELETE FROM "phpbb_topics"
             using args: Array
(
)
 [SQLSTATE[HY000]: General error: 1 no such table: phpbb_topics]

(2 more lines...)
Collapse Failed phpbb_attachment_upload_test::test_image_upload test_image_upload with data set #4 History
Build and Test Job < 1 sec
phpbb_attachment_upload_test::test_image_upload with data set #4 (true, false, array(150), array(array(), true, 0, 100, 'jpg', 'jpg', 'foobar.jpg'))
PHPUnit_Extensions_Database_Operation_Exception: COMPOSITE[TRUNCATE] operation failed on query: 
                DELETE FROM "phpbb_topics"
             using args: Array
(
)
 [SQLSTATE[HY000]: General error: 1 no such table: phpbb_topics]

(2 more lines...)
Collapse Failed phpbb_attachment_upload_test::test_image_upload test_image_upload with data set #3 History
Build and Test Job < 1 sec
phpbb_attachment_upload_test::test_image_upload with data set #3 (true, false, array(true, ''), array(array(), true, 0, 100, 'jpg', 'jpg', 'foobar.jpg'))
PHPUnit_Extensions_Database_Operation_Exception: COMPOSITE[TRUNCATE] operation failed on query: 
                DELETE FROM "phpbb_topics"
             using args: Array
(
)
 [SQLSTATE[HY000]: General error: 1 no such table: phpbb_topics]

(2 more lines...)
Collapse Failed phpbb_attachment_upload_test::test_image_upload test_image_upload with data set #2 History
Build and Test Job < 1 sec
phpbb_attachment_upload_test::test_image_upload with data set #2 (true, false, array(), array(array(), true, 0, 100, 'jpg', 'jpg', 'foobar.jpg'))
PHPUnit_Extensions_Database_Operation_Exception: COMPOSITE[TRUNCATE] operation failed on query: 
                DELETE FROM "phpbb_topics"
             using args: Array
(
)
 [SQLSTATE[HY000]: General error: 1 no such table: phpbb_topics]

(2 more lines...)
Collapse Failed phpbb_attachment_upload_test::test_image_upload test_image_upload with data set #1 History
Build and Test Job < 1 sec
phpbb_attachment_upload_test::test_image_upload with data set #1 (false, true, array(), array(array('The image file you tried to attach is invalid.'), false, 1))
PHPUnit_Extensions_Database_Operation_Exception: COMPOSITE[TRUNCATE] operation failed on query: 
                DELETE FROM "phpbb_topics"
             using args: Array
(
)
 [SQLSTATE[HY000]: General error: 1 no such table: phpbb_topics]

(2 more lines...)
Collapse Failed phpbb_attachment_upload_test::test_image_upload test_image_upload with data set #5 History
Build and Test Job < 1 sec
phpbb_attachment_upload_test::test_image_upload with data set #5 (true, false, array(50), array(array('ATTACH_QUOTA_REACHED'), false, 1, 100, 'jpg', 'jpg', 'foobar.jpg'))
PHPUnit_Extensions_Database_Operation_Exception: COMPOSITE[TRUNCATE] operation failed on query: 
                DELETE FROM "phpbb_topics"
             using args: Array
(
)
 [SQLSTATE[HY000]: General error: 1 no such table: phpbb_topics]

(2 more lines...)
Collapse Failed phpbb_attachment_upload_test::test_upload test_init_error History
Build and Test Job < 1 sec
phpbb_attachment_upload_test::test_init_error
PHPUnit_Extensions_Database_Operation_Exception: COMPOSITE[TRUNCATE] operation failed on query: 
                DELETE FROM "phpbb_topics"
             using args: Array
(
)
 [SQLSTATE[HY000]: General error: 1 no such table: phpbb_topics]

(2 more lines...)
Collapse Failed phpbb_attachment_upload_test::test_upload test_upload with data set #1 History
Build and Test Job < 1 sec
phpbb_attachment_upload_test::test_upload with data set #1 ('foobar', 1, true, array('foobar.jpg', 'jpg', 100), array(array('NOT_UPLOADED', 'The image file you tried to attach is invalid.'), false, 1))
PHPUnit_Extensions_Database_Operation_Exception: COMPOSITE[TRUNCATE] operation failed on query: 
                DELETE FROM "phpbb_topics"
             using args: Array
(
)
 [SQLSTATE[HY000]: General error: 1 no such table: phpbb_topics]

(2 more lines...)
Collapse Failed phpbb_attachment_upload_test::test_upload test_upload with data set #2 History
Build and Test Job < 1 sec
phpbb_attachment_upload_test::test_upload with data set #2 ('foobar', 1, true, array(), array(array('NOT_UPLOADED'), false, 0))
PHPUnit_Extensions_Database_Operation_Exception: COMPOSITE[TRUNCATE] operation failed on query: 
                DELETE FROM "phpbb_topics"
             using args: Array
(
)
 [SQLSTATE[HY000]: General error: 1 no such table: phpbb_topics]

(2 more lines...)
Collapse Failed phpbb_attachment_upload_test::test_upload test_upload with data set #0 History
Build and Test Job < 1 sec
phpbb_attachment_upload_test::test_upload with data set #0 ('foobar', 1, false, array(), array(array('Upload initiated but no valid file upload form found.'), false))
PHPUnit_Extensions_Database_Operation_Exception: COMPOSITE[TRUNCATE] operation failed on query: 
                DELETE FROM "phpbb_topics"
             using args: Array
(
)
 [SQLSTATE[HY000]: General error: 1 no such table: phpbb_topics]

(2 more lines...)
Collapse Failed phpbb_auth_provider_apache_test test_autologin History
Build and Test Job < 1 sec
phpbb_auth_provider_apache_test::test_autologin
PHPUnit_Extensions_Database_Operation_Exception: COMPOSITE[TRUNCATE] operation failed on query: 
                DELETE FROM "phpbb_users"
             using args: Array
(
)
 [SQLSTATE[HY000]: General error: 1 no such table: phpbb_users]

(2 more lines...)
Collapse Failed phpbb_auth_provider_apache_test test_login History
Build and Test Job < 1 sec
phpbb_auth_provider_apache_test::test_login
PHPUnit_Extensions_Database_Operation_Exception: COMPOSITE[TRUNCATE] operation failed on query: 
                DELETE FROM "phpbb_users"
             using args: Array
(
)
 [SQLSTATE[HY000]: General error: 1 no such table: phpbb_users]

(2 more lines...)
Collapse Failed phpbb_auth_provider_apache_test test_init History
Build and Test Job < 1 sec
phpbb_auth_provider_apache_test::test_init
PHPUnit_Extensions_Database_Operation_Exception: COMPOSITE[TRUNCATE] operation failed on query: 
                DELETE FROM "phpbb_users"
             using args: Array
(
)
 [SQLSTATE[HY000]: General error: 1 no such table: phpbb_users]

(2 more lines...)
Collapse Failed phpbb_auth_provider_apache_test test_validate_session History
Build and Test Job < 1 sec
phpbb_auth_provider_apache_test::test_validate_session
PHPUnit_Extensions_Database_Operation_Exception: COMPOSITE[TRUNCATE] operation failed on query: 
                DELETE FROM "phpbb_users"
             using args: Array
(
)
 [SQLSTATE[HY000]: General error: 1 no such table: phpbb_users]

(2 more lines...)
Collapse Failed phpbb_auth_provider_db_test test_login History
Build and Test Job < 1 sec
phpbb_auth_provider_db_test::test_login
PHPUnit_Extensions_Database_Operation_Exception: COMPOSITE[TRUNCATE] operation failed on query: 
                DELETE FROM "phpbb_users"
             using args: Array
(
)
 [SQLSTATE[HY000]: General error: 1 no such table: phpbb_users]

(1 more lines...)
Collapse Failed phpbb_auth_provider_oauth_token_storage_test::test_hasAccessToken test_hasAccessToken with data set #0 History
Build and Test Job < 1 sec
phpbb_auth_provider_oauth_token_storage_test::test_hasAccessToken with data set #0 (NULL, false)
PHPUnit_Extensions_Database_Operation_Exception: COMPOSITE[TRUNCATE] operation failed on query: 
                DELETE FROM "phpbb_oauth_tokens"
             using args: Array
(
)
 [SQLSTATE[HY000]: General error: 1 no such table: phpbb_oauth_tokens]

(2 more lines...)
Collapse Failed phpbb_auth_provider_oauth_token_storage_test::test_hasAccessToken test_hasAccessToken with data set #1 History
Build and Test Job < 1 sec
phpbb_auth_provider_oauth_token_storage_test::test_hasAccessToken with data set #1 (OAuth\OAuth2\Token\StdOAuth2Token, true)
PHPUnit_Extensions_Database_Operation_Exception: COMPOSITE[TRUNCATE] operation failed on query: 
                DELETE FROM "phpbb_oauth_tokens"
             using args: Array
(
)
 [SQLSTATE[HY000]: General error: 1 no such table: phpbb_oauth_tokens]

(2 more lines...)
Collapse Failed phpbb_auth_provider_oauth_token_storage_test::test_has_access_token_by_session test_set_user_id History
Build and Test Job < 1 sec
phpbb_auth_provider_oauth_token_storage_test::test_set_user_id
PHPUnit_Extensions_Database_Operation_Exception: COMPOSITE[TRUNCATE] operation failed on query: 
                DELETE FROM "phpbb_oauth_tokens"
             using args: Array
(
)
 [SQLSTATE[HY000]: General error: 1 no such table: phpbb_oauth_tokens]

(2 more lines...)
Collapse Failed phpbb_auth_provider_oauth_token_storage_test::test_has_access_token_by_session test_has_access_token_by_session with data set #1 History
Build and Test Job < 1 sec
phpbb_auth_provider_oauth_token_storage_test::test_has_access_token_by_session with data set #1 (OAuth\OAuth2\Token\StdOAuth2Token, true)
PHPUnit_Extensions_Database_Operation_Exception: COMPOSITE[TRUNCATE] operation failed on query: 
                DELETE FROM "phpbb_oauth_tokens"
             using args: Array
(
)
 [SQLSTATE[HY000]: General error: 1 no such table: phpbb_oauth_tokens]

(2 more lines...)
Collapse Failed phpbb_auth_provider_oauth_token_storage_test::test_has_access_token_by_session test_has_access_token_by_session with data set #0 History
Build and Test Job < 1 sec
phpbb_auth_provider_oauth_token_storage_test::test_has_access_token_by_session with data set #0 (NULL, false)
PHPUnit_Extensions_Database_Operation_Exception: COMPOSITE[TRUNCATE] operation failed on query: 
                DELETE FROM "phpbb_oauth_tokens"
             using args: Array
(
)
 [SQLSTATE[HY000]: General error: 1 no such table: phpbb_oauth_tokens]

(2 more lines...)
Collapse Failed phpbb_auth_provider_oauth_token_storage_test::test_has_access_token_by_session test_clearToken History
Build and Test Job < 1 sec
phpbb_auth_provider_oauth_token_storage_test::test_clearToken
PHPUnit_Extensions_Database_Operation_Exception: COMPOSITE[TRUNCATE] operation failed on query: 
                DELETE FROM "phpbb_oauth_tokens"
             using args: Array
(
)
 [SQLSTATE[HY000]: General error: 1 no such table: phpbb_oauth_tokens]

(2 more lines...)
Collapse Failed phpbb_auth_provider_oauth_token_storage_test::test_retrieveAccessToken test_retrieveAccessToken_from_db History
Build and Test Job < 1 sec
phpbb_auth_provider_oauth_token_storage_test::test_retrieveAccessToken_from_db
PHPUnit_Extensions_Database_Operation_Exception: COMPOSITE[TRUNCATE] operation failed on query: 
                DELETE FROM "phpbb_oauth_tokens"
             using args: Array
(
)
 [SQLSTATE[HY000]: General error: 1 no such table: phpbb_oauth_tokens]

(2 more lines...)
Collapse Failed phpbb_auth_provider_oauth_token_storage_test::test_retrieveAccessToken test_retrieveAccessToken_wrong_token History
Build and Test Job < 1 sec
phpbb_auth_provider_oauth_token_storage_test::test_retrieveAccessToken_wrong_token
PHPUnit_Extensions_Database_Operation_Exception: COMPOSITE[TRUNCATE] operation failed on query: 
                DELETE FROM "phpbb_oauth_tokens"
             using args: Array
(
)
 [SQLSTATE[HY000]: General error: 1 no such table: phpbb_oauth_tokens]

(2 more lines...)
Collapse Failed phpbb_auth_provider_oauth_token_storage_test::test_retrieveAccessToken test_retrieveAccessToken with data set #1 History
Build and Test Job < 1 sec
phpbb_auth_provider_oauth_token_storage_test::test_retrieveAccessToken with data set #1 (NULL, 'OAuth\\Common\\Storage\\Exception\\TokenNotFoundException')
PHPUnit_Extensions_Database_Operation_Exception: COMPOSITE[TRUNCATE] operation failed on query: 
                DELETE FROM "phpbb_oauth_tokens"
             using args: Array
(
)
 [SQLSTATE[HY000]: General error: 1 no such table: phpbb_oauth_tokens]

(2 more lines...)
Collapse Failed phpbb_auth_provider_oauth_token_storage_test::test_retrieveAccessToken test_retrieveAccessToken with data set #0 History
Build and Test Job < 1 sec
phpbb_auth_provider_oauth_token_storage_test::test_retrieveAccessToken with data set #0 (OAuth\OAuth2\Token\StdOAuth2Token, NULL)
PHPUnit_Extensions_Database_Operation_Exception: COMPOSITE[TRUNCATE] operation failed on query: 
                DELETE FROM "phpbb_oauth_tokens"
             using args: Array
(
)
 [SQLSTATE[HY000]: General error: 1 no such table: phpbb_oauth_tokens]

(2 more lines...)
Collapse Failed phpbb_auth_provider_oauth_token_storage_test::test_retrieve_access_token_by_session test_retrieve_access_token_by_session with data set #1 History
Build and Test Job < 1 sec
phpbb_auth_provider_oauth_token_storage_test::test_retrieve_access_token_by_session with data set #1 (NULL, 'OAuth\\Common\\Storage\\Exception\\TokenNotFoundException')
PHPUnit_Extensions_Database_Operation_Exception: COMPOSITE[TRUNCATE] operation failed on query: 
                DELETE FROM "phpbb_oauth_tokens"
             using args: Array
(
)
 [SQLSTATE[HY000]: General error: 1 no such table: phpbb_oauth_tokens]

(2 more lines...)
Collapse Failed phpbb_auth_provider_oauth_token_storage_test::test_retrieve_access_token_by_session test_retrieve_access_token_by_session with data set #0 History
Build and Test Job < 1 sec
phpbb_auth_provider_oauth_token_storage_test::test_retrieve_access_token_by_session with data set #0 (OAuth\OAuth2\Token\StdOAuth2Token, NULL)
PHPUnit_Extensions_Database_Operation_Exception: COMPOSITE[TRUNCATE] operation failed on query: 
                DELETE FROM "phpbb_oauth_tokens"
             using args: Array
(
)
 [SQLSTATE[HY000]: General error: 1 no such table: phpbb_oauth_tokens]

(2 more lines...)
Collapse Failed phpbb_auth_provider_oauth_token_storage_test::test_retrieve_access_token_by_session test_storeAccessToken History
Build and Test Job < 1 sec
phpbb_auth_provider_oauth_token_storage_test::test_storeAccessToken
PHPUnit_Extensions_Database_Operation_Exception: COMPOSITE[TRUNCATE] operation failed on query: 
                DELETE FROM "phpbb_oauth_tokens"
             using args: Array
(
)
 [SQLSTATE[HY000]: General error: 1 no such table: phpbb_oauth_tokens]

(2 more lines...)
Collapse Failed phpbb_auth_provider_oauth_token_storage_test::test_retrieve_access_token_by_session test_retrieve_access_token_by_session_from_db History
Build and Test Job < 1 sec
phpbb_auth_provider_oauth_token_storage_test::test_retrieve_access_token_by_session_from_db
PHPUnit_Extensions_Database_Operation_Exception: COMPOSITE[TRUNCATE] operation failed on query: 
                DELETE FROM "phpbb_oauth_tokens"
             using args: Array
(
)
 [SQLSTATE[HY000]: General error: 1 no such table: phpbb_oauth_tokens]

(2 more lines...)
Collapse Failed phpbb_boolean_processor_test test_triple_and_with_is_null History
Build and Test Job < 1 sec
phpbb_boolean_processor_test::test_triple_and_with_is_null
PHPUnit_Extensions_Database_Operation_Exception: COMPOSITE[TRUNCATE] operation failed on query: 
                DELETE FROM "phpbb_user_group"
             using args: Array
(
)
 [SQLSTATE[HY000]: General error: 1 no such table: phpbb_user_group]

(1 more lines...)
Collapse Failed phpbb_boolean_processor_test test_single_not_like History
Build and Test Job < 1 sec
phpbb_boolean_processor_test::test_single_not_like
PHPUnit_Extensions_Database_Operation_Exception: COMPOSITE[TRUNCATE] operation failed on query: 
                DELETE FROM "phpbb_user_group"
             using args: Array
(
)
 [SQLSTATE[HY000]: General error: 1 no such table: phpbb_user_group]

(1 more lines...)