Tests pending pull requests

Build: #8194 failed Manual run by Build Robot

Build result summary

Details

Completed
Duration
7 minutes
Flags
Custom build
Labels
pr_5225
Agent
Default Agent
Revision
dc8ff9da28b8ab4ad11c7ea94cca526f17c87fe5 dc8ff9da28b8ab4ad11c7ea94cca526f17c87fe5
Total tests
6889
Failing since
#8193 (Manual run by Build Robot)
Fixed in
#8195 (Manual run by Build Robot)

Responsible

This build has been failing since #8193
No one has taken responsibility

Custom variables

Name Value
PRnumber 5225
PRref master

Tests

New test failures 15
Status Test View job Duration
Collapse Failed phpbb_notification_group_request_test test_notifications History
Build and Test Job < 1 sec
phpbb_notification_group_request_test::test_notifications
Symfony\Component\DependencyInjection\Exception\ServiceNotFoundException: The service "notification.type.mention" has a dependency on a non-existent service "text_formatter.s9e.mention_helper".

/data/phpBB/vendor/symfony/dependency-injection/Compiler/CheckExceptionOnInvalidReferenceBehaviorPass.php:32
/data/phpBB/vendor/symfony/dependency-injection/Compiler/AbstractRecursivePass.php:60
/data/phpBB/vendor/symfony/dependency-injection/Compiler/CheckExceptionOnInvalidReferenceBehaviorPass.php:29
/data/phpBB/vendor/symfony/dependency-injection/Compiler/AbstractRecursivePass.php:60
/data/phpBB/vendor/symfony/dependency-injection/Compiler/CheckExceptionOnInvalidReferenceBehaviorPass.php:29
(10 more lines...)
Collapse Failed phpbb_notification_submit_post_type_bookmark_test::test_submit_post test_submit_post with data set #0 History
Build and Test Job < 1 sec
phpbb_notification_submit_post_type_bookmark_test::test_submit_post with data set #0 (array(), array(array(5, 1, 1)), array(array(3, 2, 1), array(5, 1, 1), array(7, 2, 1)))
Symfony\Component\DependencyInjection\Exception\ServiceNotFoundException: The service "notification.type.mention" has a dependency on a non-existent service "text_formatter.s9e.mention_helper".

/data/phpBB/vendor/symfony/dependency-injection/Compiler/CheckExceptionOnInvalidReferenceBehaviorPass.php:32
/data/phpBB/vendor/symfony/dependency-injection/Compiler/AbstractRecursivePass.php:60
/data/phpBB/vendor/symfony/dependency-injection/Compiler/CheckExceptionOnInvalidReferenceBehaviorPass.php:29
/data/phpBB/vendor/symfony/dependency-injection/Compiler/AbstractRecursivePass.php:60
/data/phpBB/vendor/symfony/dependency-injection/Compiler/CheckExceptionOnInvalidReferenceBehaviorPass.php:29
(11 more lines...)
Collapse Failed phpbb_notification_submit_post_type_bookmark_test::test_submit_post test_submit_post with data set #1 History
Build and Test Job < 1 sec
phpbb_notification_submit_post_type_bookmark_test::test_submit_post with data set #1 (array(false), array(array(5, 1, 1)), array(array(5, 1, 1)))
Symfony\Component\DependencyInjection\Exception\ServiceNotFoundException: The service "notification.type.mention" has a dependency on a non-existent service "text_formatter.s9e.mention_helper".

/data/phpBB/vendor/symfony/dependency-injection/Compiler/CheckExceptionOnInvalidReferenceBehaviorPass.php:32
/data/phpBB/vendor/symfony/dependency-injection/Compiler/AbstractRecursivePass.php:60
/data/phpBB/vendor/symfony/dependency-injection/Compiler/CheckExceptionOnInvalidReferenceBehaviorPass.php:29
/data/phpBB/vendor/symfony/dependency-injection/Compiler/AbstractRecursivePass.php:60
/data/phpBB/vendor/symfony/dependency-injection/Compiler/CheckExceptionOnInvalidReferenceBehaviorPass.php:29
(11 more lines...)
Collapse Failed phpbb_notification_submit_post_type_post_in_queue_test::test_submit_post test_submit_post with data set #1 History
Build and Test Job < 1 sec
phpbb_notification_submit_post_type_post_in_queue_test::test_submit_post with data set #1 (array(false), array(array(6, 1, 1)), array(array(3, 2, 1), array(6, 1, 1), array(6, 2, 1), array(8, 2, 1), array(9, 2, 1)))
Symfony\Component\DependencyInjection\Exception\ServiceNotFoundException: The service "notification.type.mention" has a dependency on a non-existent service "text_formatter.s9e.mention_helper".

/data/phpBB/vendor/symfony/dependency-injection/Compiler/CheckExceptionOnInvalidReferenceBehaviorPass.php:32
/data/phpBB/vendor/symfony/dependency-injection/Compiler/AbstractRecursivePass.php:60
/data/phpBB/vendor/symfony/dependency-injection/Compiler/CheckExceptionOnInvalidReferenceBehaviorPass.php:29
/data/phpBB/vendor/symfony/dependency-injection/Compiler/AbstractRecursivePass.php:60
/data/phpBB/vendor/symfony/dependency-injection/Compiler/CheckExceptionOnInvalidReferenceBehaviorPass.php:29
(11 more lines...)
Collapse Failed phpbb_notification_submit_post_type_post_in_queue_test::test_submit_post test_submit_post with data set #0 History
Build and Test Job < 1 sec
phpbb_notification_submit_post_type_post_in_queue_test::test_submit_post with data set #0 (array(), array(array(6, 1, 1)), array(array(6, 1, 1)))
Symfony\Component\DependencyInjection\Exception\ServiceNotFoundException: The service "notification.type.mention" has a dependency on a non-existent service "text_formatter.s9e.mention_helper".

/data/phpBB/vendor/symfony/dependency-injection/Compiler/CheckExceptionOnInvalidReferenceBehaviorPass.php:32
/data/phpBB/vendor/symfony/dependency-injection/Compiler/AbstractRecursivePass.php:60
/data/phpBB/vendor/symfony/dependency-injection/Compiler/CheckExceptionOnInvalidReferenceBehaviorPass.php:29
/data/phpBB/vendor/symfony/dependency-injection/Compiler/AbstractRecursivePass.php:60
/data/phpBB/vendor/symfony/dependency-injection/Compiler/CheckExceptionOnInvalidReferenceBehaviorPass.php:29
(11 more lines...)
Collapse Failed phpbb_notification_submit_post_type_post_test::test_submit_post test_submit_post with data set #1 History
Build and Test Job < 1 sec
phpbb_notification_submit_post_type_post_test::test_submit_post with data set #1 (array(false), array(array(5, 1, 1), array(8, 1, 1)), array(array(5, 1, 1), array(8, 1, 1)))
Symfony\Component\DependencyInjection\Exception\ServiceNotFoundException: The service "notification.type.mention" has a dependency on a non-existent service "text_formatter.s9e.mention_helper".

/data/phpBB/vendor/symfony/dependency-injection/Compiler/CheckExceptionOnInvalidReferenceBehaviorPass.php:32
/data/phpBB/vendor/symfony/dependency-injection/Compiler/AbstractRecursivePass.php:60
/data/phpBB/vendor/symfony/dependency-injection/Compiler/CheckExceptionOnInvalidReferenceBehaviorPass.php:29
/data/phpBB/vendor/symfony/dependency-injection/Compiler/AbstractRecursivePass.php:60
/data/phpBB/vendor/symfony/dependency-injection/Compiler/CheckExceptionOnInvalidReferenceBehaviorPass.php:29
(11 more lines...)
Collapse Failed phpbb_notification_submit_post_type_post_test::test_submit_post test_submit_post with data set #0 History
Build and Test Job < 1 sec
phpbb_notification_submit_post_type_post_test::test_submit_post with data set #0 (array(), array(array(5, 1, 1), array(8, 1, 1)), array(array(3, 2, 1), array(5, 1, 1), array(6, 2, 1), array(7, 2, 1), array(8, 1, 1)))
Symfony\Component\DependencyInjection\Exception\ServiceNotFoundException: The service "notification.type.mention" has a dependency on a non-existent service "text_formatter.s9e.mention_helper".

/data/phpBB/vendor/symfony/dependency-injection/Compiler/CheckExceptionOnInvalidReferenceBehaviorPass.php:32
/data/phpBB/vendor/symfony/dependency-injection/Compiler/AbstractRecursivePass.php:60
/data/phpBB/vendor/symfony/dependency-injection/Compiler/CheckExceptionOnInvalidReferenceBehaviorPass.php:29
/data/phpBB/vendor/symfony/dependency-injection/Compiler/AbstractRecursivePass.php:60
/data/phpBB/vendor/symfony/dependency-injection/Compiler/CheckExceptionOnInvalidReferenceBehaviorPass.php:29
(11 more lines...)
Collapse Failed phpbb_notification_submit_post_type_quote_test::test_submit_post test_submit_post with data set #0 History
Build and Test Job < 1 sec
phpbb_notification_submit_post_type_quote_test::test_submit_post with data set #0 (array('<r><QUOTE author="poster"><s>...E></r>', 'uid'), array(array(5, 1, 1)), array(array(3, 2, 1), array(5, 1, 1), array(5, 2, 1), array(7, 2, 1)))
Symfony\Component\DependencyInjection\Exception\ServiceNotFoundException: The service "notification.type.mention" has a dependency on a non-existent service "text_formatter.s9e.mention_helper".

/data/phpBB/vendor/symfony/dependency-injection/Compiler/CheckExceptionOnInvalidReferenceBehaviorPass.php:32
/data/phpBB/vendor/symfony/dependency-injection/Compiler/AbstractRecursivePass.php:60
/data/phpBB/vendor/symfony/dependency-injection/Compiler/CheckExceptionOnInvalidReferenceBehaviorPass.php:29
/data/phpBB/vendor/symfony/dependency-injection/Compiler/AbstractRecursivePass.php:60
/data/phpBB/vendor/symfony/dependency-injection/Compiler/CheckExceptionOnInvalidReferenceBehaviorPass.php:29
(11 more lines...)
Collapse Failed phpbb_notification_submit_post_type_quote_test::test_submit_post test_submit_post with data set #1 History
Build and Test Job < 1 sec
phpbb_notification_submit_post_type_quote_test::test_submit_post with data set #1 (array('<r><QUOTE author="poster"><s>...E></r>', 'uid', false), array(array(5, 1, 1)), array(array(5, 1, 1)))
Symfony\Component\DependencyInjection\Exception\ServiceNotFoundException: The service "notification.type.mention" has a dependency on a non-existent service "text_formatter.s9e.mention_helper".

/data/phpBB/vendor/symfony/dependency-injection/Compiler/CheckExceptionOnInvalidReferenceBehaviorPass.php:32
/data/phpBB/vendor/symfony/dependency-injection/Compiler/AbstractRecursivePass.php:60
/data/phpBB/vendor/symfony/dependency-injection/Compiler/CheckExceptionOnInvalidReferenceBehaviorPass.php:29
/data/phpBB/vendor/symfony/dependency-injection/Compiler/AbstractRecursivePass.php:60
/data/phpBB/vendor/symfony/dependency-injection/Compiler/CheckExceptionOnInvalidReferenceBehaviorPass.php:29
(11 more lines...)
Collapse Failed phpbb_notification_submit_post_type_topic_test::test_submit_post test_submit_post with data set #1 History
Build and Test Job < 1 sec
phpbb_notification_submit_post_type_topic_test::test_submit_post with data set #1 (array(false), array(array(8, 1, 1)), array(array(8, 1, 1)))
Symfony\Component\DependencyInjection\Exception\ServiceNotFoundException: The service "notification.type.mention" has a dependency on a non-existent service "text_formatter.s9e.mention_helper".

/data/phpBB/vendor/symfony/dependency-injection/Compiler/CheckExceptionOnInvalidReferenceBehaviorPass.php:32
/data/phpBB/vendor/symfony/dependency-injection/Compiler/AbstractRecursivePass.php:60
/data/phpBB/vendor/symfony/dependency-injection/Compiler/CheckExceptionOnInvalidReferenceBehaviorPass.php:29
/data/phpBB/vendor/symfony/dependency-injection/Compiler/AbstractRecursivePass.php:60
/data/phpBB/vendor/symfony/dependency-injection/Compiler/CheckExceptionOnInvalidReferenceBehaviorPass.php:29
(11 more lines...)
Collapse Failed phpbb_notification_submit_post_type_topic_test::test_submit_post test_submit_post with data set #0 History
Build and Test Job < 1 sec
phpbb_notification_submit_post_type_topic_test::test_submit_post with data set #0 (array(), array(array(8, 1, 1)), array(array(7, 2, 1), array(8, 1, 1), array(8, 2, 1)))
Symfony\Component\DependencyInjection\Exception\ServiceNotFoundException: The service "notification.type.mention" has a dependency on a non-existent service "text_formatter.s9e.mention_helper".

/data/phpBB/vendor/symfony/dependency-injection/Compiler/CheckExceptionOnInvalidReferenceBehaviorPass.php:32
/data/phpBB/vendor/symfony/dependency-injection/Compiler/AbstractRecursivePass.php:60
/data/phpBB/vendor/symfony/dependency-injection/Compiler/CheckExceptionOnInvalidReferenceBehaviorPass.php:29
/data/phpBB/vendor/symfony/dependency-injection/Compiler/AbstractRecursivePass.php:60
/data/phpBB/vendor/symfony/dependency-injection/Compiler/CheckExceptionOnInvalidReferenceBehaviorPass.php:29
(11 more lines...)
Collapse Failed phpbb_notification_test test_get_subscription_types History
Build and Test Job < 1 sec
phpbb_notification_test::test_get_subscription_types
Symfony\Component\DependencyInjection\Exception\ServiceNotFoundException: The service "notification.type.mention" has a dependency on a non-existent service "text_formatter.s9e.mention_helper".

/data/phpBB/vendor/symfony/dependency-injection/Compiler/CheckExceptionOnInvalidReferenceBehaviorPass.php:32
/data/phpBB/vendor/symfony/dependency-injection/Compiler/AbstractRecursivePass.php:60
/data/phpBB/vendor/symfony/dependency-injection/Compiler/CheckExceptionOnInvalidReferenceBehaviorPass.php:29
/data/phpBB/vendor/symfony/dependency-injection/Compiler/AbstractRecursivePass.php:60
/data/phpBB/vendor/symfony/dependency-injection/Compiler/CheckExceptionOnInvalidReferenceBehaviorPass.php:29
(10 more lines...)
Collapse Failed phpbb_notification_test test_subscriptions History
Build and Test Job < 1 sec
phpbb_notification_test::test_subscriptions
Symfony\Component\DependencyInjection\Exception\ServiceNotFoundException: The service "notification.type.mention" has a dependency on a non-existent service "text_formatter.s9e.mention_helper".

/data/phpBB/vendor/symfony/dependency-injection/Compiler/CheckExceptionOnInvalidReferenceBehaviorPass.php:32
/data/phpBB/vendor/symfony/dependency-injection/Compiler/AbstractRecursivePass.php:60
/data/phpBB/vendor/symfony/dependency-injection/Compiler/CheckExceptionOnInvalidReferenceBehaviorPass.php:29
/data/phpBB/vendor/symfony/dependency-injection/Compiler/AbstractRecursivePass.php:60
/data/phpBB/vendor/symfony/dependency-injection/Compiler/CheckExceptionOnInvalidReferenceBehaviorPass.php:29
(10 more lines...)
Collapse Failed phpbb_notification_test test_get_notification_type_id History
Build and Test Job < 1 sec
phpbb_notification_test::test_get_notification_type_id
Symfony\Component\DependencyInjection\Exception\ServiceNotFoundException: The service "notification.type.mention" has a dependency on a non-existent service "text_formatter.s9e.mention_helper".

/data/phpBB/vendor/symfony/dependency-injection/Compiler/CheckExceptionOnInvalidReferenceBehaviorPass.php:32
/data/phpBB/vendor/symfony/dependency-injection/Compiler/AbstractRecursivePass.php:60
/data/phpBB/vendor/symfony/dependency-injection/Compiler/CheckExceptionOnInvalidReferenceBehaviorPass.php:29
/data/phpBB/vendor/symfony/dependency-injection/Compiler/AbstractRecursivePass.php:60
/data/phpBB/vendor/symfony/dependency-injection/Compiler/CheckExceptionOnInvalidReferenceBehaviorPass.php:29
(10 more lines...)
Collapse Failed phpbb_notification_test test_notifications History
Build and Test Job < 1 sec
phpbb_notification_test::test_notifications
Symfony\Component\DependencyInjection\Exception\ServiceNotFoundException: The service "notification.type.mention" has a dependency on a non-existent service "text_formatter.s9e.mention_helper".

/data/phpBB/vendor/symfony/dependency-injection/Compiler/CheckExceptionOnInvalidReferenceBehaviorPass.php:32
/data/phpBB/vendor/symfony/dependency-injection/Compiler/AbstractRecursivePass.php:60
/data/phpBB/vendor/symfony/dependency-injection/Compiler/CheckExceptionOnInvalidReferenceBehaviorPass.php:29
/data/phpBB/vendor/symfony/dependency-injection/Compiler/AbstractRecursivePass.php:60
/data/phpBB/vendor/symfony/dependency-injection/Compiler/CheckExceptionOnInvalidReferenceBehaviorPass.php:29
(10 more lines...)
Fixed tests 24
Status Test Failing since View job Duration
Successful phpbb_attachment_delete_test::test_attachment_delete test_attachment_delete with data set #7 History
Failing since build #8193 (Manual run by Build Robot) Build and Test Job < 1 sec
Successful phpbb_attachment_delete_test::test_attachment_delete test_attachment_delete with data set #3 History
Failing since build #8193 (Manual run by Build Robot) Build and Test Job < 1 sec
Successful phpbb_attachment_delete_test::test_attachment_delete test_attachment_delete with data set #4 History
Failing since build #8193 (Manual run by Build Robot) Build and Test Job < 1 sec
Successful phpbb_attachment_upload_test::test_image_upload test_image_upload with data set #0 History
Failing since build #8193 (Manual run by Build Robot) Build and Test Job < 1 sec
Successful phpbb_attachment_upload_test::test_image_upload test_image_upload with data set #4 History
Failing since build #8193 (Manual run by Build Robot) Build and Test Job < 1 sec
Successful phpbb_attachment_upload_test::test_image_upload test_image_upload with data set #3 History
Failing since build #8193 (Manual run by Build Robot) Build and Test Job < 1 sec
Successful phpbb_attachment_upload_test::test_image_upload test_image_upload with data set #2 History
Failing since build #8193 (Manual run by Build Robot) Build and Test Job < 1 sec
Successful phpbb_attachment_upload_test::test_image_upload test_image_upload with data set #1 History
Failing since build #8193 (Manual run by Build Robot) Build and Test Job < 1 sec
Successful phpbb_attachment_upload_test::test_image_upload test_image_upload with data set #5 History
Failing since build #8193 (Manual run by Build Robot) Build and Test Job < 1 sec
Successful phpbb_attachment_upload_test::test_upload test_upload with data set #1 History
Failing since build #8193 (Manual run by Build Robot) Build and Test Job < 1 sec
Successful phpbb_attachment_upload_test::test_upload test_upload with data set #2 History
Failing since build #8193 (Manual run by Build Robot) Build and Test Job < 1 sec
Successful phpbb_attachment_upload_test::test_upload test_upload with data set #0 History
Failing since build #8193 (Manual run by Build Robot) Build and Test Job < 1 sec
Successful phpbb_attachment_upload_test::test_upload test_init_error History
Failing since build #8193 (Manual run by Build Robot) Build and Test Job < 1 sec
Successful phpbb_content_visibility_delete_post_test::test_delete_post test_delete_post with data set #0 History
Failing since build #8193 (Manual run by Build Robot) Build and Test Job < 1 sec
Successful phpbb_content_visibility_delete_post_test::test_delete_post test_delete_post with data set #2 History
Failing since build #8193 (Manual run by Build Robot) Build and Test Job < 1 sec
Successful phpbb_content_visibility_delete_post_test::test_delete_post test_delete_post with data set #1 History
Failing since build #8193 (Manual run by Build Robot) Build and Test Job < 1 sec
Successful phpbb_content_visibility_delete_post_test::test_delete_post test_delete_post with data set #4 History
Failing since build #8193 (Manual run by Build Robot) Build and Test Job < 1 sec
Successful phpbb_content_visibility_delete_post_test::test_delete_post test_delete_post with data set #3 History
Failing since build #8193 (Manual run by Build Robot) Build and Test Job < 1 sec
Successful phpbb_content_visibility_delete_post_test::test_delete_post test_delete_post with data set #6 History
Failing since build #8193 (Manual run by Build Robot) Build and Test Job < 1 sec
Successful phpbb_content_visibility_delete_post_test::test_delete_post test_delete_post with data set #5 History
Failing since build #8193 (Manual run by Build Robot) Build and Test Job < 1 sec
Successful phpbb_content_visibility_delete_post_test::test_delete_post test_delete_post with data set #7 History
Failing since build #8193 (Manual run by Build Robot) Build and Test Job < 1 sec
Successful phpbb_privmsgs_delete_user_pms_test::test_delete_user_pms test_delete_user_pms with data set #2 History
Failing since build #8193 (Manual run by Build Robot) Build and Test Job < 1 sec
Successful phpbb_privmsgs_delete_user_pms_test::test_delete_user_pms test_delete_user_pms with data set #1 History
Failing since build #8193 (Manual run by Build Robot) Build and Test Job < 1 sec
Successful phpbb_privmsgs_delete_user_pms_test::test_delete_user_pms test_delete_user_pms with data set #0 History
Failing since build #8193 (Manual run by Build Robot) Build and Test Job < 1 sec