Tests pending pull requests

Build: #8753 failed Manual run by Build Robot

Build result summary

Details

Completed
Duration
5 minutes
Flags
Custom build
Labels
pr_5333
Agent
Default Agent
Revision
dc8ff9da28b8ab4ad11c7ea94cca526f17c87fe5 dc8ff9da28b8ab4ad11c7ea94cca526f17c87fe5
Total tests
6104
Fixed in
#8754 (Manual run by Build Robot)

Responsible

No one has taken responsibility for this failure

Custom variables

Name Value
PRnumber 5333
PRref master

Tests

New test failures 124
Status Test View job Duration
Collapse Failed get_callable_from_step_test get_callable_from_step_test History
Build and Test Job < 1 sec
get_callable_from_step_test
Exception: Could not find parameter: finder.not_use_cache

/data/tests/mock/container_builder.php:106
/data/phpBB/phpbb/finder.php:429
/data/phpBB/phpbb/finder.php:374
/data/phpBB/phpbb/finder.php:273
/data/tests/test_framework/phpbb_database_test_case.php:68
Collapse Failed phpbb_attachment_delete_test phpbb_attachment_delete_test History
Build and Test Job < 1 sec
phpbb_attachment_delete_test
Exception: Could not find parameter: finder.not_use_cache

/data/tests/mock/container_builder.php:106
/data/phpBB/phpbb/finder.php:429
/data/phpBB/phpbb/finder.php:374
/data/phpBB/phpbb/finder.php:273
/data/tests/test_framework/phpbb_database_test_case.php:68
Collapse Failed phpbb_attachment_resync_test phpbb_attachment_resync_test History
Build and Test Job < 1 sec
phpbb_attachment_resync_test
Exception: Could not find parameter: finder.not_use_cache

/data/tests/mock/container_builder.php:106
/data/phpBB/phpbb/finder.php:429
/data/phpBB/phpbb/finder.php:374
/data/phpBB/phpbb/finder.php:273
/data/tests/test_framework/phpbb_database_test_case.php:68
Collapse Failed phpbb_attachment_upload_test phpbb_attachment_upload_test History
Build and Test Job < 1 sec
phpbb_attachment_upload_test
Exception: Could not find parameter: finder.not_use_cache

/data/tests/mock/container_builder.php:106
/data/phpBB/phpbb/finder.php:429
/data/phpBB/phpbb/finder.php:374
/data/phpBB/phpbb/finder.php:273
/data/tests/test_framework/phpbb_database_test_case.php:68
Collapse Failed phpbb_auth_provider_apache_test phpbb_auth_provider_apache_test History
Build and Test Job < 1 sec
phpbb_auth_provider_apache_test
Exception: Could not find parameter: finder.not_use_cache

/data/tests/mock/container_builder.php:106
/data/phpBB/phpbb/finder.php:429
/data/phpBB/phpbb/finder.php:374
/data/phpBB/phpbb/finder.php:273
/data/tests/test_framework/phpbb_database_test_case.php:68
Collapse Failed phpbb_auth_provider_db_test phpbb_auth_provider_db_test History
Build and Test Job < 1 sec
phpbb_auth_provider_db_test
Exception: Could not find parameter: finder.not_use_cache

/data/tests/mock/container_builder.php:106
/data/phpBB/phpbb/finder.php:429
/data/phpBB/phpbb/finder.php:374
/data/phpBB/phpbb/finder.php:273
/data/tests/test_framework/phpbb_database_test_case.php:68
Collapse Failed phpbb_auth_provider_oauth_token_storage_test phpbb_auth_provider_oauth_token_storage_test History
Build and Test Job < 1 sec
phpbb_auth_provider_oauth_token_storage_test
Exception: Could not find parameter: finder.not_use_cache

/data/tests/mock/container_builder.php:106
/data/phpBB/phpbb/finder.php:429
/data/phpBB/phpbb/finder.php:374
/data/phpBB/phpbb/finder.php:273
/data/tests/test_framework/phpbb_database_test_case.php:68
Collapse Failed phpbb_avatar_manager_test phpbb_avatar_manager_test History
Build and Test Job < 1 sec
phpbb_avatar_manager_test
Exception: Could not find parameter: finder.not_use_cache

/data/tests/mock/container_builder.php:106
/data/phpBB/phpbb/finder.php:429
/data/phpBB/phpbb/finder.php:374
/data/phpBB/phpbb/finder.php:273
/data/tests/test_framework/phpbb_database_test_case.php:68
Collapse Failed phpbb_boolean_processor_test phpbb_boolean_processor_test History
Build and Test Job < 1 sec
phpbb_boolean_processor_test
Exception: Could not find parameter: finder.not_use_cache

/data/tests/mock/container_builder.php:106
/data/phpBB/phpbb/finder.php:429
/data/phpBB/phpbb/finder.php:374
/data/phpBB/phpbb/finder.php:273
/data/tests/test_framework/phpbb_database_test_case.php:68
Collapse Failed phpbb_cache_dummy_driver_test phpbb_cache_dummy_driver_test History
Build and Test Job < 1 sec
phpbb_cache_dummy_driver_test
Exception: Could not find parameter: finder.not_use_cache

/data/tests/mock/container_builder.php:106
/data/phpBB/phpbb/finder.php:429
/data/phpBB/phpbb/finder.php:374
/data/phpBB/phpbb/finder.php:273
/data/tests/test_framework/phpbb_database_test_case.php:68
Collapse Failed phpbb_cache_file_driver_test phpbb_cache_file_driver_test History
Build and Test Job < 1 sec
phpbb_cache_file_driver_test
Exception: Could not find parameter: finder.not_use_cache

/data/tests/mock/container_builder.php:106
/data/phpBB/phpbb/finder.php:429
/data/phpBB/phpbb/finder.php:374
/data/phpBB/phpbb/finder.php:273
/data/tests/test_framework/phpbb_database_test_case.php:68
Collapse Failed phpbb_cache_memory_test phpbb_cache_memory_test History
Build and Test Job < 1 sec
phpbb_cache_memory_test
Exception: Could not find parameter: finder.not_use_cache

/data/tests/mock/container_builder.php:106
/data/phpBB/phpbb/finder.php:429
/data/phpBB/phpbb/finder.php:374
/data/phpBB/phpbb/finder.php:273
/data/tests/test_framework/phpbb_database_test_case.php:68
Collapse Failed phpbb_captcha_qa_test phpbb_captcha_qa_test History
Build and Test Job < 1 sec
phpbb_captcha_qa_test
Exception: Could not find parameter: finder.not_use_cache

/data/tests/mock/container_builder.php:106
/data/phpBB/phpbb/finder.php:429
/data/phpBB/phpbb/finder.php:374
/data/phpBB/phpbb/finder.php:273
/data/tests/test_framework/phpbb_database_test_case.php:68
Collapse Failed phpbb_config_db_test phpbb_config_db_test History
Build and Test Job < 1 sec
phpbb_config_db_test
Exception: Could not find parameter: finder.not_use_cache

/data/tests/mock/container_builder.php:106
/data/phpBB/phpbb/finder.php:429
/data/phpBB/phpbb/finder.php:374
/data/phpBB/phpbb/finder.php:273
/data/tests/test_framework/phpbb_database_test_case.php:68
Collapse Failed phpbb_config_db_text_test phpbb_config_db_text_test History
Build and Test Job < 1 sec
phpbb_config_db_text_test
Exception: Could not find parameter: finder.not_use_cache

/data/tests/mock/container_builder.php:106
/data/phpBB/phpbb/finder.php:429
/data/phpBB/phpbb/finder.php:374
/data/phpBB/phpbb/finder.php:273
/data/tests/test_framework/phpbb_database_test_case.php:68
Collapse Failed phpbb_console_command_cron_run_test phpbb_console_command_cron_run_test History
Build and Test Job < 1 sec
phpbb_console_command_cron_run_test
Exception: Could not find parameter: finder.not_use_cache

/data/tests/mock/container_builder.php:106
/data/phpBB/phpbb/finder.php:429
/data/phpBB/phpbb/finder.php:374
/data/phpBB/phpbb/finder.php:273
/data/tests/test_framework/phpbb_database_test_case.php:68
Collapse Failed phpbb_console_command_thumbnail_test phpbb_console_command_thumbnail_test History
Build and Test Job < 1 sec
phpbb_console_command_thumbnail_test
Exception: Could not find parameter: finder.not_use_cache

/data/tests/mock/container_builder.php:106
/data/phpBB/phpbb/finder.php:429
/data/phpBB/phpbb/finder.php:374
/data/phpBB/phpbb/finder.php:273
/data/tests/test_framework/phpbb_database_test_case.php:68
Collapse Failed phpbb_console_user_activate_test phpbb_console_user_activate_test History
Build and Test Job < 1 sec
phpbb_console_user_activate_test
Exception: Could not find parameter: finder.not_use_cache

/data/tests/mock/container_builder.php:106
/data/phpBB/phpbb/finder.php:429
/data/phpBB/phpbb/finder.php:374
/data/phpBB/phpbb/finder.php:273
/data/tests/test_framework/phpbb_database_test_case.php:68
Collapse Failed phpbb_console_user_add_test phpbb_console_user_add_test History
Build and Test Job < 1 sec
phpbb_console_user_add_test
Exception: Could not find parameter: finder.not_use_cache

/data/tests/mock/container_builder.php:106
/data/phpBB/phpbb/finder.php:429
/data/phpBB/phpbb/finder.php:374
/data/phpBB/phpbb/finder.php:273
/data/tests/test_framework/phpbb_database_test_case.php:68
Collapse Failed phpbb_console_user_delete_test phpbb_console_user_delete_test History
Build and Test Job < 1 sec
phpbb_console_user_delete_test
Exception: Could not find parameter: finder.not_use_cache

/data/tests/mock/container_builder.php:106
/data/phpBB/phpbb/finder.php:429
/data/phpBB/phpbb/finder.php:374
/data/phpBB/phpbb/finder.php:273
/data/tests/test_framework/phpbb_database_test_case.php:68
Collapse Failed phpbb_console_user_reclean_test phpbb_console_user_reclean_test History
Build and Test Job < 1 sec
phpbb_console_user_reclean_test
Exception: Could not find parameter: finder.not_use_cache

/data/tests/mock/container_builder.php:106
/data/phpBB/phpbb/finder.php:429
/data/phpBB/phpbb/finder.php:374
/data/phpBB/phpbb/finder.php:273
/data/tests/test_framework/phpbb_database_test_case.php:68
Collapse Failed phpbb_content_visibility_delete_post_test phpbb_content_visibility_delete_post_test History
Build and Test Job < 1 sec
phpbb_content_visibility_delete_post_test
Exception: Could not find parameter: finder.not_use_cache

/data/tests/mock/container_builder.php:106
/data/phpBB/phpbb/finder.php:429
/data/phpBB/phpbb/finder.php:374
/data/phpBB/phpbb/finder.php:273
/data/tests/test_framework/phpbb_database_test_case.php:68
Collapse Failed phpbb_content_visibility_get_forums_visibility_sql_test phpbb_content_visibility_get_forums_visibility_sql_test History
Build and Test Job < 1 sec
phpbb_content_visibility_get_forums_visibility_sql_test
Exception: Could not find parameter: finder.not_use_cache

/data/tests/mock/container_builder.php:106
/data/phpBB/phpbb/finder.php:429
/data/phpBB/phpbb/finder.php:374
/data/phpBB/phpbb/finder.php:273
/data/tests/test_framework/phpbb_database_test_case.php:68
Collapse Failed phpbb_content_visibility_get_global_visibility_sql_test phpbb_content_visibility_get_global_visibility_sql_test History
Build and Test Job < 1 sec
phpbb_content_visibility_get_global_visibility_sql_test
Exception: Could not find parameter: finder.not_use_cache

/data/tests/mock/container_builder.php:106
/data/phpBB/phpbb/finder.php:429
/data/phpBB/phpbb/finder.php:374
/data/phpBB/phpbb/finder.php:273
/data/tests/test_framework/phpbb_database_test_case.php:68
Collapse Failed phpbb_content_visibility_get_visibility_sql_test phpbb_content_visibility_get_visibility_sql_test History
Build and Test Job < 1 sec
phpbb_content_visibility_get_visibility_sql_test
Exception: Could not find parameter: finder.not_use_cache

/data/tests/mock/container_builder.php:106
/data/phpBB/phpbb/finder.php:429
/data/phpBB/phpbb/finder.php:374
/data/phpBB/phpbb/finder.php:273
/data/tests/test_framework/phpbb_database_test_case.php:68
Collapse Failed phpbb_content_visibility_set_post_visibility_test phpbb_content_visibility_set_post_visibility_test History
Build and Test Job < 1 sec
phpbb_content_visibility_set_post_visibility_test
Exception: Could not find parameter: finder.not_use_cache

/data/tests/mock/container_builder.php:106
/data/phpBB/phpbb/finder.php:429
/data/phpBB/phpbb/finder.php:374
/data/phpBB/phpbb/finder.php:273
/data/tests/test_framework/phpbb_database_test_case.php:68
Collapse Failed phpbb_content_visibility_set_topic_visibility_test phpbb_content_visibility_set_topic_visibility_test History
Build and Test Job < 1 sec
phpbb_content_visibility_set_topic_visibility_test
Exception: Could not find parameter: finder.not_use_cache

/data/tests/mock/container_builder.php:106
/data/phpBB/phpbb/finder.php:429
/data/phpBB/phpbb/finder.php:374
/data/phpBB/phpbb/finder.php:273
/data/tests/test_framework/phpbb_database_test_case.php:68
Collapse Failed phpbb_dbal_auto_increment_test phpbb_dbal_auto_increment_test History
Build and Test Job < 1 sec
phpbb_dbal_auto_increment_test
Exception: Could not find parameter: finder.not_use_cache

/data/tests/mock/container_builder.php:106
/data/phpBB/phpbb/finder.php:429
/data/phpBB/phpbb/finder.php:374
/data/phpBB/phpbb/finder.php:273
/data/tests/test_framework/phpbb_database_test_case.php:68
Collapse Failed phpbb_dbal_case_test phpbb_dbal_case_test History
Build and Test Job < 1 sec
phpbb_dbal_case_test
Exception: Could not find parameter: finder.not_use_cache

/data/tests/mock/container_builder.php:106
/data/phpBB/phpbb/finder.php:429
/data/phpBB/phpbb/finder.php:374
/data/phpBB/phpbb/finder.php:273
/data/tests/test_framework/phpbb_database_test_case.php:68
Collapse Failed phpbb_dbal_concatenate_test phpbb_dbal_concatenate_test History
Build and Test Job < 1 sec
phpbb_dbal_concatenate_test
Exception: Could not find parameter: finder.not_use_cache

/data/tests/mock/container_builder.php:106
/data/phpBB/phpbb/finder.php:429
/data/phpBB/phpbb/finder.php:374
/data/phpBB/phpbb/finder.php:273
/data/tests/test_framework/phpbb_database_test_case.php:68
Collapse Failed phpbb_dbal_connect_test phpbb_dbal_connect_test History
Build and Test Job < 1 sec
phpbb_dbal_connect_test
Exception: Could not find parameter: finder.not_use_cache

/data/tests/mock/container_builder.php:106
/data/phpBB/phpbb/finder.php:429
/data/phpBB/phpbb/finder.php:374
/data/phpBB/phpbb/finder.php:273
/data/tests/test_framework/phpbb_database_test_case.php:68
Collapse Failed phpbb_dbal_cross_join_test phpbb_dbal_cross_join_test History
Build and Test Job < 1 sec
phpbb_dbal_cross_join_test
Exception: Could not find parameter: finder.not_use_cache

/data/tests/mock/container_builder.php:106
/data/phpBB/phpbb/finder.php:429
/data/phpBB/phpbb/finder.php:374
/data/phpBB/phpbb/finder.php:273
/data/tests/test_framework/phpbb_database_test_case.php:68
Collapse Failed phpbb_dbal_db_tools_test phpbb_dbal_db_tools_test History
Build and Test Job < 1 sec
phpbb_dbal_db_tools_test
Exception: Could not find parameter: finder.not_use_cache

/data/tests/mock/container_builder.php:106
/data/phpBB/phpbb/finder.php:429
/data/phpBB/phpbb/finder.php:374
/data/phpBB/phpbb/finder.php:273
/data/tests/test_framework/phpbb_database_test_case.php:68
Collapse Failed phpbb_dbal_migrator_test phpbb_dbal_migrator_test History
Build and Test Job < 1 sec
phpbb_dbal_migrator_test
Exception: Could not find parameter: finder.not_use_cache

/data/tests/mock/container_builder.php:106
/data/phpBB/phpbb/finder.php:429
/data/phpBB/phpbb/finder.php:374
/data/phpBB/phpbb/finder.php:273
/data/tests/test_framework/phpbb_database_test_case.php:68
Collapse Failed phpbb_dbal_migrator_tool_config_text_test phpbb_dbal_migrator_tool_config_text_test History
Build and Test Job < 1 sec
phpbb_dbal_migrator_tool_config_text_test
Exception: Could not find parameter: finder.not_use_cache

/data/tests/mock/container_builder.php:106
/data/phpBB/phpbb/finder.php:429
/data/phpBB/phpbb/finder.php:374
/data/phpBB/phpbb/finder.php:273
/data/tests/test_framework/phpbb_database_test_case.php:68
Collapse Failed phpbb_dbal_migrator_tool_module_test phpbb_dbal_migrator_tool_module_test History
Build and Test Job < 1 sec
phpbb_dbal_migrator_tool_module_test
Exception: Could not find parameter: finder.not_use_cache

/data/tests/mock/container_builder.php:106
/data/phpBB/phpbb/finder.php:429
/data/phpBB/phpbb/finder.php:374
/data/phpBB/phpbb/finder.php:273
/data/tests/test_framework/phpbb_database_test_case.php:68
Collapse Failed phpbb_dbal_migrator_tool_permission_test phpbb_dbal_migrator_tool_permission_test History
Build and Test Job < 1 sec
phpbb_dbal_migrator_tool_permission_test
Exception: Could not find parameter: finder.not_use_cache

/data/tests/mock/container_builder.php:106
/data/phpBB/phpbb/finder.php:429
/data/phpBB/phpbb/finder.php:374
/data/phpBB/phpbb/finder.php:273
/data/tests/test_framework/phpbb_database_test_case.php:68
Collapse Failed phpbb_dbal_order_lower_test phpbb_dbal_order_lower_test History
Build and Test Job < 1 sec
phpbb_dbal_order_lower_test
Exception: Could not find parameter: finder.not_use_cache

/data/tests/mock/container_builder.php:106
/data/phpBB/phpbb/finder.php:429
/data/phpBB/phpbb/finder.php:374
/data/phpBB/phpbb/finder.php:273
/data/tests/test_framework/phpbb_database_test_case.php:68
Collapse Failed phpbb_dbal_schema_test phpbb_dbal_schema_test History
Build and Test Job < 1 sec
phpbb_dbal_schema_test
Exception: Could not find parameter: finder.not_use_cache

/data/tests/mock/container_builder.php:106
/data/phpBB/phpbb/finder.php:429
/data/phpBB/phpbb/finder.php:374
/data/phpBB/phpbb/finder.php:273
/data/tests/test_framework/phpbb_database_test_case.php:68
Collapse Failed phpbb_dbal_select_test phpbb_dbal_select_test History
Build and Test Job < 1 sec
phpbb_dbal_select_test
Exception: Could not find parameter: finder.not_use_cache

/data/tests/mock/container_builder.php:106
/data/phpBB/phpbb/finder.php:429
/data/phpBB/phpbb/finder.php:374
/data/phpBB/phpbb/finder.php:273
/data/tests/test_framework/phpbb_database_test_case.php:68
Collapse Failed phpbb_dbal_sql_affected_rows_test phpbb_dbal_sql_affected_rows_test History
Build and Test Job < 1 sec
phpbb_dbal_sql_affected_rows_test
Exception: Could not find parameter: finder.not_use_cache

/data/tests/mock/container_builder.php:106
/data/phpBB/phpbb/finder.php:429
/data/phpBB/phpbb/finder.php:374
/data/phpBB/phpbb/finder.php:273
/data/tests/test_framework/phpbb_database_test_case.php:68
Collapse Failed phpbb_dbal_sql_insert_buffer_test phpbb_dbal_sql_insert_buffer_test History
Build and Test Job < 1 sec
phpbb_dbal_sql_insert_buffer_test
Exception: Could not find parameter: finder.not_use_cache

/data/tests/mock/container_builder.php:106
/data/phpBB/phpbb/finder.php:429
/data/phpBB/phpbb/finder.php:374
/data/phpBB/phpbb/finder.php:273
/data/tests/test_framework/phpbb_database_test_case.php:68
Collapse Failed phpbb_dbal_write_sequence_test phpbb_dbal_write_sequence_test History
Build and Test Job < 1 sec
phpbb_dbal_write_sequence_test
Exception: Could not find parameter: finder.not_use_cache

/data/tests/mock/container_builder.php:106
/data/phpBB/phpbb/finder.php:429
/data/phpBB/phpbb/finder.php:374
/data/phpBB/phpbb/finder.php:273
/data/tests/test_framework/phpbb_database_test_case.php:68
Collapse Failed phpbb_dbal_write_test phpbb_dbal_write_test History
Build and Test Job < 1 sec
phpbb_dbal_write_test
Exception: Could not find parameter: finder.not_use_cache

/data/tests/mock/container_builder.php:106
/data/phpBB/phpbb/finder.php:429
/data/phpBB/phpbb/finder.php:374
/data/phpBB/phpbb/finder.php:273
/data/tests/test_framework/phpbb_database_test_case.php:68
Collapse Failed phpbb_extension_extension_base_test::test_suffix_get_classes test_suffix_get_classes with data set #0 History
Build and Test Job < 1 sec
phpbb_extension_extension_base_test::test_suffix_get_classes with data set #0 ('vendor2/bar', array('\vendor2\bar\migrations\migration'))
Exception: Could not find parameter: finder.not_use_cache

/data/tests/mock/container_builder.php:106
/data/phpBB/phpbb/finder.php:429
/data/phpBB/phpbb/finder.php:402
/data/phpBB/phpbb/extension/base.php:132
/data/tests/extension/extension_base_test.php:77
Collapse Failed phpbb_extension_finder_test test_suffix_get_classes History
Build and Test Job < 1 sec
phpbb_extension_finder_test::test_suffix_get_classes
Exception: Could not find parameter: finder.not_use_cache

/data/tests/mock/container_builder.php:106
/data/phpBB/phpbb/finder.php:429
/data/phpBB/phpbb/finder.php:374
/data/phpBB/phpbb/finder.php:273
/data/tests/extension/finder_test.php:46
Collapse Failed phpbb_extension_finder_test::test_set_extensions test_uncleansub_directory_get_classes History
Build and Test Job < 1 sec
phpbb_extension_finder_test::test_uncleansub_directory_get_classes
Exception: Could not find parameter: finder.not_use_cache

/data/tests/mock/container_builder.php:106
/data/phpBB/phpbb/finder.php:429
/data/phpBB/phpbb/finder.php:374
/data/phpBB/phpbb/finder.php:273
/data/tests/extension/finder_test.php:212
Collapse Failed phpbb_extension_finder_test::test_set_extensions test_set_extensions with data set #0 History
Build and Test Job < 1 sec
phpbb_extension_finder_test::test_set_extensions with data set #0 (array(), array('\phpbb\default\implementation'))
Exception: Could not find parameter: finder.not_use_cache

/data/tests/mock/container_builder.php:106
/data/phpBB/phpbb/finder.php:429
/data/phpBB/phpbb/finder.php:374
/data/phpBB/phpbb/finder.php:273
/data/tests/extension/finder_test.php:95
Collapse Failed phpbb_extension_finder_test::test_set_extensions test_set_extensions with data set #1 History
Build and Test Job < 1 sec
phpbb_extension_finder_test::test_set_extensions with data set #1 (array('vendor3/bar'), array('\phpbb\default\implementation', '\vendor3\bar\my\hidden_class'))
Exception: Could not find parameter: finder.not_use_cache

/data/tests/mock/container_builder.php:106
/data/phpBB/phpbb/finder.php:429
/data/phpBB/phpbb/finder.php:374
/data/phpBB/phpbb/finder.php:273
/data/tests/extension/finder_test.php:95
Collapse Failed phpbb_extension_finder_test::test_set_extensions test_set_extensions with data set #2 History
Build and Test Job < 1 sec
phpbb_extension_finder_test::test_set_extensions with data set #2 (array('vendor2/foo', 'vendor3/bar'), array('\phpbb\default\implementation', '\vendor2\foo\a_class', '\vendor2\foo\b_class', '\vendor3\bar\my\hidden_class'))
Exception: Could not find parameter: finder.not_use_cache

/data/tests/mock/container_builder.php:106
/data/phpBB/phpbb/finder.php:429
/data/phpBB/phpbb/finder.php:374
/data/phpBB/phpbb/finder.php:273
/data/tests/extension/finder_test.php:95