Tests pending pull requests

Build: #8776 failed Manual run by Build Robot

Build result summary

Details

Completed
Duration
7 minutes
Flags
Custom build
Labels
pr_5329
Agent
Default Agent
Revision
dc8ff9da28b8ab4ad11c7ea94cca526f17c87fe5 dc8ff9da28b8ab4ad11c7ea94cca526f17c87fe5
Total tests
6902
Failing since
#8773 (Manual run by Build Robot)
Fixed in
#8777 (Manual run by Build Robot)

Responsible

This build has been failing since #8773
No one has taken responsibility

Custom variables

Name Value
PRnumber 5329
PRref master

Tests

Existing test failures 10
Status Test Failing since View job Duration
phpbb_content_visibility_delete_post_test::test_delete_post with data set #6 (2, 2, 4, array(4, 4, 1, 0, 0, 1, 4, 1, true, 1, false), false, 'harddelete', array(), array(), array(array(0, 0, 0, 0, 0, 0, 0)), array(array(3)))
Exception: Could not find service: dbal.tools

/data/tests/mock/container_builder.php:71
/data/phpBB/includes/functions_admin.php:880
/data/phpBB/includes/functions_posting.php:1206
/data/tests/content_visibility/delete_post_test.php:324
phpbb_content_visibility_delete_post_test::test_delete_post with data set #0 (1, 1, 2, array(1, 3, 3, 0, 0, 1, 2, 1, true, 1, false), false, 'harddelete', array(array(1, 1, ''), array(3, 1, '')), array(array(1, 1, 3, 2, 0, 0, '')), array(array(2, 0, 0, 1, 0, 0, 3)), array(array(3)))
Exception: Could not find service: dbal.tools

/data/tests/mock/container_builder.php:71
/data/phpBB/includes/functions_admin.php:880
/data/phpBB/includes/functions_posting.php:1206
/data/tests/content_visibility/delete_post_test.php:324
phpbb_content_visibility_delete_post_test::test_delete_post with data set #2 (1, 1, 3, array(1, 3, 3, 0, 0, 1, 3, 1, true, 1, false), false, 'harddelete', array(array(1, 1, ''), array(2, 1, '')), array(array(1, 1, 2, 2, 0, 0, '')), array(array(2, 0, 0, 1, 0, 0, 2)), array(array(3)))
Exception: Could not find service: dbal.tools

/data/tests/mock/container_builder.php:71
/data/phpBB/includes/functions_admin.php:880
/data/phpBB/includes/functions_posting.php:1206
/data/tests/content_visibility/delete_post_test.php:324
phpbb_content_visibility_delete_post_test::test_delete_post with data set #1 (1, 1, 1, array(1, 3, 3, 0, 0, 1, 1, 1, true, 1, false), false, 'harddelete', array(array(2, 1, ''), array(3, 1, '')), array(array(1, 2, 3, 2, 0, 0, '')), array(array(2, 0, 0, 1, 0, 0, 3)), array(array(3)))
Exception: Could not find service: dbal.tools

/data/tests/mock/container_builder.php:71
/data/phpBB/includes/functions_admin.php:880
/data/phpBB/includes/functions_posting.php:1206
/data/tests/content_visibility/delete_post_test.php:324
phpbb_functions_user_delete_test::test_user_delete
Exception: Could not find service: dbal.tools

/data/tests/mock/container_builder.php:71
/data/phpBB/includes/functions_admin.php:880
/data/phpBB/includes/functions_user.php:664
/data/tests/functions/user_delete_test.php:101
phpbb_functions_user_delete_user_test::test_delete_data with data set #1 ('remove', array(array(1, 2)), array(array(1, 3)), array(array(2), array(3)), array(array('12345678901234567890123456789013')), array(array(2, 1, 1), array(3, 1, 1)), array(array(1, 3, 3), array(2, 1, 1)))
Exception: Could not find service: dbal.tools

/data/tests/mock/container_builder.php:71
/data/phpBB/includes/functions_admin.php:880
/data/phpBB/includes/functions_user.php:664
/data/tests/functions_user/delete_user_test.php:338
phpbb_functions_user_delete_user_test::test_delete_user_id_data with data set #1 ('remove', array('phpbb_user_group', 'phpbb_topics_watch', 'phpbb_forums_watch', 'phpbb_acl_users', 'phpbb_topics_track', 'phpbb_topics_posted', 'phpbb_forums_track', 'phpbb_profile_fields_data', 'phpbb_moderator_cache', 'phpbb_drafts', 'phpbb_bookmarks', 'phpbb_sessions_keys', 'phpbb_privmsgs_folder', 'phpbb_privmsgs_rules'))
Exception: Could not find service: dbal.tools

/data/tests/mock/container_builder.php:71
/data/phpBB/includes/functions_admin.php:880
/data/phpBB/includes/functions_user.php:664
/data/tests/functions_user/delete_user_test.php:432
phpbb_functions_user_delete_user_test::test_first_last_post_info with data set #3 ('remove', true, array(array(2, 1, 'Other'), array(4, 1, 'Other')), array(array(2, 1, 'Other', '', 1, 'Other', ''), array(4, 1, 'Other', '', 1, 'Other', '')), array(array(1, 0, '', ''), array(2, 1, 'Other', ''), array(3, 0, '', ''), array(4, 1, 'Other', '')))
Exception: Could not find service: dbal.tools

/data/tests/mock/container_builder.php:71
/data/phpBB/includes/functions_admin.php:880
/data/phpBB/includes/functions_user.php:664
/data/tests/functions_user/delete_user_test.php:189
phpbb_functions_user_delete_user_test::test_first_last_post_info with data set #1 ('remove', false, array(array(2, 1, 'Other'), array(4, 1, 'Other')), array(array(2, 1, 'Other', '', 1, 'Other', ''), array(4, 1, 'Other', '', 1, 'Other', '')), array(array(1, 0, '', ''), array(2, 1, 'Other', ''), array(3, 0, '', ''), array(4, 1, 'Other', '')))
Exception: Could not find service: dbal.tools

/data/tests/mock/container_builder.php:71
/data/phpBB/includes/functions_admin.php:880
/data/phpBB/includes/functions_user.php:664
/data/tests/functions_user/delete_user_test.php:189
phpbb_functions_user_delete_user_test::test_report_attachment_info with data set #1 ('remove', array(array(2, 1, 1, 1), array(4, 0, 1, 1)), array(array(3, 2, 1)), array(array(2, 1, 1), array(4, 0, 1)), array(array(2, 2, 1), array(3, 0, 2)))
Exception: Could not find service: dbal.tools

/data/tests/mock/container_builder.php:71
/data/phpBB/includes/functions_admin.php:880
/data/phpBB/includes/functions_user.php:664
/data/tests/functions_user/delete_user_test.php:266