Tests pending pull requests

Build: #8782 failed Manual run by Build Robot

Build result summary

Details

Completed
Duration
6 minutes
Flags
Custom build
Labels
pr_5329
Agent
Default Agent
Revision
dc8ff9da28b8ab4ad11c7ea94cca526f17c87fe5 dc8ff9da28b8ab4ad11c7ea94cca526f17c87fe5
Total tests
6902
Fixed in
#8783 (Manual run by Build Robot)

Responsible

No one has taken responsibility for this failure

Custom variables

Name Value
PRnumber 5329
PRref master

Tests

New test failures 10
Status Test View job Duration
Collapse Failed phpbb_notification_submit_post_type_bookmark_test::test_submit_post test_submit_post with data set #0 History
Build and Test Job < 1 sec
phpbb_notification_submit_post_type_bookmark_test::test_submit_post with data set #0 (array(), array(array(5, 1, 1)), array(array(3, 2, 1), array(5, 1, 1), array(7, 2, 1)))
Symfony\Component\DependencyInjection\Exception\ServiceNotFoundException: You have requested a non-existent service "dbal.tools".

/data/phpBB/vendor/symfony/dependency-injection/ContainerBuilder.php:1053
/data/phpBB/vendor/symfony/dependency-injection/ContainerBuilder.php:619
/data/phpBB/vendor/symfony/dependency-injection/ContainerBuilder.php:587
/data/phpBB/includes/functions_posting.php:1442
/data/tests/notification/submit_post_base.php:176
Collapse Failed phpbb_notification_submit_post_type_bookmark_test::test_submit_post test_submit_post with data set #1 History
Build and Test Job < 1 sec
phpbb_notification_submit_post_type_bookmark_test::test_submit_post with data set #1 (array(false), array(array(5, 1, 1)), array(array(5, 1, 1)))
Symfony\Component\DependencyInjection\Exception\ServiceNotFoundException: You have requested a non-existent service "dbal.tools".

/data/phpBB/vendor/symfony/dependency-injection/ContainerBuilder.php:1053
/data/phpBB/vendor/symfony/dependency-injection/ContainerBuilder.php:619
/data/phpBB/vendor/symfony/dependency-injection/ContainerBuilder.php:587
/data/phpBB/includes/functions_posting.php:1442
/data/tests/notification/submit_post_base.php:176
Collapse Failed phpbb_notification_submit_post_type_post_in_queue_test::test_submit_post test_submit_post with data set #1 History
Build and Test Job < 1 sec
phpbb_notification_submit_post_type_post_in_queue_test::test_submit_post with data set #1 (array(false), array(array(6, 1, 1)), array(array(3, 2, 1), array(6, 1, 1), array(6, 2, 1), array(8, 2, 1), array(9, 2, 1)))
Symfony\Component\DependencyInjection\Exception\ServiceNotFoundException: You have requested a non-existent service "dbal.tools".

/data/phpBB/vendor/symfony/dependency-injection/ContainerBuilder.php:1053
/data/phpBB/vendor/symfony/dependency-injection/ContainerBuilder.php:619
/data/phpBB/vendor/symfony/dependency-injection/ContainerBuilder.php:587
/data/phpBB/includes/functions_posting.php:1442
/data/tests/notification/submit_post_base.php:176
Collapse Failed phpbb_notification_submit_post_type_post_in_queue_test::test_submit_post test_submit_post with data set #0 History
Build and Test Job < 1 sec
phpbb_notification_submit_post_type_post_in_queue_test::test_submit_post with data set #0 (array(), array(array(6, 1, 1)), array(array(6, 1, 1)))
Symfony\Component\DependencyInjection\Exception\ServiceNotFoundException: You have requested a non-existent service "dbal.tools".

/data/phpBB/vendor/symfony/dependency-injection/ContainerBuilder.php:1053
/data/phpBB/vendor/symfony/dependency-injection/ContainerBuilder.php:619
/data/phpBB/vendor/symfony/dependency-injection/ContainerBuilder.php:587
/data/phpBB/includes/functions_posting.php:1442
/data/tests/notification/submit_post_base.php:176
Collapse Failed phpbb_notification_submit_post_type_post_test::test_submit_post test_submit_post with data set #1 History
Build and Test Job < 1 sec
phpbb_notification_submit_post_type_post_test::test_submit_post with data set #1 (array(false), array(array(5, 1, 1), array(8, 1, 1)), array(array(5, 1, 1), array(8, 1, 1)))
Symfony\Component\DependencyInjection\Exception\ServiceNotFoundException: You have requested a non-existent service "dbal.tools".

/data/phpBB/vendor/symfony/dependency-injection/ContainerBuilder.php:1053
/data/phpBB/vendor/symfony/dependency-injection/ContainerBuilder.php:619
/data/phpBB/vendor/symfony/dependency-injection/ContainerBuilder.php:587
/data/phpBB/includes/functions_posting.php:1442
/data/tests/notification/submit_post_base.php:176
Collapse Failed phpbb_notification_submit_post_type_post_test::test_submit_post test_submit_post with data set #0 History
Build and Test Job < 1 sec
phpbb_notification_submit_post_type_post_test::test_submit_post with data set #0 (array(), array(array(5, 1, 1), array(8, 1, 1)), array(array(3, 2, 1), array(5, 1, 1), array(6, 2, 1), array(7, 2, 1), array(8, 1, 1)))
Symfony\Component\DependencyInjection\Exception\ServiceNotFoundException: You have requested a non-existent service "dbal.tools".

/data/phpBB/vendor/symfony/dependency-injection/ContainerBuilder.php:1053
/data/phpBB/vendor/symfony/dependency-injection/ContainerBuilder.php:619
/data/phpBB/vendor/symfony/dependency-injection/ContainerBuilder.php:587
/data/phpBB/includes/functions_posting.php:1442
/data/tests/notification/submit_post_base.php:176
Collapse Failed phpbb_notification_submit_post_type_quote_test::test_submit_post test_submit_post with data set #0 History
Build and Test Job < 1 sec
phpbb_notification_submit_post_type_quote_test::test_submit_post with data set #0 (array('<r><QUOTE author="poster"><s>...E></r>', 'uid'), array(array(5, 1, 1)), array(array(3, 2, 1), array(5, 1, 1), array(5, 2, 1), array(7, 2, 1)))
Symfony\Component\DependencyInjection\Exception\ServiceNotFoundException: You have requested a non-existent service "dbal.tools".

/data/phpBB/vendor/symfony/dependency-injection/ContainerBuilder.php:1053
/data/phpBB/vendor/symfony/dependency-injection/ContainerBuilder.php:619
/data/phpBB/vendor/symfony/dependency-injection/ContainerBuilder.php:587
/data/phpBB/includes/functions_posting.php:1442
/data/tests/notification/submit_post_base.php:176
Collapse Failed phpbb_notification_submit_post_type_quote_test::test_submit_post test_submit_post with data set #1 History
Build and Test Job < 1 sec
phpbb_notification_submit_post_type_quote_test::test_submit_post with data set #1 (array('<r><QUOTE author="poster"><s>...E></r>', 'uid', false), array(array(5, 1, 1)), array(array(5, 1, 1)))
Symfony\Component\DependencyInjection\Exception\ServiceNotFoundException: You have requested a non-existent service "dbal.tools".

/data/phpBB/vendor/symfony/dependency-injection/ContainerBuilder.php:1053
/data/phpBB/vendor/symfony/dependency-injection/ContainerBuilder.php:619
/data/phpBB/vendor/symfony/dependency-injection/ContainerBuilder.php:587
/data/phpBB/includes/functions_posting.php:1442
/data/tests/notification/submit_post_base.php:176
Collapse Failed phpbb_notification_submit_post_type_topic_test::test_submit_post test_submit_post with data set #1 History
Build and Test Job < 1 sec
phpbb_notification_submit_post_type_topic_test::test_submit_post with data set #1 (array(false), array(array(8, 1, 1)), array(array(8, 1, 1)))
Symfony\Component\DependencyInjection\Exception\ServiceNotFoundException: You have requested a non-existent service "dbal.tools".

/data/phpBB/vendor/symfony/dependency-injection/ContainerBuilder.php:1053
/data/phpBB/vendor/symfony/dependency-injection/ContainerBuilder.php:619
/data/phpBB/vendor/symfony/dependency-injection/ContainerBuilder.php:587
/data/phpBB/includes/functions_posting.php:1442
/data/tests/notification/submit_post_type_topic_test.php:111
Collapse Failed phpbb_notification_submit_post_type_topic_test::test_submit_post test_submit_post with data set #0 History
Build and Test Job < 1 sec
phpbb_notification_submit_post_type_topic_test::test_submit_post with data set #0 (array(), array(array(8, 1, 1)), array(array(7, 2, 1), array(8, 1, 1), array(8, 2, 1)))
Symfony\Component\DependencyInjection\Exception\ServiceNotFoundException: You have requested a non-existent service "dbal.tools".

/data/phpBB/vendor/symfony/dependency-injection/ContainerBuilder.php:1053
/data/phpBB/vendor/symfony/dependency-injection/ContainerBuilder.php:619
/data/phpBB/vendor/symfony/dependency-injection/ContainerBuilder.php:587
/data/phpBB/includes/functions_posting.php:1442
/data/tests/notification/submit_post_type_topic_test.php:111

Error log

    Error occurred while running Task 'Run tests(10)' of type com.atlassian.bamboo.plugins.bamboo-docker-plugin:task.docker.cli.

    (15 Sep 2018, 10:02:37 AM, Occurrences: 6, Agents: Default Agent)