Tests pending pull requests

Build: #9044 failed Manual run by Build Robot

Build result summary

Details

Completed
Duration
17 minutes
Flags
Custom build
Labels
pr_5474
Agent
Default Agent
Revision
dc8ff9da28b8ab4ad11c7ea94cca526f17c87fe5 dc8ff9da28b8ab4ad11c7ea94cca526f17c87fe5
Total tests
6730
Fixed in
#9045 (Manual run by Build Robot)

Responsible

No one has taken responsibility for this failure

Custom variables

Name Value
PRnumber 5474
PRref 3.2.x

Tests

New test failures 122
Status Test View job Duration
Collapse Failed phpbb_event_md_exporter_test::test_crawl_phpbb_eventsmd test_crawl_phpbb_eventsmd with data set #0 History
Build and Test Job < 1 sec
phpbb_event_md_exporter_test::test_crawl_phpbb_eventsmd with data set #0 ('styles')
LogicException: Invalid file 'styles/prosilver/template/mcp_post.html
* Since 3.2.6-RC1
* Purpose: Add content before the post text' not found for event 'mcp_post_text_before'

/data/phpBB/phpbb/event/md_exporter.php:386
/data/phpBB/phpbb/event/md_exporter.php:179
/data/tests/event/md_exporter_test.php:114
Collapse Failed phpbb_event_md_exporter_test::test_crawl_template_file test_crawl_template_file with data set #149 History
Build and Test Job < 1 sec
phpbb_event_md_exporter_test::test_crawl_template_file with data set #149 ('styles', 'styles/prosilver/template/nav...r.html')
LogicException: Invalid file 'styles/prosilver/template/mcp_post.html
* Since 3.2.6-RC1
* Purpose: Add content before the post text' not found for event 'mcp_post_text_before'

/data/phpBB/phpbb/event/md_exporter.php:386
/data/phpBB/phpbb/event/md_exporter.php:179
/data/tests/event/md_exporter_test.php:146
Collapse Failed phpbb_event_md_exporter_test::test_crawl_template_file test_crawl_template_file with data set #147 History
Build and Test Job < 1 sec
phpbb_event_md_exporter_test::test_crawl_template_file with data set #147 ('styles', 'styles/prosilver/template/ucp...s.html')
LogicException: Invalid file 'styles/prosilver/template/mcp_post.html
* Since 3.2.6-RC1
* Purpose: Add content before the post text' not found for event 'mcp_post_text_before'

/data/phpBB/phpbb/event/md_exporter.php:386
/data/phpBB/phpbb/event/md_exporter.php:179
/data/tests/event/md_exporter_test.php:146
Collapse Failed phpbb_event_md_exporter_test::test_crawl_template_file test_crawl_template_file with data set #148 History
Build and Test Job < 1 sec
phpbb_event_md_exporter_test::test_crawl_template_file with data set #148 ('styles', 'styles/prosilver/template/ucp...t.html')
LogicException: Invalid file 'styles/prosilver/template/mcp_post.html
* Since 3.2.6-RC1
* Purpose: Add content before the post text' not found for event 'mcp_post_text_before'

/data/phpBB/phpbb/event/md_exporter.php:386
/data/phpBB/phpbb/event/md_exporter.php:179
/data/tests/event/md_exporter_test.php:146
Collapse Failed phpbb_event_md_exporter_test::test_crawl_template_file test_crawl_template_file with data set #152 History
Build and Test Job < 1 sec
phpbb_event_md_exporter_test::test_crawl_template_file with data set #152 ('styles', 'styles/prosilver/template/pos...r.html')
LogicException: Invalid file 'styles/prosilver/template/mcp_post.html
* Since 3.2.6-RC1
* Purpose: Add content before the post text' not found for event 'mcp_post_text_before'

/data/phpBB/phpbb/event/md_exporter.php:386
/data/phpBB/phpbb/event/md_exporter.php:179
/data/tests/event/md_exporter_test.php:146
Collapse Failed phpbb_event_md_exporter_test::test_crawl_template_file test_crawl_template_file with data set #153 History
Build and Test Job < 1 sec
phpbb_event_md_exporter_test::test_crawl_template_file with data set #153 ('styles', 'styles/prosilver/template/ucp...e.html')
LogicException: Invalid file 'styles/prosilver/template/mcp_post.html
* Since 3.2.6-RC1
* Purpose: Add content before the post text' not found for event 'mcp_post_text_before'

/data/phpBB/phpbb/event/md_exporter.php:386
/data/phpBB/phpbb/event/md_exporter.php:179
/data/tests/event/md_exporter_test.php:146
Collapse Failed phpbb_event_md_exporter_test::test_crawl_template_file test_crawl_template_file with data set #150 History
Build and Test Job < 1 sec
phpbb_event_md_exporter_test::test_crawl_template_file with data set #150 ('styles', 'styles/prosilver/template/ucp...r.html')
LogicException: Invalid file 'styles/prosilver/template/mcp_post.html
* Since 3.2.6-RC1
* Purpose: Add content before the post text' not found for event 'mcp_post_text_before'

/data/phpBB/phpbb/event/md_exporter.php:386
/data/phpBB/phpbb/event/md_exporter.php:179
/data/tests/event/md_exporter_test.php:146
Collapse Failed phpbb_event_md_exporter_test::test_crawl_template_file test_crawl_template_file with data set #151 History
Build and Test Job < 1 sec
phpbb_event_md_exporter_test::test_crawl_template_file with data set #151 ('styles', 'styles/prosilver/template/mcp...t.html')
LogicException: Invalid file 'styles/prosilver/template/mcp_post.html
* Since 3.2.6-RC1
* Purpose: Add content before the post text' not found for event 'mcp_post_text_before'

/data/phpBB/phpbb/event/md_exporter.php:386
/data/phpBB/phpbb/event/md_exporter.php:179
/data/tests/event/md_exporter_test.php:146
Collapse Failed phpbb_event_md_exporter_test::test_crawl_template_file test_crawl_template_file with data set #156 History
Build and Test Job < 1 sec
phpbb_event_md_exporter_test::test_crawl_template_file with data set #156 ('styles', 'styles/prosilver/template/ucp...r.html')
LogicException: Invalid file 'styles/prosilver/template/mcp_post.html
* Since 3.2.6-RC1
* Purpose: Add content before the post text' not found for event 'mcp_post_text_before'

/data/phpBB/phpbb/event/md_exporter.php:386
/data/phpBB/phpbb/event/md_exporter.php:179
/data/tests/event/md_exporter_test.php:146
Collapse Failed phpbb_event_md_exporter_test::test_crawl_template_file test_crawl_template_file with data set #157 History
Build and Test Job < 1 sec
phpbb_event_md_exporter_test::test_crawl_template_file with data set #157 ('styles', 'styles/prosilver/template/mcp...m.html')
LogicException: Invalid file 'styles/prosilver/template/mcp_post.html
* Since 3.2.6-RC1
* Purpose: Add content before the post text' not found for event 'mcp_post_text_before'

/data/phpBB/phpbb/event/md_exporter.php:386
/data/phpBB/phpbb/event/md_exporter.php:179
/data/tests/event/md_exporter_test.php:146
Collapse Failed phpbb_event_md_exporter_test::test_crawl_template_file test_crawl_template_file with data set #154 History
Build and Test Job < 1 sec
phpbb_event_md_exporter_test::test_crawl_template_file with data set #154 ('styles', 'styles/prosilver/template/sea...y.html')
LogicException: Invalid file 'styles/prosilver/template/mcp_post.html
* Since 3.2.6-RC1
* Purpose: Add content before the post text' not found for event 'mcp_post_text_before'

/data/phpBB/phpbb/event/md_exporter.php:386
/data/phpBB/phpbb/event/md_exporter.php:179
/data/tests/event/md_exporter_test.php:146
Collapse Failed phpbb_event_md_exporter_test::test_crawl_template_file test_crawl_template_file with data set #155 History
Build and Test Job < 1 sec
phpbb_event_md_exporter_test::test_crawl_template_file with data set #155 ('styles', 'styles/prosilver/template/for...y.html')
LogicException: Invalid file 'styles/prosilver/template/mcp_post.html
* Since 3.2.6-RC1
* Purpose: Add content before the post text' not found for event 'mcp_post_text_before'

/data/phpBB/phpbb/event/md_exporter.php:386
/data/phpBB/phpbb/event/md_exporter.php:179
/data/tests/event/md_exporter_test.php:146
Collapse Failed phpbb_event_md_exporter_test::test_crawl_template_file test_crawl_template_file with data set #158 History
Build and Test Job < 1 sec
phpbb_event_md_exporter_test::test_crawl_template_file with data set #158 ('styles', 'styles/prosilver/template/tim...n.html')
LogicException: Invalid file 'styles/prosilver/template/mcp_post.html
* Since 3.2.6-RC1
* Purpose: Add content before the post text' not found for event 'mcp_post_text_before'

/data/phpBB/phpbb/event/md_exporter.php:386
/data/phpBB/phpbb/event/md_exporter.php:179
/data/tests/event/md_exporter_test.php:146
Collapse Failed phpbb_event_md_exporter_test::test_crawl_template_file test_crawl_template_file with data set #159 History
Build and Test Job < 1 sec
phpbb_event_md_exporter_test::test_crawl_template_file with data set #159 ('styles', 'styles/prosilver/template/mem...m.html')
LogicException: Invalid file 'styles/prosilver/template/mcp_post.html
* Since 3.2.6-RC1
* Purpose: Add content before the post text' not found for event 'mcp_post_text_before'

/data/phpBB/phpbb/event/md_exporter.php:386
/data/phpBB/phpbb/event/md_exporter.php:179
/data/tests/event/md_exporter_test.php:146
Collapse Failed phpbb_event_md_exporter_test::test_crawl_template_file test_crawl_template_file with data set #160 History
Build and Test Job < 1 sec
phpbb_event_md_exporter_test::test_crawl_template_file with data set #160 ('styles', 'styles/prosilver/template/ucp...l.html')
LogicException: Invalid file 'styles/prosilver/template/mcp_post.html
* Since 3.2.6-RC1
* Purpose: Add content before the post text' not found for event 'mcp_post_text_before'

/data/phpBB/phpbb/event/md_exporter.php:386
/data/phpBB/phpbb/event/md_exporter.php:179
/data/tests/event/md_exporter_test.php:146
Collapse Failed phpbb_event_md_exporter_test::test_crawl_template_file test_crawl_template_file with data set #163 History
Build and Test Job < 1 sec
phpbb_event_md_exporter_test::test_crawl_template_file with data set #163 ('styles', 'styles/prosilver/template/ucp...s.html')
LogicException: Invalid file 'styles/prosilver/template/mcp_post.html
* Since 3.2.6-RC1
* Purpose: Add content before the post text' not found for event 'mcp_post_text_before'

/data/phpBB/phpbb/event/md_exporter.php:386
/data/phpBB/phpbb/event/md_exporter.php:179
/data/tests/event/md_exporter_test.php:146
Collapse Failed phpbb_event_md_exporter_test::test_crawl_template_file test_crawl_template_file with data set #164 History
Build and Test Job < 1 sec
phpbb_event_md_exporter_test::test_crawl_template_file with data set #164 ('styles', 'styles/prosilver/template/ucp...e.html')
LogicException: Invalid file 'styles/prosilver/template/mcp_post.html
* Since 3.2.6-RC1
* Purpose: Add content before the post text' not found for event 'mcp_post_text_before'

/data/phpBB/phpbb/event/md_exporter.php:386
/data/phpBB/phpbb/event/md_exporter.php:179
/data/tests/event/md_exporter_test.php:146
Collapse Failed phpbb_event_md_exporter_test::test_crawl_template_file test_crawl_template_file with data set #161 History
Build and Test Job < 1 sec
phpbb_event_md_exporter_test::test_crawl_template_file with data set #161 ('styles', 'styles/prosilver/template/pos...y.html')
LogicException: Invalid file 'styles/prosilver/template/mcp_post.html
* Since 3.2.6-RC1
* Purpose: Add content before the post text' not found for event 'mcp_post_text_before'

/data/phpBB/phpbb/event/md_exporter.php:386
/data/phpBB/phpbb/event/md_exporter.php:179
/data/tests/event/md_exporter_test.php:146
Collapse Failed phpbb_event_md_exporter_test::test_crawl_template_file test_crawl_template_file with data set #162 History
Build and Test Job < 1 sec
phpbb_event_md_exporter_test::test_crawl_template_file with data set #162 ('styles', 'styles/prosilver/template/ucp...s.html')
LogicException: Invalid file 'styles/prosilver/template/mcp_post.html
* Since 3.2.6-RC1
* Purpose: Add content before the post text' not found for event 'mcp_post_text_before'

/data/phpBB/phpbb/event/md_exporter.php:386
/data/phpBB/phpbb/event/md_exporter.php:179
/data/tests/event/md_exporter_test.php:146
Collapse Failed phpbb_event_md_exporter_test::test_crawl_template_file test_crawl_template_file with data set #167 History
Build and Test Job < 1 sec
phpbb_event_md_exporter_test::test_crawl_template_file with data set #167 ('styles', 'styles/prosilver/template/mcp...c.html')
LogicException: Invalid file 'styles/prosilver/template/mcp_post.html
* Since 3.2.6-RC1
* Purpose: Add content before the post text' not found for event 'mcp_post_text_before'

/data/phpBB/phpbb/event/md_exporter.php:386
/data/phpBB/phpbb/event/md_exporter.php:179
/data/tests/event/md_exporter_test.php:146
Collapse Failed phpbb_event_md_exporter_test::test_crawl_template_file test_crawl_template_file with data set #200 History
Build and Test Job < 1 sec
phpbb_event_md_exporter_test::test_crawl_template_file with data set #200 ('styles', 'styles/prosilver/template/mem...w.html')
LogicException: Invalid file 'styles/prosilver/template/mcp_post.html
* Since 3.2.6-RC1
* Purpose: Add content before the post text' not found for event 'mcp_post_text_before'

/data/phpBB/phpbb/event/md_exporter.php:386
/data/phpBB/phpbb/event/md_exporter.php:179
/data/tests/event/md_exporter_test.php:146
Collapse Failed phpbb_event_md_exporter_test::test_crawl_template_file test_crawl_template_file with data set #168 History
Build and Test Job < 1 sec
phpbb_event_md_exporter_test::test_crawl_template_file with data set #168 ('styles', 'styles/prosilver/template/mcp...e.html')
LogicException: Invalid file 'styles/prosilver/template/mcp_post.html
* Since 3.2.6-RC1
* Purpose: Add content before the post text' not found for event 'mcp_post_text_before'

/data/phpBB/phpbb/event/md_exporter.php:386
/data/phpBB/phpbb/event/md_exporter.php:179
/data/tests/event/md_exporter_test.php:146
Collapse Failed phpbb_event_md_exporter_test::test_crawl_template_file test_crawl_template_file with data set #201 History
Build and Test Job < 1 sec
phpbb_event_md_exporter_test::test_crawl_template_file with data set #201 ('styles', 'styles/prosilver/template/rep...y.html')
LogicException: Invalid file 'styles/prosilver/template/mcp_post.html
* Since 3.2.6-RC1
* Purpose: Add content before the post text' not found for event 'mcp_post_text_before'

/data/phpBB/phpbb/event/md_exporter.php:386
/data/phpBB/phpbb/event/md_exporter.php:179
/data/tests/event/md_exporter_test.php:146
Collapse Failed phpbb_event_md_exporter_test::test_crawl_template_file test_crawl_template_file with data set #165 History
Build and Test Job < 1 sec
phpbb_event_md_exporter_test::test_crawl_template_file with data set #165 ('styles', 'styles/prosilver/template/pos...s.html')
LogicException: Invalid file 'styles/prosilver/template/mcp_post.html
* Since 3.2.6-RC1
* Purpose: Add content before the post text' not found for event 'mcp_post_text_before'

/data/phpBB/phpbb/event/md_exporter.php:386
/data/phpBB/phpbb/event/md_exporter.php:179
/data/tests/event/md_exporter_test.php:146
Collapse Failed phpbb_event_md_exporter_test::test_crawl_template_file test_crawl_template_file with data set #166 History
Build and Test Job < 1 sec
phpbb_event_md_exporter_test::test_crawl_template_file with data set #166 ('styles', 'styles/prosilver/template/dis...s.html')
LogicException: Invalid file 'styles/prosilver/template/mcp_post.html
* Since 3.2.6-RC1
* Purpose: Add content before the post text' not found for event 'mcp_post_text_before'

/data/phpBB/phpbb/event/md_exporter.php:386
/data/phpBB/phpbb/event/md_exporter.php:179
/data/tests/event/md_exporter_test.php:146
Collapse Failed phpbb_event_md_exporter_test::test_crawl_template_file test_crawl_template_file with data set #127 History
Build and Test Job < 1 sec
phpbb_event_md_exporter_test::test_crawl_template_file with data set #127 ('styles', 'styles/prosilver/template/faq...y.html')
LogicException: Invalid file 'styles/prosilver/template/mcp_post.html
* Since 3.2.6-RC1
* Purpose: Add content before the post text' not found for event 'mcp_post_text_before'

/data/phpBB/phpbb/event/md_exporter.php:386
/data/phpBB/phpbb/event/md_exporter.php:179
/data/tests/event/md_exporter_test.php:146
Collapse Failed phpbb_event_md_exporter_test::test_crawl_template_file test_crawl_template_file with data set #128 History
Build and Test Job < 1 sec
phpbb_event_md_exporter_test::test_crawl_template_file with data set #128 ('styles', 'styles/prosilver/template/ucp...k.html')
LogicException: Invalid file 'styles/prosilver/template/mcp_post.html
* Since 3.2.6-RC1
* Purpose: Add content before the post text' not found for event 'mcp_post_text_before'

/data/phpBB/phpbb/event/md_exporter.php:386
/data/phpBB/phpbb/event/md_exporter.php:179
/data/tests/event/md_exporter_test.php:146
Collapse Failed phpbb_event_md_exporter_test::test_crawl_template_file test_crawl_template_file with data set #125 History
Build and Test Job < 1 sec
phpbb_event_md_exporter_test::test_crawl_template_file with data set #125 ('styles', 'styles/prosilver/template/ucp...r.html')
LogicException: Invalid file 'styles/prosilver/template/mcp_post.html
* Since 3.2.6-RC1
* Purpose: Add content before the post text' not found for event 'mcp_post_text_before'

/data/phpBB/phpbb/event/md_exporter.php:386
/data/phpBB/phpbb/event/md_exporter.php:179
/data/tests/event/md_exporter_test.php:146
Collapse Failed phpbb_event_md_exporter_test::test_crawl_template_file test_crawl_template_file with data set #126 History
Build and Test Job < 1 sec
phpbb_event_md_exporter_test::test_crawl_template_file with data set #126 ('styles', 'styles/prosilver/template/log...h.html')
LogicException: Invalid file 'styles/prosilver/template/mcp_post.html
* Since 3.2.6-RC1
* Purpose: Add content before the post text' not found for event 'mcp_post_text_before'

/data/phpBB/phpbb/event/md_exporter.php:386
/data/phpBB/phpbb/event/md_exporter.php:179
/data/tests/event/md_exporter_test.php:146
Collapse Failed phpbb_event_md_exporter_test::test_crawl_template_file test_crawl_template_file with data set #129 History
Build and Test Job < 1 sec
phpbb_event_md_exporter_test::test_crawl_template_file with data set #129 ('styles', 'styles/prosilver/template/ucp...e.html')
LogicException: Invalid file 'styles/prosilver/template/mcp_post.html
* Since 3.2.6-RC1
* Purpose: Add content before the post text' not found for event 'mcp_post_text_before'

/data/phpBB/phpbb/event/md_exporter.php:386
/data/phpBB/phpbb/event/md_exporter.php:179
/data/tests/event/md_exporter_test.php:146
Collapse Failed phpbb_event_md_exporter_test::test_crawl_template_file test_crawl_template_file with data set #130 History
Build and Test Job < 1 sec
phpbb_event_md_exporter_test::test_crawl_template_file with data set #130 ('styles', 'styles/prosilver/template/pos...y.html')
LogicException: Invalid file 'styles/prosilver/template/mcp_post.html
* Since 3.2.6-RC1
* Purpose: Add content before the post text' not found for event 'mcp_post_text_before'

/data/phpBB/phpbb/event/md_exporter.php:386
/data/phpBB/phpbb/event/md_exporter.php:179
/data/tests/event/md_exporter_test.php:146
Collapse Failed phpbb_event_md_exporter_test::test_crawl_template_file test_crawl_template_file with data set #131 History
Build and Test Job < 1 sec
phpbb_event_md_exporter_test::test_crawl_template_file with data set #131 ('styles', 'styles/prosilver/template/mem...h.html')
LogicException: Invalid file 'styles/prosilver/template/mcp_post.html
* Since 3.2.6-RC1
* Purpose: Add content before the post text' not found for event 'mcp_post_text_before'

/data/phpBB/phpbb/event/md_exporter.php:386
/data/phpBB/phpbb/event/md_exporter.php:179
/data/tests/event/md_exporter_test.php:146
Collapse Failed phpbb_event_md_exporter_test::test_crawl_template_file test_crawl_template_file with data set #134 History
Build and Test Job < 1 sec
phpbb_event_md_exporter_test::test_crawl_template_file with data set #134 ('styles', 'styles/prosilver/template/mem...m.html')
LogicException: Invalid file 'styles/prosilver/template/mcp_post.html
* Since 3.2.6-RC1
* Purpose: Add content before the post text' not found for event 'mcp_post_text_before'

/data/phpBB/phpbb/event/md_exporter.php:386
/data/phpBB/phpbb/event/md_exporter.php:179
/data/tests/event/md_exporter_test.php:146
Collapse Failed phpbb_event_md_exporter_test::test_crawl_template_file test_crawl_template_file with data set #135 History
Build and Test Job < 1 sec
phpbb_event_md_exporter_test::test_crawl_template_file with data set #135 ('styles', 'styles/prosilver/template/ucp...s.html')
LogicException: Invalid file 'styles/prosilver/template/mcp_post.html
* Since 3.2.6-RC1
* Purpose: Add content before the post text' not found for event 'mcp_post_text_before'

/data/phpBB/phpbb/event/md_exporter.php:386
/data/phpBB/phpbb/event/md_exporter.php:179
/data/tests/event/md_exporter_test.php:146
Collapse Failed phpbb_event_md_exporter_test::test_crawl_template_file test_crawl_template_file with data set #132 History
Build and Test Job < 1 sec
phpbb_event_md_exporter_test::test_crawl_template_file with data set #132 ('styles', 'styles/prosilver/template/ucp...w.html')
LogicException: Invalid file 'styles/prosilver/template/mcp_post.html
* Since 3.2.6-RC1
* Purpose: Add content before the post text' not found for event 'mcp_post_text_before'

/data/phpBB/phpbb/event/md_exporter.php:386
/data/phpBB/phpbb/event/md_exporter.php:179
/data/tests/event/md_exporter_test.php:146
Collapse Failed phpbb_event_md_exporter_test::test_crawl_template_file test_crawl_template_file with data set #133 History
Build and Test Job < 1 sec
phpbb_event_md_exporter_test::test_crawl_template_file with data set #133 ('styles', 'styles/prosilver/template/mcp...r.html')
LogicException: Invalid file 'styles/prosilver/template/mcp_post.html
* Since 3.2.6-RC1
* Purpose: Add content before the post text' not found for event 'mcp_post_text_before'

/data/phpBB/phpbb/event/md_exporter.php:386
/data/phpBB/phpbb/event/md_exporter.php:179
/data/tests/event/md_exporter_test.php:146
Collapse Failed phpbb_event_md_exporter_test::test_crawl_template_file test_crawl_template_file with data set #138 History
Build and Test Job < 1 sec
phpbb_event_md_exporter_test::test_crawl_template_file with data set #138 ('styles', 'styles/prosilver/template/mem...l.html')
LogicException: Invalid file 'styles/prosilver/template/mcp_post.html
* Since 3.2.6-RC1
* Purpose: Add content before the post text' not found for event 'mcp_post_text_before'

/data/phpBB/phpbb/event/md_exporter.php:386
/data/phpBB/phpbb/event/md_exporter.php:179
/data/tests/event/md_exporter_test.php:146
Collapse Failed phpbb_event_md_exporter_test::test_crawl_template_file test_crawl_template_file with data set #139 History
Build and Test Job < 1 sec
phpbb_event_md_exporter_test::test_crawl_template_file with data set #139 ('styles', 'styles/prosilver/template/jumpbox.html')
LogicException: Invalid file 'styles/prosilver/template/mcp_post.html
* Since 3.2.6-RC1
* Purpose: Add content before the post text' not found for event 'mcp_post_text_before'

/data/phpBB/phpbb/event/md_exporter.php:386
/data/phpBB/phpbb/event/md_exporter.php:179
/data/tests/event/md_exporter_test.php:146
Collapse Failed phpbb_event_md_exporter_test::test_crawl_template_file test_crawl_template_file with data set #136 History
Build and Test Job < 1 sec
phpbb_event_md_exporter_test::test_crawl_template_file with data set #136 ('styles', 'styles/prosilver/template/ucp...r.html')
LogicException: Invalid file 'styles/prosilver/template/mcp_post.html
* Since 3.2.6-RC1
* Purpose: Add content before the post text' not found for event 'mcp_post_text_before'

/data/phpBB/phpbb/event/md_exporter.php:386
/data/phpBB/phpbb/event/md_exporter.php:179
/data/tests/event/md_exporter_test.php:146
Collapse Failed phpbb_event_md_exporter_test::test_crawl_template_file test_crawl_template_file with data set #137 History
Build and Test Job < 1 sec
phpbb_event_md_exporter_test::test_crawl_template_file with data set #137 ('styles', 'styles/prosilver/template/pag...n.html')
LogicException: Invalid file 'styles/prosilver/template/mcp_post.html
* Since 3.2.6-RC1
* Purpose: Add content before the post text' not found for event 'mcp_post_text_before'

/data/phpBB/phpbb/event/md_exporter.php:386
/data/phpBB/phpbb/event/md_exporter.php:179
/data/tests/event/md_exporter_test.php:146
Collapse Failed phpbb_event_md_exporter_test::test_crawl_template_file test_crawl_template_file with data set #141 History
Build and Test Job < 1 sec
phpbb_event_md_exporter_test::test_crawl_template_file with data set #141 ('styles', 'styles/prosilver/template/mcp...s.html')
LogicException: Invalid file 'styles/prosilver/template/mcp_post.html
* Since 3.2.6-RC1
* Purpose: Add content before the post text' not found for event 'mcp_post_text_before'

/data/phpBB/phpbb/event/md_exporter.php:386
/data/phpBB/phpbb/event/md_exporter.php:179
/data/tests/event/md_exporter_test.php:146
Collapse Failed phpbb_event_md_exporter_test::test_crawl_template_file test_crawl_template_file with data set #142 History
Build and Test Job < 1 sec
phpbb_event_md_exporter_test::test_crawl_template_file with data set #142 ('styles', 'styles/prosilver/template/ucp...l.html')
LogicException: Invalid file 'styles/prosilver/template/mcp_post.html
* Since 3.2.6-RC1
* Purpose: Add content before the post text' not found for event 'mcp_post_text_before'

/data/phpBB/phpbb/event/md_exporter.php:386
/data/phpBB/phpbb/event/md_exporter.php:179
/data/tests/event/md_exporter_test.php:146
Collapse Failed phpbb_event_md_exporter_test::test_crawl_template_file test_crawl_template_file with data set #140 History
Build and Test Job < 1 sec
phpbb_event_md_exporter_test::test_crawl_template_file with data set #140 ('styles', 'styles/prosilver/template/ucp...t.html')
LogicException: Invalid file 'styles/prosilver/template/mcp_post.html
* Since 3.2.6-RC1
* Purpose: Add content before the post text' not found for event 'mcp_post_text_before'

/data/phpBB/phpbb/event/md_exporter.php:386
/data/phpBB/phpbb/event/md_exporter.php:179
/data/tests/event/md_exporter_test.php:146
Collapse Failed phpbb_event_md_exporter_test::test_crawl_template_file test_crawl_template_file with data set #145 History
Build and Test Job < 1 sec
phpbb_event_md_exporter_test::test_crawl_template_file with data set #145 ('styles', 'styles/prosilver/template/pos...w.html')
LogicException: Invalid file 'styles/prosilver/template/mcp_post.html
* Since 3.2.6-RC1
* Purpose: Add content before the post text' not found for event 'mcp_post_text_before'

/data/phpBB/phpbb/event/md_exporter.php:386
/data/phpBB/phpbb/event/md_exporter.php:179
/data/tests/event/md_exporter_test.php:146
Collapse Failed phpbb_event_md_exporter_test::test_crawl_template_file test_crawl_template_file with data set #146 History
Build and Test Job < 1 sec
phpbb_event_md_exporter_test::test_crawl_template_file with data set #146 ('styles', 'styles/prosilver/template/ucp...k.html')
LogicException: Invalid file 'styles/prosilver/template/mcp_post.html
* Since 3.2.6-RC1
* Purpose: Add content before the post text' not found for event 'mcp_post_text_before'

/data/phpBB/phpbb/event/md_exporter.php:386
/data/phpBB/phpbb/event/md_exporter.php:179
/data/tests/event/md_exporter_test.php:146
Collapse Failed phpbb_event_md_exporter_test::test_crawl_template_file test_crawl_template_file with data set #143 History
Build and Test Job < 1 sec
phpbb_event_md_exporter_test::test_crawl_template_file with data set #143 ('styles', 'styles/prosilver/template/vie...t.html')
LogicException: Invalid file 'styles/prosilver/template/mcp_post.html
* Since 3.2.6-RC1
* Purpose: Add content before the post text' not found for event 'mcp_post_text_before'

/data/phpBB/phpbb/event/md_exporter.php:386
/data/phpBB/phpbb/event/md_exporter.php:179
/data/tests/event/md_exporter_test.php:146
Collapse Failed phpbb_event_md_exporter_test::test_crawl_template_file test_crawl_template_file with data set #144 History
Build and Test Job < 1 sec
phpbb_event_md_exporter_test::test_crawl_template_file with data set #144 ('styles', 'styles/prosilver/template/pos...s.html')
LogicException: Invalid file 'styles/prosilver/template/mcp_post.html
* Since 3.2.6-RC1
* Purpose: Add content before the post text' not found for event 'mcp_post_text_before'

/data/phpBB/phpbb/event/md_exporter.php:386
/data/phpBB/phpbb/event/md_exporter.php:179
/data/tests/event/md_exporter_test.php:146
Collapse Failed phpbb_event_md_exporter_test::test_crawl_template_file test_crawl_template_file with data set #95 History
Build and Test Job < 1 sec
phpbb_event_md_exporter_test::test_crawl_template_file with data set #95 ('styles', 'styles/prosilver/template/ucp...d.html')
LogicException: Invalid file 'styles/prosilver/template/mcp_post.html
* Since 3.2.6-RC1
* Purpose: Add content before the post text' not found for event 'mcp_post_text_before'

/data/phpBB/phpbb/event/md_exporter.php:386
/data/phpBB/phpbb/event/md_exporter.php:179
/data/tests/event/md_exporter_test.php:146
Collapse Failed phpbb_event_md_exporter_test::test_crawl_template_file test_crawl_template_file with data set #105 History
Build and Test Job < 1 sec
phpbb_event_md_exporter_test::test_crawl_template_file with data set #105 ('styles', 'styles/prosilver/template/ucp...d.html')
LogicException: Invalid file 'styles/prosilver/template/mcp_post.html
* Since 3.2.6-RC1
* Purpose: Add content before the post text' not found for event 'mcp_post_text_before'

/data/phpBB/phpbb/event/md_exporter.php:386
/data/phpBB/phpbb/event/md_exporter.php:179
/data/tests/event/md_exporter_test.php:146
Collapse Failed phpbb_event_md_exporter_test::test_crawl_template_file test_crawl_template_file with data set #96 History
Build and Test Job < 1 sec
phpbb_event_md_exporter_test::test_crawl_template_file with data set #96 ('styles', 'styles/prosilver/template/sea...s.html')
LogicException: Invalid file 'styles/prosilver/template/mcp_post.html
* Since 3.2.6-RC1
* Purpose: Add content before the post text' not found for event 'mcp_post_text_before'

/data/phpBB/phpbb/event/md_exporter.php:386
/data/phpBB/phpbb/event/md_exporter.php:179
/data/tests/event/md_exporter_test.php:146

Error log

    Error occurred while running Task 'Run tests(10)' of type com.atlassian.bamboo.plugins.bamboo-docker-plugin:task.docker.cli.

    (04 Dec 2018, 1:06:23 AM, Occurrences: 14, Agents: Default Agent)