Tests pending pull requests

Build: #9558 failed Manual run by Build Robot

Build result summary

Details

Completed
Duration
7 minutes
Flags
Custom build
Labels
pr_5680
Agent
Default Agent
Revision
dc8ff9da28b8ab4ad11c7ea94cca526f17c87fe5 dc8ff9da28b8ab4ad11c7ea94cca526f17c87fe5
Total tests
5980
Fixed in
#9559 (Manual run by Build Robot)

Responsible

No one has taken responsibility for this failure

Custom variables

Name Value
PRnumber 5680
PRref 3.2.x

Tests

New test failures 109
Status Test View job Duration
Collapse Failed get_callable_from_step_test get_callable_from_step_test History
Build and Test Job < 1 sec
get_callable_from_step_test
UnexpectedValueException: Unable to resolve the dependency '\phpbb\db\migration\data\v32x\v327'

/data/phpBB/phpbb/db/migration/schema_generator.php:238
/data/phpBB/phpbb/db/migration/schema_generator.php:214
/data/tests/test_framework/phpbb_database_test_case.php:84
Collapse Failed phpbb_attachment_delete_test phpbb_attachment_delete_test History
Build and Test Job < 1 sec
phpbb_attachment_delete_test
UnexpectedValueException: Unable to resolve the dependency '\phpbb\db\migration\data\v32x\v327'

/data/phpBB/phpbb/db/migration/schema_generator.php:238
/data/phpBB/phpbb/db/migration/schema_generator.php:214
/data/tests/test_framework/phpbb_database_test_case.php:84
Collapse Failed phpbb_attachment_resync_test phpbb_attachment_resync_test History
Build and Test Job < 1 sec
phpbb_attachment_resync_test
UnexpectedValueException: Unable to resolve the dependency '\phpbb\db\migration\data\v32x\v327'

/data/phpBB/phpbb/db/migration/schema_generator.php:238
/data/phpBB/phpbb/db/migration/schema_generator.php:214
/data/tests/test_framework/phpbb_database_test_case.php:84
Collapse Failed phpbb_attachment_upload_test phpbb_attachment_upload_test History
Build and Test Job < 1 sec
phpbb_attachment_upload_test
UnexpectedValueException: Unable to resolve the dependency '\phpbb\db\migration\data\v32x\v327'

/data/phpBB/phpbb/db/migration/schema_generator.php:238
/data/phpBB/phpbb/db/migration/schema_generator.php:214
/data/tests/test_framework/phpbb_database_test_case.php:84
Collapse Failed phpbb_auth_provider_apache_test phpbb_auth_provider_apache_test History
Build and Test Job < 1 sec
phpbb_auth_provider_apache_test
UnexpectedValueException: Unable to resolve the dependency '\phpbb\db\migration\data\v32x\v327'

/data/phpBB/phpbb/db/migration/schema_generator.php:238
/data/phpBB/phpbb/db/migration/schema_generator.php:214
/data/tests/test_framework/phpbb_database_test_case.php:84
Collapse Failed phpbb_auth_provider_db_test phpbb_auth_provider_db_test History
Build and Test Job < 1 sec
phpbb_auth_provider_db_test
UnexpectedValueException: Unable to resolve the dependency '\phpbb\db\migration\data\v32x\v327'

/data/phpBB/phpbb/db/migration/schema_generator.php:238
/data/phpBB/phpbb/db/migration/schema_generator.php:214
/data/tests/test_framework/phpbb_database_test_case.php:84
Collapse Failed phpbb_auth_provider_oauth_token_storage_test phpbb_auth_provider_oauth_token_storage_test History
Build and Test Job < 1 sec
phpbb_auth_provider_oauth_token_storage_test
UnexpectedValueException: Unable to resolve the dependency '\phpbb\db\migration\data\v32x\v327'

/data/phpBB/phpbb/db/migration/schema_generator.php:238
/data/phpBB/phpbb/db/migration/schema_generator.php:214
/data/tests/test_framework/phpbb_database_test_case.php:84
Collapse Failed phpbb_avatar_manager_test phpbb_avatar_manager_test History
Build and Test Job < 1 sec
phpbb_avatar_manager_test
UnexpectedValueException: Unable to resolve the dependency '\phpbb\db\migration\data\v32x\v327'

/data/phpBB/phpbb/db/migration/schema_generator.php:238
/data/phpBB/phpbb/db/migration/schema_generator.php:214
/data/tests/test_framework/phpbb_database_test_case.php:84
Collapse Failed phpbb_boolean_processor_test phpbb_boolean_processor_test History
Build and Test Job < 1 sec
phpbb_boolean_processor_test
UnexpectedValueException: Unable to resolve the dependency '\phpbb\db\migration\data\v32x\v327'

/data/phpBB/phpbb/db/migration/schema_generator.php:238
/data/phpBB/phpbb/db/migration/schema_generator.php:214
/data/tests/test_framework/phpbb_database_test_case.php:84
Collapse Failed phpbb_cache_dummy_driver_test phpbb_cache_dummy_driver_test History
Build and Test Job < 1 sec
phpbb_cache_dummy_driver_test
UnexpectedValueException: Unable to resolve the dependency '\phpbb\db\migration\data\v32x\v327'

/data/phpBB/phpbb/db/migration/schema_generator.php:238
/data/phpBB/phpbb/db/migration/schema_generator.php:214
/data/tests/test_framework/phpbb_database_test_case.php:84
Collapse Failed phpbb_cache_file_driver_test phpbb_cache_file_driver_test History
Build and Test Job < 1 sec
phpbb_cache_file_driver_test
UnexpectedValueException: Unable to resolve the dependency '\phpbb\db\migration\data\v32x\v327'

/data/phpBB/phpbb/db/migration/schema_generator.php:238
/data/phpBB/phpbb/db/migration/schema_generator.php:214
/data/tests/test_framework/phpbb_database_test_case.php:84
Collapse Failed phpbb_cache_memory_test phpbb_cache_memory_test History
Build and Test Job < 1 sec
phpbb_cache_memory_test
UnexpectedValueException: Unable to resolve the dependency '\phpbb\db\migration\data\v32x\v327'

/data/phpBB/phpbb/db/migration/schema_generator.php:238
/data/phpBB/phpbb/db/migration/schema_generator.php:214
/data/tests/test_framework/phpbb_database_test_case.php:84
Collapse Failed phpbb_captcha_qa_test phpbb_captcha_qa_test History
Build and Test Job < 1 sec
phpbb_captcha_qa_test
UnexpectedValueException: Unable to resolve the dependency '\phpbb\db\migration\data\v32x\v327'

/data/phpBB/phpbb/db/migration/schema_generator.php:238
/data/phpBB/phpbb/db/migration/schema_generator.php:214
/data/tests/test_framework/phpbb_database_test_case.php:84
Collapse Failed phpbb_config_db_test phpbb_config_db_test History
Build and Test Job < 1 sec
phpbb_config_db_test
UnexpectedValueException: Unable to resolve the dependency '\phpbb\db\migration\data\v32x\v327'

/data/phpBB/phpbb/db/migration/schema_generator.php:238
/data/phpBB/phpbb/db/migration/schema_generator.php:214
/data/tests/test_framework/phpbb_database_test_case.php:84
Collapse Failed phpbb_config_db_text_test phpbb_config_db_text_test History
Build and Test Job < 1 sec
phpbb_config_db_text_test
UnexpectedValueException: Unable to resolve the dependency '\phpbb\db\migration\data\v32x\v327'

/data/phpBB/phpbb/db/migration/schema_generator.php:238
/data/phpBB/phpbb/db/migration/schema_generator.php:214
/data/tests/test_framework/phpbb_database_test_case.php:84
Collapse Failed phpbb_console_command_cron_run_test phpbb_console_command_cron_run_test History
Build and Test Job < 1 sec
phpbb_console_command_cron_run_test
UnexpectedValueException: Unable to resolve the dependency '\phpbb\db\migration\data\v32x\v327'

/data/phpBB/phpbb/db/migration/schema_generator.php:238
/data/phpBB/phpbb/db/migration/schema_generator.php:214
/data/tests/test_framework/phpbb_database_test_case.php:84
Collapse Failed phpbb_console_command_thumbnail_test phpbb_console_command_thumbnail_test History
Build and Test Job < 1 sec
phpbb_console_command_thumbnail_test
UnexpectedValueException: Unable to resolve the dependency '\phpbb\db\migration\data\v32x\v327'

/data/phpBB/phpbb/db/migration/schema_generator.php:238
/data/phpBB/phpbb/db/migration/schema_generator.php:214
/data/tests/test_framework/phpbb_database_test_case.php:84
Collapse Failed phpbb_console_user_activate_test phpbb_console_user_activate_test History
Build and Test Job < 1 sec
phpbb_console_user_activate_test
UnexpectedValueException: Unable to resolve the dependency '\phpbb\db\migration\data\v32x\v327'

/data/phpBB/phpbb/db/migration/schema_generator.php:238
/data/phpBB/phpbb/db/migration/schema_generator.php:214
/data/tests/test_framework/phpbb_database_test_case.php:84
Collapse Failed phpbb_console_user_add_test phpbb_console_user_add_test History
Build and Test Job < 1 sec
phpbb_console_user_add_test
UnexpectedValueException: Unable to resolve the dependency '\phpbb\db\migration\data\v32x\v327'

/data/phpBB/phpbb/db/migration/schema_generator.php:238
/data/phpBB/phpbb/db/migration/schema_generator.php:214
/data/tests/test_framework/phpbb_database_test_case.php:84
Collapse Failed phpbb_console_user_delete_test phpbb_console_user_delete_test History
Build and Test Job < 1 sec
phpbb_console_user_delete_test
UnexpectedValueException: Unable to resolve the dependency '\phpbb\db\migration\data\v32x\v327'

/data/phpBB/phpbb/db/migration/schema_generator.php:238
/data/phpBB/phpbb/db/migration/schema_generator.php:214
/data/tests/test_framework/phpbb_database_test_case.php:84
Collapse Failed phpbb_console_user_reclean_test phpbb_console_user_reclean_test History
Build and Test Job < 1 sec
phpbb_console_user_reclean_test
UnexpectedValueException: Unable to resolve the dependency '\phpbb\db\migration\data\v32x\v327'

/data/phpBB/phpbb/db/migration/schema_generator.php:238
/data/phpBB/phpbb/db/migration/schema_generator.php:214
/data/tests/test_framework/phpbb_database_test_case.php:84
Collapse Failed phpbb_content_visibility_delete_post_test phpbb_content_visibility_delete_post_test History
Build and Test Job < 1 sec
phpbb_content_visibility_delete_post_test
UnexpectedValueException: Unable to resolve the dependency '\phpbb\db\migration\data\v32x\v327'

/data/phpBB/phpbb/db/migration/schema_generator.php:238
/data/phpBB/phpbb/db/migration/schema_generator.php:214
/data/tests/test_framework/phpbb_database_test_case.php:84
Collapse Failed phpbb_content_visibility_get_forums_visibility_sql_test phpbb_content_visibility_get_forums_visibility_sql_test History
Build and Test Job < 1 sec
phpbb_content_visibility_get_forums_visibility_sql_test
UnexpectedValueException: Unable to resolve the dependency '\phpbb\db\migration\data\v32x\v327'

/data/phpBB/phpbb/db/migration/schema_generator.php:238
/data/phpBB/phpbb/db/migration/schema_generator.php:214
/data/tests/test_framework/phpbb_database_test_case.php:84
Collapse Failed phpbb_content_visibility_get_global_visibility_sql_test phpbb_content_visibility_get_global_visibility_sql_test History
Build and Test Job < 1 sec
phpbb_content_visibility_get_global_visibility_sql_test
UnexpectedValueException: Unable to resolve the dependency '\phpbb\db\migration\data\v32x\v327'

/data/phpBB/phpbb/db/migration/schema_generator.php:238
/data/phpBB/phpbb/db/migration/schema_generator.php:214
/data/tests/test_framework/phpbb_database_test_case.php:84
Collapse Failed phpbb_content_visibility_get_visibility_sql_test phpbb_content_visibility_get_visibility_sql_test History
Build and Test Job < 1 sec
phpbb_content_visibility_get_visibility_sql_test
UnexpectedValueException: Unable to resolve the dependency '\phpbb\db\migration\data\v32x\v327'

/data/phpBB/phpbb/db/migration/schema_generator.php:238
/data/phpBB/phpbb/db/migration/schema_generator.php:214
/data/tests/test_framework/phpbb_database_test_case.php:84
Collapse Failed phpbb_content_visibility_set_post_visibility_test phpbb_content_visibility_set_post_visibility_test History
Build and Test Job < 1 sec
phpbb_content_visibility_set_post_visibility_test
UnexpectedValueException: Unable to resolve the dependency '\phpbb\db\migration\data\v32x\v327'

/data/phpBB/phpbb/db/migration/schema_generator.php:238
/data/phpBB/phpbb/db/migration/schema_generator.php:214
/data/tests/test_framework/phpbb_database_test_case.php:84
Collapse Failed phpbb_content_visibility_set_topic_visibility_test phpbb_content_visibility_set_topic_visibility_test History
Build and Test Job < 1 sec
phpbb_content_visibility_set_topic_visibility_test
UnexpectedValueException: Unable to resolve the dependency '\phpbb\db\migration\data\v32x\v327'

/data/phpBB/phpbb/db/migration/schema_generator.php:238
/data/phpBB/phpbb/db/migration/schema_generator.php:214
/data/tests/test_framework/phpbb_database_test_case.php:84
Collapse Failed phpbb_dbal_auto_increment_test phpbb_dbal_auto_increment_test History
Build and Test Job < 1 sec
phpbb_dbal_auto_increment_test
UnexpectedValueException: Unable to resolve the dependency '\phpbb\db\migration\data\v32x\v327'

/data/phpBB/phpbb/db/migration/schema_generator.php:238
/data/phpBB/phpbb/db/migration/schema_generator.php:214
/data/tests/test_framework/phpbb_database_test_case.php:84
Collapse Failed phpbb_dbal_case_test phpbb_dbal_case_test History
Build and Test Job < 1 sec
phpbb_dbal_case_test
UnexpectedValueException: Unable to resolve the dependency '\phpbb\db\migration\data\v32x\v327'

/data/phpBB/phpbb/db/migration/schema_generator.php:238
/data/phpBB/phpbb/db/migration/schema_generator.php:214
/data/tests/test_framework/phpbb_database_test_case.php:84
Collapse Failed phpbb_dbal_concatenate_test phpbb_dbal_concatenate_test History
Build and Test Job < 1 sec
phpbb_dbal_concatenate_test
UnexpectedValueException: Unable to resolve the dependency '\phpbb\db\migration\data\v32x\v327'

/data/phpBB/phpbb/db/migration/schema_generator.php:238
/data/phpBB/phpbb/db/migration/schema_generator.php:214
/data/tests/test_framework/phpbb_database_test_case.php:84
Collapse Failed phpbb_dbal_connect_test phpbb_dbal_connect_test History
Build and Test Job < 1 sec
phpbb_dbal_connect_test
UnexpectedValueException: Unable to resolve the dependency '\phpbb\db\migration\data\v32x\v327'

/data/phpBB/phpbb/db/migration/schema_generator.php:238
/data/phpBB/phpbb/db/migration/schema_generator.php:214
/data/tests/test_framework/phpbb_database_test_case.php:84
Collapse Failed phpbb_dbal_cross_join_test phpbb_dbal_cross_join_test History
Build and Test Job < 1 sec
phpbb_dbal_cross_join_test
UnexpectedValueException: Unable to resolve the dependency '\phpbb\db\migration\data\v32x\v327'

/data/phpBB/phpbb/db/migration/schema_generator.php:238
/data/phpBB/phpbb/db/migration/schema_generator.php:214
/data/tests/test_framework/phpbb_database_test_case.php:84
Collapse Failed phpbb_dbal_db_tools_test phpbb_dbal_db_tools_test History
Build and Test Job < 1 sec
phpbb_dbal_db_tools_test
UnexpectedValueException: Unable to resolve the dependency '\phpbb\db\migration\data\v32x\v327'

/data/phpBB/phpbb/db/migration/schema_generator.php:238
/data/phpBB/phpbb/db/migration/schema_generator.php:214
/data/tests/test_framework/phpbb_database_test_case.php:84
Collapse Failed phpbb_dbal_migrator_test phpbb_dbal_migrator_test History
Build and Test Job < 1 sec
phpbb_dbal_migrator_test
UnexpectedValueException: Unable to resolve the dependency '\phpbb\db\migration\data\v32x\v327'

/data/phpBB/phpbb/db/migration/schema_generator.php:238
/data/phpBB/phpbb/db/migration/schema_generator.php:214
/data/tests/test_framework/phpbb_database_test_case.php:84
Collapse Failed phpbb_dbal_migrator_tool_config_text_test phpbb_dbal_migrator_tool_config_text_test History
Build and Test Job < 1 sec
phpbb_dbal_migrator_tool_config_text_test
UnexpectedValueException: Unable to resolve the dependency '\phpbb\db\migration\data\v32x\v327'

/data/phpBB/phpbb/db/migration/schema_generator.php:238
/data/phpBB/phpbb/db/migration/schema_generator.php:214
/data/tests/test_framework/phpbb_database_test_case.php:84
Collapse Failed phpbb_dbal_migrator_tool_module_test phpbb_dbal_migrator_tool_module_test History
Build and Test Job < 1 sec
phpbb_dbal_migrator_tool_module_test
UnexpectedValueException: Unable to resolve the dependency '\phpbb\db\migration\data\v32x\v327'

/data/phpBB/phpbb/db/migration/schema_generator.php:238
/data/phpBB/phpbb/db/migration/schema_generator.php:214
/data/tests/test_framework/phpbb_database_test_case.php:84
Collapse Failed phpbb_dbal_migrator_tool_permission_test phpbb_dbal_migrator_tool_permission_test History
Build and Test Job < 1 sec
phpbb_dbal_migrator_tool_permission_test
UnexpectedValueException: Unable to resolve the dependency '\phpbb\db\migration\data\v32x\v327'

/data/phpBB/phpbb/db/migration/schema_generator.php:238
/data/phpBB/phpbb/db/migration/schema_generator.php:214
/data/tests/test_framework/phpbb_database_test_case.php:84
Collapse Failed phpbb_dbal_order_lower_test phpbb_dbal_order_lower_test History
Build and Test Job < 1 sec
phpbb_dbal_order_lower_test
UnexpectedValueException: Unable to resolve the dependency '\phpbb\db\migration\data\v32x\v327'

/data/phpBB/phpbb/db/migration/schema_generator.php:238
/data/phpBB/phpbb/db/migration/schema_generator.php:214
/data/tests/test_framework/phpbb_database_test_case.php:84
Collapse Failed phpbb_dbal_schema_test phpbb_dbal_schema_test History
Build and Test Job < 1 sec
phpbb_dbal_schema_test
UnexpectedValueException: Unable to resolve the dependency '\phpbb\db\migration\data\v32x\v327'

/data/phpBB/phpbb/db/migration/schema_generator.php:238
/data/phpBB/phpbb/db/migration/schema_generator.php:214
/data/tests/test_framework/phpbb_database_test_case.php:84
Collapse Failed phpbb_dbal_select_test phpbb_dbal_select_test History
Build and Test Job < 1 sec
phpbb_dbal_select_test
UnexpectedValueException: Unable to resolve the dependency '\phpbb\db\migration\data\v32x\v327'

/data/phpBB/phpbb/db/migration/schema_generator.php:238
/data/phpBB/phpbb/db/migration/schema_generator.php:214
/data/tests/test_framework/phpbb_database_test_case.php:84
Collapse Failed phpbb_dbal_sql_affected_rows_test phpbb_dbal_sql_affected_rows_test History
Build and Test Job < 1 sec
phpbb_dbal_sql_affected_rows_test
UnexpectedValueException: Unable to resolve the dependency '\phpbb\db\migration\data\v32x\v327'

/data/phpBB/phpbb/db/migration/schema_generator.php:238
/data/phpBB/phpbb/db/migration/schema_generator.php:214
/data/tests/test_framework/phpbb_database_test_case.php:84
Collapse Failed phpbb_dbal_sql_insert_buffer_test phpbb_dbal_sql_insert_buffer_test History
Build and Test Job < 1 sec
phpbb_dbal_sql_insert_buffer_test
UnexpectedValueException: Unable to resolve the dependency '\phpbb\db\migration\data\v32x\v327'

/data/phpBB/phpbb/db/migration/schema_generator.php:238
/data/phpBB/phpbb/db/migration/schema_generator.php:214
/data/tests/test_framework/phpbb_database_test_case.php:84
Collapse Failed phpbb_dbal_write_sequence_test phpbb_dbal_write_sequence_test History
Build and Test Job < 1 sec
phpbb_dbal_write_sequence_test
UnexpectedValueException: Unable to resolve the dependency '\phpbb\db\migration\data\v32x\v327'

/data/phpBB/phpbb/db/migration/schema_generator.php:238
/data/phpBB/phpbb/db/migration/schema_generator.php:214
/data/tests/test_framework/phpbb_database_test_case.php:84
Collapse Failed phpbb_dbal_write_test phpbb_dbal_write_test History
Build and Test Job < 1 sec
phpbb_dbal_write_test
UnexpectedValueException: Unable to resolve the dependency '\phpbb\db\migration\data\v32x\v327'

/data/phpBB/phpbb/db/migration/schema_generator.php:238
/data/phpBB/phpbb/db/migration/schema_generator.php:214
/data/tests/test_framework/phpbb_database_test_case.php:84
Collapse Failed phpbb_extension_manager_test phpbb_extension_manager_test History
Build and Test Job < 1 sec
phpbb_extension_manager_test
UnexpectedValueException: Unable to resolve the dependency '\phpbb\db\migration\data\v32x\v327'

/data/phpBB/phpbb/db/migration/schema_generator.php:238
/data/phpBB/phpbb/db/migration/schema_generator.php:214
/data/tests/test_framework/phpbb_database_test_case.php:84
Collapse Failed phpbb_extension_metadata_manager_test phpbb_extension_metadata_manager_test History
Build and Test Job < 1 sec
phpbb_extension_metadata_manager_test
UnexpectedValueException: Unable to resolve the dependency '\phpbb\db\migration\data\v32x\v327'

/data/phpBB/phpbb/db/migration/schema_generator.php:238
/data/phpBB/phpbb/db/migration/schema_generator.php:214
/data/tests/test_framework/phpbb_database_test_case.php:84
Collapse Failed phpbb_feed_attachments_base_test phpbb_feed_attachments_base_test History
Build and Test Job < 1 sec
phpbb_feed_attachments_base_test
UnexpectedValueException: Unable to resolve the dependency '\phpbb\db\migration\data\v32x\v327'

/data/phpBB/phpbb/db/migration/schema_generator.php:238
/data/phpBB/phpbb/db/migration/schema_generator.php:214
/data/tests/test_framework/phpbb_database_test_case.php:84
Collapse Failed phpbb_functions_language_select_test phpbb_functions_language_select_test History
Build and Test Job < 1 sec
phpbb_functions_language_select_test
UnexpectedValueException: Unable to resolve the dependency '\phpbb\db\migration\data\v32x\v327'

/data/phpBB/phpbb/db/migration/schema_generator.php:238
/data/phpBB/phpbb/db/migration/schema_generator.php:214
/data/tests/test_framework/phpbb_database_test_case.php:84
Collapse Failed phpbb_functions_obtain_online_test phpbb_functions_obtain_online_test History
Build and Test Job < 1 sec
phpbb_functions_obtain_online_test
UnexpectedValueException: Unable to resolve the dependency '\phpbb\db\migration\data\v32x\v327'

/data/phpBB/phpbb/db/migration/schema_generator.php:238
/data/phpBB/phpbb/db/migration/schema_generator.php:214
/data/tests/test_framework/phpbb_database_test_case.php:84
Collapse Failed phpbb_functions_privmsgs_get_max_setting_from_group_test phpbb_functions_privmsgs_get_max_setting_from_group_test History
Build and Test Job < 1 sec
phpbb_functions_privmsgs_get_max_setting_from_group_test
UnexpectedValueException: Unable to resolve the dependency '\phpbb\db\migration\data\v32x\v327'

/data/phpBB/phpbb/db/migration/schema_generator.php:238
/data/phpBB/phpbb/db/migration/schema_generator.php:214
/data/tests/test_framework/phpbb_database_test_case.php:84