Tests pending pull requests

Build: #9847 failed Manual run by Build Robot

Build result summary

Details

Completed
Duration
4 minutes
Flags
Custom build
Labels
pr_5841
Agent
Default Agent
Revision
dc8ff9da28b8ab4ad11c7ea94cca526f17c87fe5 dc8ff9da28b8ab4ad11c7ea94cca526f17c87fe5
Total tests
6674
Failing since
#9846 (Manual run by Build Robot – )
Fixed in
#9851 (Manual run by Build Robot)

Tests

Responsible

This build has been failing since #9846
No one has taken responsibility

Custom variables

Name Value
PRnumber 5841
PRref master

Tests

New test failures 364
Status Test View job Duration
Collapse Failed get_callable_from_step_test get_callable_from_step_test::test_get_callable_from_step History
Build and Test Job < 1 sec
get_callable_from_step_test::test_get_callable_from_step
InvalidArgumentException: Invalid database driver given

/data/phpBB/phpbb/db/tools/factory.php:40
/data/tests/test_framework/phpbb_database_test_case.php:82
Collapse Failed phpbb_attachment_delete_test phpbb_attachment_delete_test::test_attachment_delete_success History
Build and Test Job < 1 sec
phpbb_attachment_delete_test::test_attachment_delete_success
InvalidArgumentException: Invalid database driver given

/data/phpBB/phpbb/db/tools/factory.php:40
/data/tests/test_framework/phpbb_database_test_case.php:82
Collapse Failed phpbb_attachment_delete_test phpbb_attachment_delete_test::test_attachment_delete History
Build and Test Job < 1 sec
phpbb_attachment_delete_test::test_attachment_delete
InvalidArgumentException: Invalid database driver given

/data/phpBB/phpbb/db/tools/factory.php:40
/data/tests/test_framework/phpbb_database_test_case.php:82
Collapse Failed phpbb_attachment_resync_test phpbb_attachment_resync_test::test_resync History
Build and Test Job < 1 sec
phpbb_attachment_resync_test::test_resync
InvalidArgumentException: Invalid database driver given

/data/phpBB/phpbb/db/tools/factory.php:40
/data/tests/test_framework/phpbb_database_test_case.php:82
Collapse Failed phpbb_attachment_upload_test phpbb_attachment_upload_test::test_image_upload History
Build and Test Job < 1 sec
phpbb_attachment_upload_test::test_image_upload
InvalidArgumentException: Invalid database driver given

/data/phpBB/phpbb/db/tools/factory.php:40
/data/tests/test_framework/phpbb_database_test_case.php:82
Collapse Failed phpbb_attachment_upload_test phpbb_attachment_upload_test::test_upload History
Build and Test Job < 1 sec
phpbb_attachment_upload_test::test_upload
InvalidArgumentException: Invalid database driver given

/data/phpBB/phpbb/db/tools/factory.php:40
/data/tests/test_framework/phpbb_database_test_case.php:82
Collapse Failed phpbb_attachment_upload_test test_init_error History
Build and Test Job < 1 sec
phpbb_attachment_upload_test::test_init_error
InvalidArgumentException: Invalid database driver given

/data/phpBB/phpbb/db/tools/factory.php:40
/data/tests/test_framework/phpbb_database_test_case.php:82
Collapse Failed phpbb_auth_provider_apache_test test_init History
Build and Test Job < 1 sec
phpbb_auth_provider_apache_test::test_init
InvalidArgumentException: Invalid database driver given

/data/phpBB/phpbb/db/tools/factory.php:40
/data/tests/test_framework/phpbb_database_test_case.php:82
Collapse Failed phpbb_auth_provider_apache_test test_autologin History
Build and Test Job < 1 sec
phpbb_auth_provider_apache_test::test_autologin
InvalidArgumentException: Invalid database driver given

/data/phpBB/phpbb/db/tools/factory.php:40
/data/tests/test_framework/phpbb_database_test_case.php:82
Collapse Failed phpbb_auth_provider_apache_test test_validate_session History
Build and Test Job < 1 sec
phpbb_auth_provider_apache_test::test_validate_session
InvalidArgumentException: Invalid database driver given

/data/phpBB/phpbb/db/tools/factory.php:40
/data/tests/test_framework/phpbb_database_test_case.php:82
Collapse Failed phpbb_auth_provider_apache_test test_login History
Build and Test Job < 1 sec
phpbb_auth_provider_apache_test::test_login
InvalidArgumentException: Invalid database driver given

/data/phpBB/phpbb/db/tools/factory.php:40
/data/tests/test_framework/phpbb_database_test_case.php:82
Collapse Failed phpbb_auth_provider_db_test test_login History
Build and Test Job < 1 sec
phpbb_auth_provider_db_test::test_login
InvalidArgumentException: Invalid database driver given

/data/phpBB/phpbb/db/tools/factory.php:40
/data/tests/test_framework/phpbb_database_test_case.php:82
Collapse Failed phpbb_auth_provider_oauth_token_storage_test test_storeAccessToken History
Build and Test Job < 1 sec
phpbb_auth_provider_oauth_token_storage_test::test_storeAccessToken
InvalidArgumentException: Invalid database driver given

/data/phpBB/phpbb/db/tools/factory.php:40
/data/tests/test_framework/phpbb_database_test_case.php:82
Collapse Failed phpbb_auth_provider_oauth_token_storage_test phpbb_auth_provider_oauth_token_storage_test::test_hasAccessToken History
Build and Test Job < 1 sec
phpbb_auth_provider_oauth_token_storage_test::test_hasAccessToken
InvalidArgumentException: Invalid database driver given

/data/phpBB/phpbb/db/tools/factory.php:40
/data/tests/test_framework/phpbb_database_test_case.php:82
Collapse Failed phpbb_auth_provider_oauth_token_storage_test test_retrieve_access_token_by_session_from_db History
Build and Test Job < 1 sec
phpbb_auth_provider_oauth_token_storage_test::test_retrieve_access_token_by_session_from_db
InvalidArgumentException: Invalid database driver given

/data/phpBB/phpbb/db/tools/factory.php:40
/data/tests/test_framework/phpbb_database_test_case.php:82
Collapse Failed phpbb_auth_provider_oauth_token_storage_test phpbb_auth_provider_oauth_token_storage_test::test_retrieve_access_token_by_session History
Build and Test Job < 1 sec
phpbb_auth_provider_oauth_token_storage_test::test_retrieve_access_token_by_session
InvalidArgumentException: Invalid database driver given

/data/phpBB/phpbb/db/tools/factory.php:40
/data/tests/test_framework/phpbb_database_test_case.php:82
Collapse Failed phpbb_auth_provider_oauth_token_storage_test phpbb_auth_provider_oauth_token_storage_test::test_retrieveAccessToken History
Build and Test Job < 1 sec
phpbb_auth_provider_oauth_token_storage_test::test_retrieveAccessToken
InvalidArgumentException: Invalid database driver given

/data/phpBB/phpbb/db/tools/factory.php:40
/data/tests/test_framework/phpbb_database_test_case.php:82
Collapse Failed phpbb_auth_provider_oauth_token_storage_test test_set_user_id History
Build and Test Job < 1 sec
phpbb_auth_provider_oauth_token_storage_test::test_set_user_id
InvalidArgumentException: Invalid database driver given

/data/phpBB/phpbb/db/tools/factory.php:40
/data/tests/test_framework/phpbb_database_test_case.php:82
Collapse Failed phpbb_auth_provider_oauth_token_storage_test test_retrieveAccessToken_from_db History
Build and Test Job < 1 sec
phpbb_auth_provider_oauth_token_storage_test::test_retrieveAccessToken_from_db
InvalidArgumentException: Invalid database driver given

/data/phpBB/phpbb/db/tools/factory.php:40
/data/tests/test_framework/phpbb_database_test_case.php:82
Collapse Failed phpbb_auth_provider_oauth_token_storage_test test_retrieveAccessToken_wrong_token History
Build and Test Job < 1 sec
phpbb_auth_provider_oauth_token_storage_test::test_retrieveAccessToken_wrong_token
InvalidArgumentException: Invalid database driver given

/data/phpBB/phpbb/db/tools/factory.php:40
/data/tests/test_framework/phpbb_database_test_case.php:82
Collapse Failed phpbb_auth_provider_oauth_token_storage_test test_clearToken History
Build and Test Job < 1 sec
phpbb_auth_provider_oauth_token_storage_test::test_clearToken
InvalidArgumentException: Invalid database driver given

/data/phpBB/phpbb/db/tools/factory.php:40
/data/tests/test_framework/phpbb_database_test_case.php:82
Collapse Failed phpbb_auth_provider_oauth_token_storage_test phpbb_auth_provider_oauth_token_storage_test::test_has_access_token_by_session History
Build and Test Job < 1 sec
phpbb_auth_provider_oauth_token_storage_test::test_has_access_token_by_session
InvalidArgumentException: Invalid database driver given

/data/phpBB/phpbb/db/tools/factory.php:40
/data/tests/test_framework/phpbb_database_test_case.php:82
Collapse Failed phpbb_avatar_manager_test test_localize_errors History
Build and Test Job < 1 sec
phpbb_avatar_manager_test::test_localize_errors
InvalidArgumentException: Invalid database driver given

/data/phpBB/phpbb/db/tools/factory.php:40
/data/tests/test_framework/phpbb_database_test_case.php:82
Collapse Failed phpbb_avatar_manager_test test_get_avatar_settings History
Build and Test Job < 1 sec
phpbb_avatar_manager_test::test_get_avatar_settings
InvalidArgumentException: Invalid database driver given

/data/phpBB/phpbb/db/tools/factory.php:40
/data/tests/test_framework/phpbb_database_test_case.php:82
Collapse Failed phpbb_avatar_manager_test phpbb_avatar_manager_test::test_get_driver_enabled History
Build and Test Job < 1 sec
phpbb_avatar_manager_test::test_get_driver_enabled
InvalidArgumentException: Invalid database driver given

/data/phpBB/phpbb/db/tools/factory.php:40
/data/tests/test_framework/phpbb_database_test_case.php:82
Collapse Failed phpbb_avatar_manager_test phpbb_avatar_manager_test::test_remote_avatar_url History
Build and Test Job < 1 sec
phpbb_avatar_manager_test::test_remote_avatar_url
InvalidArgumentException: Invalid database driver given

/data/phpBB/phpbb/db/tools/factory.php:40
/data/tests/test_framework/phpbb_database_test_case.php:82
Collapse Failed phpbb_avatar_manager_test phpbb_avatar_manager_test::test_get_driver_all History
Build and Test Job < 1 sec
phpbb_avatar_manager_test::test_get_driver_all
InvalidArgumentException: Invalid database driver given

/data/phpBB/phpbb/db/tools/factory.php:40
/data/tests/test_framework/phpbb_database_test_case.php:82
Collapse Failed phpbb_avatar_manager_test phpbb_avatar_manager_test::test_clean_row History
Build and Test Job < 1 sec
phpbb_avatar_manager_test::test_clean_row
InvalidArgumentException: Invalid database driver given

/data/phpBB/phpbb/db/tools/factory.php:40
/data/tests/test_framework/phpbb_database_test_case.php:82
Collapse Failed phpbb_avatar_manager_test test_prepare_driver_name History
Build and Test Job < 1 sec
phpbb_avatar_manager_test::test_prepare_driver_name
InvalidArgumentException: Invalid database driver given

/data/phpBB/phpbb/db/tools/factory.php:40
/data/tests/test_framework/phpbb_database_test_case.php:82
Collapse Failed phpbb_avatar_manager_test test_user_group_avatar_deleted History
Build and Test Job < 1 sec
phpbb_avatar_manager_test::test_user_group_avatar_deleted
InvalidArgumentException: Invalid database driver given

/data/phpBB/phpbb/db/tools/factory.php:40
/data/tests/test_framework/phpbb_database_test_case.php:82
Collapse Failed phpbb_avatar_manager_test test_get_enabled_drivers History
Build and Test Job < 1 sec
phpbb_avatar_manager_test::test_get_enabled_drivers
InvalidArgumentException: Invalid database driver given

/data/phpBB/phpbb/db/tools/factory.php:40
/data/tests/test_framework/phpbb_database_test_case.php:82
Collapse Failed phpbb_avatar_manager_test phpbb_avatar_manager_test::test_handle_avatar_delete History
Build and Test Job < 1 sec
phpbb_avatar_manager_test::test_handle_avatar_delete
InvalidArgumentException: Invalid database driver given

/data/phpBB/phpbb/db/tools/factory.php:40
/data/tests/test_framework/phpbb_database_test_case.php:82
Collapse Failed phpbb_avatar_manager_test test_clean_driver_name History
Build and Test Job < 1 sec
phpbb_avatar_manager_test::test_clean_driver_name
InvalidArgumentException: Invalid database driver given

/data/phpBB/phpbb/db/tools/factory.php:40
/data/tests/test_framework/phpbb_database_test_case.php:82
Collapse Failed phpbb_avatar_manager_test test_get_all_drivers History
Build and Test Job < 1 sec
phpbb_avatar_manager_test::test_get_all_drivers
InvalidArgumentException: Invalid database driver given

/data/phpBB/phpbb/db/tools/factory.php:40
/data/tests/test_framework/phpbb_database_test_case.php:82
Collapse Failed phpbb_boolean_processor_test test_single_not_in History
Build and Test Job < 1 sec
phpbb_boolean_processor_test::test_single_not_in
InvalidArgumentException: Invalid database driver given

/data/phpBB/phpbb/db/tools/factory.php:40
/data/tests/test_framework/phpbb_database_test_case.php:82
Collapse Failed phpbb_boolean_processor_test test_single_in History
Build and Test Job < 1 sec
phpbb_boolean_processor_test::test_single_in
InvalidArgumentException: Invalid database driver given

/data/phpBB/phpbb/db/tools/factory.php:40
/data/tests/test_framework/phpbb_database_test_case.php:82
Collapse Failed phpbb_boolean_processor_test test_triple_and_with_is_null History
Build and Test Job < 1 sec
phpbb_boolean_processor_test::test_triple_and_with_is_null
InvalidArgumentException: Invalid database driver given

/data/phpBB/phpbb/db/tools/factory.php:40
/data/tests/test_framework/phpbb_database_test_case.php:82
Collapse Failed phpbb_boolean_processor_test test_and_of_or_of_and History
Build and Test Job < 1 sec
phpbb_boolean_processor_test::test_and_of_or_of_and
InvalidArgumentException: Invalid database driver given

/data/phpBB/phpbb/db/tools/factory.php:40
/data/tests/test_framework/phpbb_database_test_case.php:82
Collapse Failed phpbb_boolean_processor_test test_triple_and_with_in History
Build and Test Job < 1 sec
phpbb_boolean_processor_test::test_triple_and_with_in
InvalidArgumentException: Invalid database driver given

/data/phpBB/phpbb/db/tools/factory.php:40
/data/tests/test_framework/phpbb_database_test_case.php:82
Collapse Failed phpbb_boolean_processor_test test_double_and_with_not_of_or History
Build and Test Job < 1 sec
phpbb_boolean_processor_test::test_double_and_with_not_of_or
InvalidArgumentException: Invalid database driver given

/data/phpBB/phpbb/db/tools/factory.php:40
/data/tests/test_framework/phpbb_database_test_case.php:82
Collapse Failed phpbb_boolean_processor_test test_single_like History
Build and Test Job < 1 sec
phpbb_boolean_processor_test::test_single_like
InvalidArgumentException: Invalid database driver given

/data/phpBB/phpbb/db/tools/factory.php:40
/data/tests/test_framework/phpbb_database_test_case.php:82
Collapse Failed phpbb_boolean_processor_test test_single_not_like History
Build and Test Job < 1 sec
phpbb_boolean_processor_test::test_single_not_like
InvalidArgumentException: Invalid database driver given

/data/phpBB/phpbb/db/tools/factory.php:40
/data/tests/test_framework/phpbb_database_test_case.php:82
Collapse Failed phpbb_cache_dummy_driver_test test_get_put History
Build and Test Job < 1 sec
phpbb_cache_dummy_driver_test::test_get_put
InvalidArgumentException: Invalid database driver given

/data/phpBB/phpbb/db/tools/factory.php:40
/data/tests/test_framework/phpbb_database_test_case.php:82
Collapse Failed phpbb_cache_dummy_driver_test test_cache_sql History
Build and Test Job < 1 sec
phpbb_cache_dummy_driver_test::test_cache_sql
InvalidArgumentException: Invalid database driver given

/data/phpBB/phpbb/db/tools/factory.php:40
/data/tests/test_framework/phpbb_database_test_case.php:82
Collapse Failed phpbb_cache_dummy_driver_test test_destroy History
Build and Test Job < 1 sec
phpbb_cache_dummy_driver_test::test_destroy
InvalidArgumentException: Invalid database driver given

/data/phpBB/phpbb/db/tools/factory.php:40
/data/tests/test_framework/phpbb_database_test_case.php:82
Collapse Failed phpbb_cache_dummy_driver_test test_purge History
Build and Test Job < 1 sec
phpbb_cache_dummy_driver_test::test_purge
InvalidArgumentException: Invalid database driver given

/data/phpBB/phpbb/db/tools/factory.php:40
/data/tests/test_framework/phpbb_database_test_case.php:82
Collapse Failed phpbb_cache_file_driver_test test_purge History
Build and Test Job < 1 sec
phpbb_cache_file_driver_test::test_purge
InvalidArgumentException: Invalid database driver given

/data/phpBB/phpbb/db/tools/factory.php:40
/data/tests/test_framework/phpbb_database_test_case.php:82
Collapse Failed phpbb_cache_file_driver_test test_destroy History
Build and Test Job < 1 sec
phpbb_cache_file_driver_test::test_destroy
InvalidArgumentException: Invalid database driver given

/data/phpBB/phpbb/db/tools/factory.php:40
/data/tests/test_framework/phpbb_database_test_case.php:82
Collapse Failed phpbb_cache_file_driver_test test_cache_sql History
Build and Test Job < 1 sec
phpbb_cache_file_driver_test::test_cache_sql
InvalidArgumentException: Invalid database driver given

/data/phpBB/phpbb/db/tools/factory.php:40
/data/tests/test_framework/phpbb_database_test_case.php:82
Collapse Failed phpbb_cache_file_driver_test test_get_put_exists History
Build and Test Job < 1 sec
phpbb_cache_file_driver_test::test_get_put_exists
InvalidArgumentException: Invalid database driver given

/data/phpBB/phpbb/db/tools/factory.php:40
/data/tests/test_framework/phpbb_database_test_case.php:82