Tests pending pull requests

Build: #6967 failed

Job: Build and Test Job failed

Stages & jobs

  1. Build and Test

Build log

The build generated 443 lines of output. Download or view full build log

09-Apr-2017 22:09:38 Build phpBB3 - Pull Requests - Build and Test Job #6967 (PHPBB3-PR-JOB1-6967) started building on agent Default Agent
09-Apr-2017 22:09:38
09-Apr-2017 22:09:38 Build working directory is /home/bamboo/xml-data/build-dir/PHPBB3-PR-JOB1
09-Apr-2017 22:09:38 Executing build phpBB3 - Pull Requests - Build and Test Job #6967 (PHPBB3-PR-JOB1-6967)
09-Apr-2017 22:09:38 Starting task 'Checkout develop branch' of type 'com.atlassian.bamboo.plugins.vcs:task.vcs.checkout'
09-Apr-2017 22:09:38 Build always requires a clean checkout
09-Apr-2017 22:09:38 Cleaning build directory '/home/bamboo/xml-data/build-dir/PHPBB3-PR-JOB1'
09-Apr-2017 22:09:38 Updating source code to revision: 3bf133c96ca34195024feb16bed812aa8dc77184
09-Apr-2017 22:09:38 Fetching 'refs/heads/3.1.x' from 'https://github.com/phpbb/phpbb.git'.
09-Apr-2017 22:09:38 Checking out revision 3bf133c96ca34195024feb16bed812aa8dc77184.
09-Apr-2017 22:09:38 Creating local git repository in '/home/bamboo/xml-data/build-dir/PHPBB3-PR-JOB1/.git'.
09-Apr-2017 22:09:38 Cloning into '/home/bamboo/xml-data/build-dir/PHPBB3-PR-JOB1'...
09-Apr-2017 22:09:38 done.
09-Apr-2017 22:09:39 Branch 3.1.x set up to track remote branch 3.1.x from origin.
09-Apr-2017 22:09:39 Switched to a new branch '3.1.x'
09-Apr-2017 22:09:39 Updated source code to revision: 3bf133c96ca34195024feb16bed812aa8dc77184
09-Apr-2017 22:09:39 Finished task 'Checkout develop branch' with result: Success
09-Apr-2017 22:09:39 Running pre-build action: VCS Version Collector
09-Apr-2017 22:09:39
Substituting variable: ${bamboo.PRnumber} with 4789
09-Apr-2017 22:09:39
Substituting variable: ${bamboo.buildResultsUrl} with https://bamboo.phpbb.com/browse/PHPBB3-PR-JOB1-6967
09-Apr-2017 22:09:39 Starting task 'Set pending build status' of type 'com.atlassian.bamboo.plugins.scripttask:task.builder.script'
09-Apr-2017 22:09:39
Beginning to execute external process for build 'phpBB3 - Pull Requests - Build and Test Job #6967 (PHPBB3-PR-JOB1-6967)'
... running command line:
/bin/sh /home/bamboo/temp/PHPBB3-PR-JOB1-6967-ScriptBuildTask-9142415841936091134.sh
... in: /home/bamboo/xml-data/build-dir/PHPBB3-PR-JOB1
... using extra environment variables:
bamboo_planRepository_1_branch=3.1.x
bamboo_planRepository_1_branchDisplayName=3.1.x
bamboo_repository_revision_number=3bf133c96ca34195024feb16bed812aa8dc77184
bamboo_PRref=master
bamboo_resultsUrl=https://bamboo.phpbb.com/browse/PHPBB3-PR-JOB1-6967
bamboo_capability_system_builder_command_Git=/usr/bin/git
bamboo_repository_75956235_git_username=bantu
bamboo_planRepository_1_name=phpBB Ascraeus
bamboo_build_working_directory=/home/bamboo/xml-data/build-dir/PHPBB3-PR-JOB1
bamboo_buildKey=PHPBB3-PR-JOB1
bamboo_capability_phpbb_tests=true
bamboo_shortPlanName=Pull Requests
bamboo_capability_system_builder_command_fop=/usr/bin/fop
bamboo_capability_dbms_sqlite_2=true
bamboo_planRepository_name=phpBB Ascraeus
bamboo_PRnumber=4789
bamboo_buildNumber=6967
bamboo_repository_75956235_git_repositoryUrl=https://github.com/phpbb/phpbb.git
bamboo_capability_system_builder_phpunit_PHPUnit=/usr/bin/phpunit
bamboo_shortJobName=Build and Test Job
bamboo_buildResultsUrl=https://bamboo.phpbb.com/browse/PHPBB3-PR-JOB1-6967
bamboo_repository_75956235_branch_name=3.1.x
bamboo_planRepository_repositoryUrl=https://github.com/phpbb/phpbb.git
bamboo_agentId=131073
bamboo_planName=phpBB3 - Pull Requests
bamboo_shortPlanKey=PR
bamboo_shortJobKey=JOB1
bamboo_capability_dbms_mysql_55=true
bamboo_capability_system_jdk_JDK_1_7_0_65=/usr/lib/jvm/java-7-openjdk-amd64
bamboo_planRepository_revision=3bf133c96ca34195024feb16bed812aa8dc77184
bamboo_repository_previous_revision_number=827ded82b8110fd2c587d9d7c84731ee7215b166
bamboo_buildTimeStamp=2017-04-09T22:09:38.066Z
bamboo_planRepository_previousRevision=827ded82b8110fd2c587d9d7c84731ee7215b166
bamboo_capability_system_builder_mvn2_Maven_2=/usr/share/maven2
bamboo_capability_system_jdk_JDK_1_6_0_16=/usr/lib/jvm/java-6-sun-1.6.0.16
bamboo_buildResultKey=PHPBB3-PR-JOB1-6967
bamboo_repository_git_branch=3.1.x
bamboo_repository_branch_name=3.1.x
bamboo_buildPlanName=phpBB3 - Pull Requests - Build and Test Job
bamboo_planRepository_1_revision=3bf133c96ca34195024feb16bed812aa8dc77184
bamboo_repository_name=phpBB Ascraeus
bamboo_capability_system_docker_executable=/usr/bin/docker
bamboo_planRepository_branch=3.1.x
bamboo_agentWorkingDirectory=/home/bamboo/xml-data/build-dir
bamboo_capability_system_git_executable=/usr/bin/git
bamboo_planRepository_1_previousRevision=827ded82b8110fd2c587d9d7c84731ee7215b166
bamboo_capability_system_builder_phpunit_PHPUnit_3_4=/usr/bin/phpunit
bamboo_repository_git_username=bantu
bamboo_repository_75956235_revision_number=3bf133c96ca34195024feb16bed812aa8dc77184
bamboo_planRepository_branchDisplayName=3.1.x
bamboo_planRepository_1_type=gitv2
bamboo_planRepository_branchName=3.1.x
bamboo_repository_75956235_previous_revision_number=827ded82b8110fd2c587d9d7c84731ee7215b166
bamboo_capability_system_jdk_JDK=/usr/lib/jvm/java-6-sun
bamboo_plan_storageTag=PHPBB3-PR
bamboo_planRepository_type=gitv2
bamboo_planRepository_1_username=bantu
bamboo_ManualBuildTriggerReason_userName=Build Robot
bamboo_repository_git_repositoryUrl=https://github.com/phpbb/phpbb.git
bamboo_repository_75956235_git_branch=3.1.x
bamboo_capability_system_builder_ant_Ant=/usr/share/ant
bamboo_repository_75956235_name=phpBB Ascraeus
bamboo_working_directory=/home/bamboo/xml-data/build-dir/PHPBB3-PR-JOB1
bamboo_planKey=PHPBB3-PR
bamboo_planRepository_1_repositoryUrl=https://github.com/phpbb/phpbb.git
bamboo_planRepository_username=bantu
bamboo_capability_local=true
bamboo_capability_system_jdk_JDK_1_6=/usr/lib/jvm/java-6-sun
bamboo_capability_system_jdk_JDK_1_7=/usr/lib/jvm/java-7-openjdk-amd64
bamboo_planRepository_1_branchName=3.1.x
09-Apr-2017 22:09:40 From https://github.com/phpbb/phpbb
09-Apr-2017 22:09:40 * branch            refs/pull/4789/head -> FETCH_HEAD
09-Apr-2017 22:09:40   % Total    % Received % Xferd  Average Speed   Time    Time     Time  Current
09-Apr-2017 22:09:40                                  Dload  Upload   Total   Spent    Left  Speed
09-Apr-2017 22:09:40
09-Apr-2017 22:09:41   0     0    0     0    0     0      0      0 --:--:-- --:--:-- --:--:--     0
09-Apr-2017 22:09:41   0     0    0     0    0     0      0      0 --:--:-- --:--:-- --:--:--     0
09-Apr-2017 22:09:41 100   275  100    93  100   182    153    300 --:--:-- --:--:-- --:--:--   300
09-Apr-2017 22:09:41 Finished task 'Set pending build status' with result: Success
09-Apr-2017 22:09:41
Substituting variable: ${bamboo.PRnumber} with 4789
09-Apr-2017 22:09:41 Starting task 'Fetch PR' of type 'com.atlassian.bamboo.plugins.scripttask:task.builder.script'
09-Apr-2017 22:09:41
Beginning to execute external process for build 'phpBB3 - Pull Requests - Build and Test Job #6967 (PHPBB3-PR-JOB1-6967)'
... running command line:
/bin/sh /home/bamboo/temp/PHPBB3-PR-JOB1-6967-ScriptBuildTask-5538606915343189016.sh
... in: /home/bamboo/xml-data/build-dir/PHPBB3-PR-JOB1
... using extra environment variables:
bamboo_planRepository_1_branch=3.1.x
bamboo_planRepository_1_branchDisplayName=3.1.x
bamboo_repository_revision_number=3bf133c96ca34195024feb16bed812aa8dc77184
bamboo_PRref=master
bamboo_resultsUrl=https://bamboo.phpbb.com/browse/PHPBB3-PR-JOB1-6967
bamboo_capability_system_builder_command_Git=/usr/bin/git
bamboo_repository_75956235_git_username=bantu
bamboo_planRepository_1_name=phpBB Ascraeus
bamboo_build_working_directory=/home/bamboo/xml-data/build-dir/PHPBB3-PR-JOB1
bamboo_buildKey=PHPBB3-PR-JOB1
bamboo_capability_phpbb_tests=true
bamboo_shortPlanName=Pull Requests
bamboo_capability_system_builder_command_fop=/usr/bin/fop
bamboo_capability_dbms_sqlite_2=true
bamboo_planRepository_name=phpBB Ascraeus
bamboo_PRnumber=4789
bamboo_buildNumber=6967
bamboo_repository_75956235_git_repositoryUrl=https://github.com/phpbb/phpbb.git
bamboo_capability_system_builder_phpunit_PHPUnit=/usr/bin/phpunit
bamboo_shortJobName=Build and Test Job
bamboo_buildResultsUrl=https://bamboo.phpbb.com/browse/PHPBB3-PR-JOB1-6967
bamboo_repository_75956235_branch_name=3.1.x
bamboo_planRepository_repositoryUrl=https://github.com/phpbb/phpbb.git
bamboo_agentId=131073
bamboo_planName=phpBB3 - Pull Requests
bamboo_build_commandline_com_atlassian_bamboo_plugins_scripttask_task_builder_script_7=/bin/sh /home/bamboo/temp/PHPBB3-PR-JOB1-6967-ScriptBuildTask-9142415841936091134.sh
bamboo_shortPlanKey=PR
bamboo_shortJobKey=JOB1
bamboo_capability_dbms_mysql_55=true
bamboo_capability_system_jdk_JDK_1_7_0_65=/usr/lib/jvm/java-7-openjdk-amd64
bamboo_planRepository_revision=3bf133c96ca34195024feb16bed812aa8dc77184
bamboo_repository_previous_revision_number=827ded82b8110fd2c587d9d7c84731ee7215b166
bamboo_buildTimeStamp=2017-04-09T22:09:38.066Z
bamboo_planRepository_previousRevision=827ded82b8110fd2c587d9d7c84731ee7215b166
bamboo_capability_system_builder_mvn2_Maven_2=/usr/share/maven2
bamboo_capability_system_jdk_JDK_1_6_0_16=/usr/lib/jvm/java-6-sun-1.6.0.16
bamboo_buildResultKey=PHPBB3-PR-JOB1-6967
bamboo_repository_git_branch=3.1.x
bamboo_repository_branch_name=3.1.x
bamboo_buildPlanName=phpBB3 - Pull Requests - Build and Test Job
bamboo_planRepository_1_revision=3bf133c96ca34195024feb16bed812aa8dc77184
bamboo_repository_name=phpBB Ascraeus
bamboo_capability_system_docker_executable=/usr/bin/docker
bamboo_planRepository_branch=3.1.x
bamboo_agentWorkingDirectory=/home/bamboo/xml-data/build-dir
bamboo_capability_system_git_executable=/usr/bin/git
bamboo_planRepository_1_previousRevision=827ded82b8110fd2c587d9d7c84731ee7215b166
bamboo_capability_system_builder_phpunit_PHPUnit_3_4=/usr/bin/phpunit
bamboo_repository_git_username=bantu
bamboo_repository_75956235_revision_number=3bf133c96ca34195024feb16bed812aa8dc77184
bamboo_planRepository_branchDisplayName=3.1.x
bamboo_planRepository_1_type=gitv2
bamboo_planRepository_branchName=3.1.x
bamboo_repository_75956235_previous_revision_number=827ded82b8110fd2c587d9d7c84731ee7215b166
bamboo_capability_system_jdk_JDK=/usr/lib/jvm/java-6-sun
bamboo_plan_storageTag=PHPBB3-PR
bamboo_planRepository_type=gitv2
bamboo_planRepository_1_username=bantu
bamboo_ManualBuildTriggerReason_userName=Build Robot
bamboo_repository_git_repositoryUrl=https://github.com/phpbb/phpbb.git
bamboo_repository_75956235_git_branch=3.1.x
bamboo_capability_system_builder_ant_Ant=/usr/share/ant
bamboo_repository_75956235_name=phpBB Ascraeus
bamboo_working_directory=/home/bamboo/xml-data/build-dir/PHPBB3-PR-JOB1
bamboo_planKey=PHPBB3-PR
bamboo_planRepository_1_repositoryUrl=https://github.com/phpbb/phpbb.git
bamboo_planRepository_username=bantu
bamboo_capability_local=true
bamboo_capability_system_jdk_JDK_1_6=/usr/lib/jvm/java-6-sun
bamboo_capability_system_jdk_JDK_1_7=/usr/lib/jvm/java-7-openjdk-amd64
bamboo_planRepository_1_branchName=3.1.x
09-Apr-2017 22:09:42 From https://github.com/phpbb/phpbb
09-Apr-2017 22:09:42 * branch            refs/pull/4789/merge -> FETCH_HEAD
09-Apr-2017 22:09:42 Note: checking out 'FETCH_HEAD'.
09-Apr-2017 22:09:42
09-Apr-2017 22:09:42 You are in 'detached HEAD' state. You can look around, make experimental
09-Apr-2017 22:09:42 changes and commit them, and you can discard any commits you make in this
09-Apr-2017 22:09:42 state without impacting any branches by performing another checkout.
09-Apr-2017 22:09:42
09-Apr-2017 22:09:42 If you want to create a new branch to retain commits you create, you may
09-Apr-2017 22:09:42 do so (now or later) by using -b with the checkout command again. Example:
09-Apr-2017 22:09:42
09-Apr-2017 22:09:42   git checkout -b new_branch_name
09-Apr-2017 22:09:42
09-Apr-2017 22:09:42 HEAD is now at caace40... Merge 6ae02e7153a919bdabdcb8ec5364b262826c5f73 into 4a657d073259e59431264965c6300e365bef1664
09-Apr-2017 22:09:42 Finished task 'Fetch PR' with result: Success
09-Apr-2017 22:09:42 Skipping execution of task 'Prepare directory' as it is disabled
09-Apr-2017 22:09:42
Substituting variable: ${bamboo.working.directory} with /home/bamboo/xml-data/build-dir/PHPBB3-PR-JOB1
09-Apr-2017 22:09:42 Starting task 'Prepare directory' of type 'com.atlassian.bamboo.plugins.bamboo-docker-plugin:task.docker.cli'
09-Apr-2017 22:09:42 Running image name (phpbb:php-5.6)
09-Apr-2017 22:09:42
Beginning to execute external process for build 'phpBB3 - Pull Requests - Build and Test Job #6967 (PHPBB3-PR-JOB1-6967)'
... running command line:
/usr/bin/docker run --volume /home/bamboo/xml-data/build-dir/PHPBB3-PR-JOB1:/data --workdir /data/phpBB --rm -e HOME=/home/bamboo -u=991 phpbb:php-5.6 /bin/bash -c php ../composer.phar install --dev; cd ../build; ../phpBB/vendor/bin/phing clean prepare
... in: /home/bamboo/xml-data/build-dir/PHPBB3-PR-JOB1
... using extra environment variables:
bamboo_planRepository_1_branch=3.1.x
bamboo_planRepository_1_branchDisplayName=3.1.x
bamboo_repository_revision_number=3bf133c96ca34195024feb16bed812aa8dc77184
bamboo_PRref=master
bamboo_resultsUrl=https://bamboo.phpbb.com/browse/PHPBB3-PR-JOB1-6967
bamboo_capability_system_builder_command_Git=/usr/bin/git
bamboo_repository_75956235_git_username=bantu
bamboo_planRepository_1_name=phpBB Ascraeus
bamboo_build_working_directory=/home/bamboo/xml-data/build-dir/PHPBB3-PR-JOB1
bamboo_buildKey=PHPBB3-PR-JOB1
bamboo_capability_phpbb_tests=true
bamboo_shortPlanName=Pull Requests
bamboo_capability_system_builder_command_fop=/usr/bin/fop
bamboo_capability_dbms_sqlite_2=true
bamboo_planRepository_name=phpBB Ascraeus
bamboo_PRnumber=4789
bamboo_buildNumber=6967
bamboo_repository_75956235_git_repositoryUrl=https://github.com/phpbb/phpbb.git
bamboo_capability_system_builder_phpunit_PHPUnit=/usr/bin/phpunit
bamboo_shortJobName=Build and Test Job
bamboo_buildResultsUrl=https://bamboo.phpbb.com/browse/PHPBB3-PR-JOB1-6967
bamboo_repository_75956235_branch_name=3.1.x
bamboo_planRepository_repositoryUrl=https://github.com/phpbb/phpbb.git
bamboo_agentId=131073
bamboo_planName=phpBB3 - Pull Requests
bamboo_build_commandline_com_atlassian_bamboo_plugins_scripttask_task_builder_script_7=/bin/sh /home/bamboo/temp/PHPBB3-PR-JOB1-6967-ScriptBuildTask-9142415841936091134.sh
bamboo_shortPlanKey=PR
bamboo_shortJobKey=JOB1
bamboo_capability_dbms_mysql_55=true
bamboo_capability_system_jdk_JDK_1_7_0_65=/usr/lib/jvm/java-7-openjdk-amd64
bamboo_planRepository_revision=3bf133c96ca34195024feb16bed812aa8dc77184
bamboo_repository_previous_revision_number=827ded82b8110fd2c587d9d7c84731ee7215b166
bamboo_buildTimeStamp=2017-04-09T22:09:38.066Z
bamboo_planRepository_previousRevision=827ded82b8110fd2c587d9d7c84731ee7215b166
bamboo_capability_system_builder_mvn2_Maven_2=/usr/share/maven2
bamboo_capability_system_jdk_JDK_1_6_0_16=/usr/lib/jvm/java-6-sun-1.6.0.16
bamboo_build_commandline_com_atlassian_bamboo_plugins_scripttask_task_builder_script_4=/bin/sh /home/bamboo/temp/PHPBB3-PR-JOB1-6967-ScriptBuildTask-5538606915343189016.sh
bamboo_buildResultKey=PHPBB3-PR-JOB1-6967
bamboo_repository_git_branch=3.1.x
bamboo_repository_branch_name=3.1.x
bamboo_buildPlanName=phpBB3 - Pull Requests - Build and Test Job
bamboo_planRepository_1_revision=3bf133c96ca34195024feb16bed812aa8dc77184
bamboo_repository_name=phpBB Ascraeus
bamboo_capability_system_docker_executable=/usr/bin/docker
bamboo_planRepository_branch=3.1.x
bamboo_agentWorkingDirectory=/home/bamboo/xml-data/build-dir
bamboo_capability_system_git_executable=/usr/bin/git
bamboo_planRepository_1_previousRevision=827ded82b8110fd2c587d9d7c84731ee7215b166
bamboo_capability_system_builder_phpunit_PHPUnit_3_4=/usr/bin/phpunit
bamboo_repository_git_username=bantu
bamboo_repository_75956235_revision_number=3bf133c96ca34195024feb16bed812aa8dc77184
bamboo_planRepository_branchDisplayName=3.1.x
bamboo_planRepository_1_type=gitv2
bamboo_planRepository_branchName=3.1.x
bamboo_repository_75956235_previous_revision_number=827ded82b8110fd2c587d9d7c84731ee7215b166
bamboo_capability_system_jdk_JDK=/usr/lib/jvm/java-6-sun
bamboo_plan_storageTag=PHPBB3-PR
bamboo_planRepository_type=gitv2
bamboo_planRepository_1_username=bantu
bamboo_ManualBuildTriggerReason_userName=Build Robot
bamboo_repository_git_repositoryUrl=https://github.com/phpbb/phpbb.git
bamboo_repository_75956235_git_branch=3.1.x
bamboo_capability_system_builder_ant_Ant=/usr/share/ant
bamboo_repository_75956235_name=phpBB Ascraeus
bamboo_working_directory=/home/bamboo/xml-data/build-dir/PHPBB3-PR-JOB1
bamboo_planKey=PHPBB3-PR
bamboo_planRepository_1_repositoryUrl=https://github.com/phpbb/phpbb.git
bamboo_planRepository_username=bantu
bamboo_capability_local=true
bamboo_capability_system_jdk_JDK_1_6=/usr/lib/jvm/java-6-sun
bamboo_capability_system_jdk_JDK_1_7=/usr/lib/jvm/java-7-openjdk-amd64
bamboo_planRepository_1_branchName=3.1.x
09-Apr-2017 22:09:43 You are running composer with xdebug enabled. This has a major impact on runtime performance. See https://getcomposer.org/xdebug
09-Apr-2017 22:09:43 You are using the deprecated option "dev". Dev packages are installed by default now.
09-Apr-2017 22:09:43 Cannot create cache directory /home/bamboo/.composer/cache/repo/https---packagist.org/, or directory is not writable. Proceeding without cache
09-Apr-2017 22:09:43 Cannot create cache directory /home/bamboo/.composer/cache/files/, or directory is not writable. Proceeding without cache
09-Apr-2017 22:09:43 Loading composer repositories with package information
09-Apr-2017 22:09:43 Installing dependencies (including require-dev) from lock file
09-Apr-2017 22:09:43   - Installing bantu/ini-get-wrapper (v1.0.1)
09-Apr-2017 22:09:45     Downloading: Connecting...    Downloading: 100%         
09-Apr-2017 22:09:45
09-Apr-2017 22:09:45   - Installing google/recaptcha (1.1.2)
09-Apr-2017 22:09:46     Downloading: Connecting...    Downloading: 0%               Downloading: 30%    Downloading: 55%    Downloading: 65%    Downloading: 70%    Downloading: 95%    Downloading: 100%    Downloading: 100%
09-Apr-2017 22:09:46
09-Apr-2017 22:09:46   - Installing guzzlehttp/promises (1.3.0)
09-Apr-2017 22:09:47     Downloading: Connecting...    Downloading: 0%               Downloading: 15%    Downloading: 25%    Downloading: 40%    Downloading: 55%    Downloading: 65%    Downloading: 80%    Downloading: 95%    Downloading: 100%    Downloading: 100%
09-Apr-2017 22:09:47
09-Apr-2017 22:09:47   - Installing psr/http-message (1.0.1)
09-Apr-2017 22:09:48     Downloading: Connecting...    Downloading: 0%               Downloading: 65%    Downloading: 100%    Downloading: 100%
09-Apr-2017 22:09:48
09-Apr-2017 22:09:48   - Installing guzzlehttp/psr7 (1.3.1)
09-Apr-2017 22:09:49     Downloading: Connecting...    Downloading: 0%               Downloading: 5%    Downloading: 15%    Downloading: 20%    Downloading: 30%    Downloading: 35%    Downloading: 40%    Downloading: 60%    Downloading: 65%    Downloading: 80%    Downloading: 85%    Downloading: 95%    Downloading: 100%    Downloading: 100%
09-Apr-2017 22:09:49
09-Apr-2017 22:09:49   - Installing lusitanian/oauth (v0.8.9)
09-Apr-2017 22:09:51     Downloading: Connecting...    Downloading: 100%         
09-Apr-2017 22:09:51
09-Apr-2017 22:09:51   - Installing marc1706/fast-image-size (v1.1.2)
09-Apr-2017 22:09:52     Downloading: Connecting...    Downloading: 100%         
09-Apr-2017 22:09:52
09-Apr-2017 22:09:52   - Installing paragonie/random_compat (v1.4.1)
09-Apr-2017 22:09:53     Downloading: Connecting...    Downloading: 0%               Downloading: 20%    Downloading: 35%    Downloading: 50%    Downloading: 70%    Downloading: 90%    Downloading: 100%
09-Apr-2017 22:09:53
09-Apr-2017 22:09:53   - Installing patchwork/utf8 (v1.3.1)
09-Apr-2017 22:09:54     Downloading: Connecting...    Downloading: 0%               Downloading: 5%    Downloading: 10%    Downloading: 15%    Downloading: 20%    Downloading: 25%    Downloading: 30%    Downloading: 35%    Downloading: 40%    Downloading: 45%    Downloading: 50%    Downloading: 55%    Downloading: 60%    Downloading: 65%    Downloading: 70%    Downloading: 75%    Downloading: 80%    Downloading: 85%    Downloading: 90%    Downloading: 95%    Downloading: 100%    Downloading: 100%
09-Apr-2017 22:09:54
09-Apr-2017 22:09:54   - Installing s9e/text-formatter (0.9.1)
09-Apr-2017 22:09:56     Downloading: Connecting...    Downloading: 100%         
09-Apr-2017 22:09:56
09-Apr-2017 22:09:56   - Installing symfony/filesystem (v3.2.0)
09-Apr-2017 22:09:57     Downloading: Connecting...    Downloading: 0%               Downloading: 35%    Downloading: 40%    Downloading: 75%    Downloading: 95%    Downloading: 100%    Downloading: 100%
09-Apr-2017 22:09:57
09-Apr-2017 22:09:57   - Installing symfony/config (v3.2.0)
09-Apr-2017 22:09:58     Downloading: Connecting...    Downloading: 100%         
09-Apr-2017 22:09:58
09-Apr-2017 22:09:58   - Installing symfony/finder (v3.2.0)
09-Apr-2017 22:09:59     Downloading: Connecting...    Downloading: 100%         
09-Apr-2017 22:09:59
09-Apr-2017 22:09:59   - Installing symfony/polyfill-mbstring (v1.3.0)
09-Apr-2017 22:10:00     Downloading: Connecting...    Downloading: 0%               Downloading: 35%    Downloading: 95%    Downloading: 100%    Downloading: 100%
09-Apr-2017 22:10:00
09-Apr-2017 22:10:00   - Installing symfony/http-foundation (v3.2.0)
09-Apr-2017 22:10:01     Downloading: Connecting...    Downloading: 0%               Downloading: 5%    Downloading: 10%    Downloading: 15%    Downloading: 20%    Downloading: 25%    Downloading: 30%    Downloading: 35%    Downloading: 40%    Downloading: 45%    Downloading: 50%    Downloading: 55%    Downloading: 60%    Downloading: 65%    Downloading: 70%    Downloading: 75%    Downloading: 80%    Downloading: 85%    Downloading: 90%    Downloading: 95%    Downloading: 100%    Downloading: 100%
09-Apr-2017 22:10:01
09-Apr-2017 22:10:01   - Installing symfony/event-dispatcher (v3.2.0)
09-Apr-2017 22:10:02     Downloading: Connecting...    Downloading: 0%               Downloading: 5%    Downloading: 10%    Downloading: 15%    Downloading: 100%    Downloading: 100%
09-Apr-2017 22:10:02
09-Apr-2017 22:10:02   - Installing psr/log (1.0.2)
09-Apr-2017 22:10:03     Downloading: Connecting...    Downloading: 0%               Downloading: 15%    Downloading: 100%
09-Apr-2017 22:10:03
09-Apr-2017 22:10:03   - Installing symfony/debug (v3.2.0)
09-Apr-2017 22:10:04     Downloading: Connecting...    Downloading: 0%               Downloading: 5%    Downloading: 25%    Downloading: 30%    Downloading: 35%    Downloading: 40%    Downloading: 45%    Downloading: 70%    Downloading: 75%    Downloading: 100%    Downloading: 100%
09-Apr-2017 22:10:04
09-Apr-2017 22:10:04   - Installing symfony/http-kernel (v3.2.0)
09-Apr-2017 22:10:06     Downloading: Connecting...    Downloading: 0%               Downloading: 5%    Downloading: 10%    Downloading: 15%    Downloading: 20%    Downloading: 25%    Downloading: 30%    Downloading: 35%    Downloading: 40%    Downloading: 45%    Downloading: 50%    Downloading: 55%    Downloading: 60%    Downloading: 65%    Downloading: 70%    Downloading: 75%    Downloading: 80%    Downloading: 85%    Downloading: 90%    Downloading: 95%    Downloading: 100%    Downloading: 100%
09-Apr-2017 22:10:06
09-Apr-2017 22:10:06   - Installing symfony/dependency-injection (v3.2.0)
09-Apr-2017 22:10:07     Downloading: Connecting...    Downloading: 0%               Downloading: 5%    Downloading: 10%    Downloading: 15%    Downloading: 20%    Downloading: 25%    Downloading: 30%    Downloading: 35%    Downloading: 40%    Downloading: 45%    Downloading: 50%    Downloading: 55%    Downloading: 60%    Downloading: 65%    Downloading: 70%    Downloading: 75%    Downloading: 80%    Downloading: 85%    Downloading: 90%    Downloading: 95%    Downloading: 100%    Downloading: 100%
09-Apr-2017 22:10:07
09-Apr-2017 22:10:07   - Installing zendframework/zend-eventmanager (3.0.1)
09-Apr-2017 22:10:08     Downloading: Connecting...    Downloading: 0%               Downloading: 15%    Downloading: 30%    Downloading: 75%    Downloading: 90%    Downloading: 100%    Downloading: 100%
09-Apr-2017 22:10:08
09-Apr-2017 22:10:08   - Installing zendframework/zend-code (2.6.3)
09-Apr-2017 22:10:09     Downloading: Connecting...    Downloading: 0%               Downloading: 5%    Downloading: 10%    Downloading: 15%    Downloading: 20%    Downloading: 25%    Downloading: 30%    Downloading: 35%    Downloading: 40%    Downloading: 45%    Downloading: 50%    Downloading: 55%    Downloading: 60%    Downloading: 65%    Downloading: 70%    Downloading: 75%    Downloading: 80%    Downloading: 85%    Downloading: 90%    Downloading: 95%    Downloading: 100%    Downloading: 100%
09-Apr-2017 22:10:09
09-Apr-2017 22:10:09   - Installing ocramius/proxy-manager (1.0.2)
09-Apr-2017 22:10:10     Downloading: Connecting...    Downloading: 0%               Downloading: 5%    Downloading: 10%    Downloading: 15%    Downloading: 20%    Downloading: 25%    Downloading: 30%    Downloading: 35%    Downloading: 40%    Downloading: 45%    Downloading: 50%    Downloading: 55%    Downloading: 65%    Downloading: 70%    Downloading: 75%    Downloading: 80%    Downloading: 85%    Downloading: 90%    Downloading: 95%    Downloading: 100%    Downloading: 100%
09-Apr-2017 22:10:10
09-Apr-2017 22:10:10   - Installing symfony/proxy-manager-bridge (v3.2.0)
09-Apr-2017 22:10:11     Downloading: Connecting...    Downloading: 100%         
09-Apr-2017 22:10:11
09-Apr-2017 22:10:11   - Installing symfony/routing (v3.2.0)
09-Apr-2017 22:10:13     Downloading: Connecting...    Downloading: 0%               Downloading: 5%    Downloading: 10%    Downloading: 15%    Downloading: 20%    Downloading: 25%    Downloading: 30%    Downloading: 35%    Downloading: 40%    Downloading: 45%    Downloading: 50%    Downloading: 55%    Downloading: 60%    Downloading: 65%    Downloading: 70%    Downloading: 75%    Downloading: 80%    Downloading: 85%    Downloading: 90%    Downloading: 95%    Downloading: 100%
09-Apr-2017 22:10:13
09-Apr-2017 22:10:13   - Installing twig/twig (v1.24.2)
09-Apr-2017 22:10:14     Downloading: Connecting...    Downloading: 0%               Downloading: 5%    Downloading: 10%    Downloading: 15%    Downloading: 20%    Downloading: 25%    Downloading: 30%    Downloading: 35%    Downloading: 40%    Downloading: 45%    Downloading: 50%    Downloading: 55%    Downloading: 60%    Downloading: 65%    Downloading: 70%    Downloading: 75%    Downloading: 80%    Downloading: 85%    Downloading: 90%    Downloading: 95%    Downloading: 100%    Downloading: 100%
09-Apr-2017 22:10:14
09-Apr-2017 22:10:14   - Installing symfony/twig-bridge (v3.1.4)
09-Apr-2017 22:10:15     Downloading: Connecting...    Downloading: 100%         
09-Apr-2017 22:10:15
09-Apr-2017 22:10:15   - Installing symfony/dom-crawler (v3.2.0)
09-Apr-2017 22:10:17     Downloading: Connecting...    Downloading: 0%               Downloading: 30%    Downloading: 35%    Downloading: 40%    Downloading: 45%    Downloading: 65%    Downloading: 70%    Downloading: 80%    Downloading: 85%    Downloading: 100%    Downloading: 100%
09-Apr-2017 22:10:17
09-Apr-2017 22:10:17   - Installing symfony/css-selector (v3.2.0)
09-Apr-2017 22:10:18     Downloading: Connecting...    Downloading: 0%               Downloading: 5%    Downloading: 10%    Downloading: 15%    Downloading: 20%    Downloading: 25%    Downloading: 30%    Downloading: 35%    Downloading: 40%    Downloading: 45%    Downloading: 50%    Downloading: 55%    Downloading: 60%    Downloading: 65%    Downloading: 70%    Downloading: 75%    Downloading: 100%    Downloading: 100%
09-Apr-2017 22:10:18
09-Apr-2017 22:10:18   - Installing symfony/browser-kit (v3.2.0)
09-Apr-2017 22:10:19     Downloading: Connecting...    Downloading: 0%               Downloading: 50%    Downloading: 80%    Downloading: 85%    Downloading: 100%    Downloading: 100%
09-Apr-2017 22:10:19
09-Apr-2017 22:10:19   - Installing guzzlehttp/guzzle (6.2.2)
09-Apr-2017 22:10:21     Downloading: Connecting...    Downloading: 0%               Downloading: 5%    Downloading: 10%    Downloading: 15%    Downloading: 20%    Downloading: 25%    Downloading: 30%    Downloading: 40%    Downloading: 45%    Downloading: 55%    Downloading: 60%    Downloading: 70%    Downloading: 75%    Downloading: 80%    Downloading: 85%    Downloading: 100%    Downloading: 100%
09-Apr-2017 22:10:21
09-Apr-2017 22:10:21   - Installing fabpot/goutte (v3.2.0)
09-Apr-2017 22:10:21     Downloading: Connecting...    Downloading: 100%         
09-Apr-2017 22:10:21
09-Apr-2017 22:10:21   - Installing facebook/webdriver (1.2.0)
09-Apr-2017 22:10:23     Downloading: Connecting...    Downloading: 100%         
09-Apr-2017 22:10:23
09-Apr-2017 22:10:23   - Installing symfony/process (v3.2.0)
09-Apr-2017 22:10:24     Downloading: Connecting...    Downloading: 0%               Downloading: 20%    Downloading: 35%    Downloading: 50%    Downloading: 65%    Downloading: 70%    Downloading: 85%    Downloading: 100%    Downloading: 100%
09-Apr-2017 22:10:24
09-Apr-2017 22:10:24   - Installing symfony/console (v3.2.0)
09-Apr-2017 22:10:25     Downloading: Connecting...    Downloading: 0%               Downloading: 5%    Downloading: 10%    Downloading: 15%    Downloading: 20%    Downloading: 25%    Downloading: 30%    Downloading: 35%    Downloading: 40%    Downloading: 45%    Downloading: 50%    Downloading: 55%    Downloading: 60%    Downloading: 65%    Downloading: 70%    Downloading: 75%    Downloading: 80%    Downloading: 85%    Downloading: 90%    Downloading: 95%    Downloading: 100%    Downloading: 100%
09-Apr-2017 22:10:25
09-Apr-2017 22:10:25   - Installing laravel/homestead (v4.0.5)
09-Apr-2017 22:10:26     Downloading: Connecting...    Downloading: 100%         
09-Apr-2017 22:10:26
09-Apr-2017 22:10:26   - Installing phing/phing (2.4.14)
09-Apr-2017 22:10:28     Downloading: Connecting...    Downloading: 100%         
09-Apr-2017 22:10:28
09-Apr-2017 22:10:28   - Installing phpdocumentor/reflection-docblock (2.0.4)
09-Apr-2017 22:10:29     Downloading: Connecting...    Downloading: 0%               Downloading: 15%    Downloading: 30%    Downloading: 45%    Downloading: 50%    Downloading: 65%    Downloading: 70%    Downloading: 85%    Downloading: 100%    Downloading: 100%
09-Apr-2017 22:10:29
09-Apr-2017 22:10:29   - Installing phpdocumentor/reflection-common (1.0)
09-Apr-2017 22:10:30     Downloading: Connecting...    Downloading: 0%               Downloading: 65%    Downloading: 100%
09-Apr-2017 22:10:30
09-Apr-2017 22:10:30   - Installing phpdocumentor/type-resolver (0.2.1)
09-Apr-2017 22:10:31     Downloading: Connecting...    Downloading: 0%               Downloading: 20%    Downloading: 35%    Downloading: 55%    Downloading: 75%    Downloading: 95%    Downloading: 100%    Downloading: 100%
09-Apr-2017 22:10:31
09-Apr-2017 22:10:31   - Installing symfony/yaml (v3.2.0)
09-Apr-2017 22:10:32     Downloading: Connecting...    Downloading: 0%               Downloading: 10%    Downloading: 15%    Downloading: 25%    Downloading: 30%    Downloading: 35%    Downloading: 45%    Downloading: 55%    Downloading: 70%    Downloading: 80%    Downloading: 95%    Downloading: 100%    Downloading: 100%
09-Apr-2017 22:10:32
09-Apr-2017 22:10:32   - Installing sebastian/version (1.0.6)
09-Apr-2017 22:10:33     Downloading: Connecting...    Downloading: 0%               Downloading: 100%    Downloading: 100%
09-Apr-2017 22:10:33
09-Apr-2017 22:10:33   - Installing sebastian/global-state (1.1.1)
09-Apr-2017 22:10:34     Downloading: Connecting...    Downloading: 0%               Downloading: 40%    Downloading: 70%    Downloading: 100%    Downloading: 100%
09-Apr-2017 22:10:34
09-Apr-2017 22:10:34   - Installing sebastian/recursion-context (1.0.2)
09-Apr-2017 22:10:35     Downloading: Connecting...    Downloading: 0%               Downloading: 35%    Downloading: 70%    Downloading: 100%    Downloading: 100%
09-Apr-2017 22:10:35
09-Apr-2017 22:10:35   - Installing sebastian/exporter (1.2.2)
09-Apr-2017 22:10:36     Downloading: Connecting...    Downloading: 0%               Downloading: 100%    Downloading: 100%
09-Apr-2017 22:10:36
09-Apr-2017 22:10:36   - Installing sebastian/environment (1.3.8)
09-Apr-2017 22:10:37     Downloading: Connecting...    Downloading: 0%               Downloading: 15%    Downloading: 30%    Downloading: 45%    Downloading: 60%    Downloading: 75%    Downloading: 100%    Downloading: 100%
09-Apr-2017 22:10:37
09-Apr-2017 22:10:37   - Installing sebastian/diff (1.4.1)
09-Apr-2017 22:10:39     Downloading: Connecting...    Downloading: 0%               Downloading: 15%    Downloading: 30%    Downloading: 45%    Downloading: 100%    Downloading: 100%
09-Apr-2017 22:10:39
09-Apr-2017 22:10:39   - Installing sebastian/comparator (1.2.2)
09-Apr-2017 22:10:41     Downloading: Connecting...    Downloading: 0%               Downloading: 10%    Downloading: 20%    Downloading: 30%    Downloading: 40%    Downloading: 45%    Downloading: 55%    Downloading: 65%    Downloading: 75%    Downloading: 85%    Downloading: 100%    Downloading: 100%
09-Apr-2017 22:10:41
09-Apr-2017 22:10:41   - Installing phpunit/php-text-template (1.2.1)
09-Apr-2017 22:10:42     Downloading: Connecting...    Downloading: 0%               Downloading: 35%    Downloading: 100%    Downloading: 100%
09-Apr-2017 22:10:42
09-Apr-2017 22:10:42   - Installing doctrine/instantiator (1.0.5)
09-Apr-2017 22:10:43     Downloading: Connecting...    Downloading: 0%               Downloading: 15%    Downloading: 25%    Downloading: 40%    Downloading: 50%    Downloading: 65%    Downloading: 75%    Downloading: 90%    Downloading: 100%    Downloading: 100%
09-Apr-2017 22:10:43
09-Apr-2017 22:10:43   - Installing phpunit/phpunit-mock-objects (2.3.8)
09-Apr-2017 22:10:44     Downloading: Connecting...    Downloading: 0%               Downloading: 5%    Downloading: 20%    Downloading: 25%    Downloading: 30%    Downloading: 40%    Downloading: 45%    Downloading: 50%    Downloading: 55%    Downloading: 65%    Downloading: 70%    Downloading: 75%    Downloading: 80%    Downloading: 95%    Downloading: 100%    Downloading: 100%
09-Apr-2017 22:10:44
09-Apr-2017 22:10:44   - Installing phpunit/php-timer (1.0.8)
09-Apr-2017 22:10:46     Downloading: Connecting...    Downloading: 0%               Downloading: 100%    Downloading: 100%
09-Apr-2017 22:10:46
09-Apr-2017 22:10:47   - Installing phpunit/php-file-iterator (1.4.2)
09-Apr-2017 22:10:47     Downloading: Connecting...    Downloading: 0%               Downloading: 20%    Downloading: 40%    Downloading: 60%    Downloading: 100%    Downloading: 100%
09-Apr-2017 22:10:47
09-Apr-2017 22:10:47   - Installing phpunit/php-token-stream (1.4.9)
09-Apr-2017 22:10:49     Downloading: Connecting...    Downloading: 0%               Downloading: 5%    Downloading: 10%    Downloading: 15%    Downloading: 20%    Downloading: 65%    Downloading: 70%    Downloading: 75%    Downloading: 80%    Downloading: 85%    Downloading: 90%    Downloading: 95%    Downloading: 100%    Downloading: 100%
09-Apr-2017 22:10:49
09-Apr-2017 22:10:49   - Installing phpunit/php-code-coverage (2.2.4)
09-Apr-2017 22:10:50     Downloading: Connecting...    Downloading: 0%               Downloading: 5%    Downloading: 10%    Downloading: 15%    Downloading: 20%    Downloading: 25%    Downloading: 30%    Downloading: 35%    Downloading: 40%    Downloading: 45%    Downloading: 50%    Downloading: 55%    Downloading: 60%    Downloading: 65%    Downloading: 75%    Downloading: 85%    Downloading: 90%    Downloading: 95%    Downloading: 100%    Downloading: 100%
09-Apr-2017 22:10:50
09-Apr-2017 22:10:50   - Installing phpspec/prophecy (v1.6.2)
09-Apr-2017 22:10:51     Downloading: Connecting...    Downloading: 0%               Downloading: 5%    Downloading: 10%    Downloading: 15%    Downloading: 20%    Downloading: 25%    Downloading: 30%    Downloading: 35%    Downloading: 40%    Downloading: 45%    Downloading: 50%    Downloading: 55%    Downloading: 60%    Downloading: 65%    Downloading: 70%    Downloading: 75%    Downloading: 80%    Downloading: 85%    Downloading: 90%    Downloading: 95%    Downloading: 100%    Downloading: 100%
09-Apr-2017 22:10:51
09-Apr-2017 22:10:51   - Installing phpunit/phpunit (4.8.31)
09-Apr-2017 22:10:53     Downloading: Connecting...    Downloading: 0%               Downloading: 5%    Downloading: 10%    Downloading: 15%    Downloading: 20%    Downloading: 25%    Downloading: 30%    Downloading: 35%    Downloading: 40%    Downloading: 45%    Downloading: 50%    Downloading: 55%    Downloading: 60%    Downloading: 65%    Downloading: 70%    Downloading: 80%    Downloading: 95%    Downloading: 100%    Downloading: 100%
09-Apr-2017 22:10:53
09-Apr-2017 22:10:53   - Installing phpunit/dbunit (2.0.3)
09-Apr-2017 22:10:54     Downloading: Connecting...    Downloading: 0%               Downloading: 5%    Downloading: 10%    Downloading: 15%    Downloading: 20%    Downloading: 25%    Downloading: 30%    Downloading: 35%    Downloading: 40%    Downloading: 45%    Downloading: 50%    Downloading: 55%    Downloading: 60%    Downloading: 65%    Downloading: 70%    Downloading: 75%    Downloading: 80%    Downloading: 85%    Downloading: 90%    Downloading: 95%    Downloading: 100%    Downloading: 100%
09-Apr-2017 22:10:54
09-Apr-2017 22:10:54   - Installing squizlabs/php_codesniffer (2.7.1)
09-Apr-2017 22:10:56     Downloading: Connecting...    Downloading: 100%         
09-Apr-2017 22:10:56
09-Apr-2017 22:10:56   - Installing webmozart/assert (1.2.0)
09-Apr-2017 22:10:57     Downloading: Connecting...    Downloading: 0%               Downloading: 55%    Downloading: 80%    Downloading: 100%    Downloading: 100%
09-Apr-2017 22:10:57
09-Apr-2017 22:10:58 lusitanian/oauth suggests installing predis/predis (Allows using the Redis storage backend.)
09-Apr-2017 22:10:58 paragonie/random_compat suggests installing ext-libsodium (Provides a modern crypto API that can be used to generate random bytes.)
09-Apr-2017 22:10:58 patchwork/utf8 suggests installing ext-intl (Use Intl for best performance)
09-Apr-2017 22:10:58 patchwork/utf8 suggests installing ext-wfio (Use WFIO for UTF-8 filesystem access on Windows)
09-Apr-2017 22:10:58 s9e/text-formatter suggests installing ext-intl (Allows international URLs to be accepted by the URL filter)
09-Apr-2017 22:10:58 s9e/text-formatter suggests installing ext-xsl (Enables the XSLT renderer)
09-Apr-2017 22:10:58 symfony/http-kernel suggests installing symfony/class-loader ()
09-Apr-2017 22:10:58 symfony/http-kernel suggests installing symfony/var-dumper ()
09-Apr-2017 22:10:58 symfony/dependency-injection suggests installing symfony/expression-language (For using expressions in service container configuration)
09-Apr-2017 22:10:58 zendframework/zend-eventmanager suggests installing container-interop/container-interop (^1.1.0, to use the lazy listeners feature)
09-Apr-2017 22:10:58 zendframework/zend-eventmanager suggests installing zendframework/zend-stdlib (^2.7.3 || ^3.0, to use the FilterChain feature)
09-Apr-2017 22:10:58 zendframework/zend-code suggests installing doctrine/annotations (Doctrine\Common\Annotations >=1.0 for annotation features)
09-Apr-2017 22:10:58 zendframework/zend-code suggests installing zendframework/zend-stdlib (Zend\Stdlib component)
09-Apr-2017 22:10:58 ocramius/proxy-manager suggests installing ocramius/generated-hydrator (To have very fast object to array to object conversion for ghost objects)
09-Apr-2017 22:10:58 ocramius/proxy-manager suggests installing zendframework/zend-json (To have the JsonRpc adapter (Remote Object feature))
09-Apr-2017 22:10:58 ocramius/proxy-manager suggests installing zendframework/zend-soap (To have the Soap adapter (Remote Object feature))
09-Apr-2017 22:10:58 ocramius/proxy-manager suggests installing zendframework/zend-stdlib (To use the hydrator proxy)
09-Apr-2017 22:10:58 ocramius/proxy-manager suggests installing zendframework/zend-xmlrpc (To have the XmlRpc adapter (Remote Object feature))
09-Apr-2017 22:10:58 symfony/routing suggests installing doctrine/annotations (For using the annotation loader)
09-Apr-2017 22:10:58 symfony/routing suggests installing symfony/expression-language (For using expression matching)
09-Apr-2017 22:10:58 symfony/twig-bridge suggests installing symfony/asset (For using the AssetExtension)
09-Apr-2017 22:10:58 symfony/twig-bridge suggests installing symfony/expression-language (For using the ExpressionExtension)
09-Apr-2017 22:10:58 symfony/twig-bridge suggests installing symfony/form (For using the FormExtension)
09-Apr-2017 22:10:58 symfony/twig-bridge suggests installing symfony/security (For using the SecurityExtension)
09-Apr-2017 22:10:58 symfony/twig-bridge suggests installing symfony/stopwatch (For using the StopwatchExtension)
09-Apr-2017 22:10:58 symfony/twig-bridge suggests installing symfony/templating (For using the TwigEngine)
09-Apr-2017 22:10:58 symfony/twig-bridge suggests installing symfony/translation (For using the TranslationExtension)
09-Apr-2017 22:10:58 symfony/twig-bridge suggests installing symfony/var-dumper (For using the DumpExtension)
09-Apr-2017 22:10:58 facebook/webdriver suggests installing phpdocumentor/phpdocumentor (2.*)
09-Apr-2017 22:10:58 phpdocumentor/reflection-docblock suggests installing dflydev/markdown (~1.0)
09-Apr-2017 22:10:58 phpdocumentor/reflection-docblock suggests installing erusev/parsedown (~1.0)
09-Apr-2017 22:10:58 sebastian/global-state suggests installing ext-uopz (*)
09-Apr-2017 22:10:58 phpunit/phpunit-mock-objects suggests installing ext-soap (*)
09-Apr-2017 22:10:58 phpunit/phpunit suggests installing phpunit/php-invoker (~1.1)
09-Apr-2017 22:10:58 Generating autoload files
09-Apr-2017 22:10:59 Buildfile: /data/build/build.xml
09-Apr-2017 22:10:59
09-Apr-2017 22:10:59 phpBB > clean:
09-Apr-2017 22:10:59
09-Apr-2017 22:10:59    [delete] Directory /data/build/logs does not exist or is not a directory.
09-Apr-2017 22:10:59    [delete] Directory /data/build/api does not exist or is not a directory.
09-Apr-2017 22:10:59    [delete] Directory /data/build/codebrowser does not exist or is not a directory.
09-Apr-2017 22:10:59    [delete] Directory /data/build/coverage does not exist or is not a directory.
09-Apr-2017 22:10:59    [delete] Directory /data/build/cpd does not exist or is not a directory.
09-Apr-2017 22:10:59    [delete] Directory /data/build/dependencies does not exist or is not a directory.
09-Apr-2017 22:10:59    [delete] Directory /data/build/new_version does not exist or is not a directory.
09-Apr-2017 22:10:59    [delete] Directory /data/build/old_versions does not exist or is not a directory.
09-Apr-2017 22:10:59    [delete] Directory /data/build/save does not exist or is not a directory.
09-Apr-2017 22:10:59
09-Apr-2017 22:10:59 phpBB > prepare:
09-Apr-2017 22:10:59
09-Apr-2017 22:10:59     [mkdir] Created dir: /data/build/logs
09-Apr-2017 22:10:59     [mkdir] Created dir: /data/build/api
09-Apr-2017 22:10:59     [mkdir] Created dir: /data/build/codebrowser
09-Apr-2017 22:10:59     [mkdir] Created dir: /data/build/coverage
09-Apr-2017 22:10:59     [mkdir] Created dir: /data/build/cpd
09-Apr-2017 22:10:59     [mkdir] Created dir: /data/build/dependencies
09-Apr-2017 22:10:59     [mkdir] Created dir: /data/build/new_version
09-Apr-2017 22:10:59     [mkdir] Created dir: /data/build/new_version/files
09-Apr-2017 22:10:59     [mkdir] Created dir: /data/build/new_version/patches
09-Apr-2017 22:10:59     [mkdir] Created dir: /data/build/new_version/release_files
09-Apr-2017 22:10:59     [mkdir] Created dir: /data/build/new_version/update
09-Apr-2017 22:10:59     [mkdir] Created dir: /data/build/old_versions
09-Apr-2017 22:10:59     [mkdir] Created dir: /data/build/save
09-Apr-2017 22:10:59
09-Apr-2017 22:10:59 BUILD FINISHED
09-Apr-2017 22:10:59
09-Apr-2017 22:10:59 Total time: 0.1145 seconds
09-Apr-2017 22:10:59
09-Apr-2017 22:10:59 Finished task 'Prepare directory' with result: Success
09-Apr-2017 22:10:59 Skipping execution of task 'Run sniffs' as it is disabled
09-Apr-2017 22:10:59
Substituting variable: ${bamboo.working.directory} with /home/bamboo/xml-data/build-dir/PHPBB3-PR-JOB1
09-Apr-2017 22:10:59 Starting task 'Run sniffs' of type 'com.atlassian.bamboo.plugins.bamboo-docker-plugin:task.docker.cli'
09-Apr-2017 22:10:59 Running image name (phpbb:php-5.6)
09-Apr-2017 22:10:59
Beginning to execute external process for build 'phpBB3 - Pull Requests - Build and Test Job #6967 (PHPBB3-PR-JOB1-6967)'
... running command line:
/usr/bin/docker run --volume /home/bamboo/xml-data/build-dir/PHPBB3-PR-JOB1:/data --workdir /data/build --rm -u=991 phpbb:php-5.6 ../phpBB/vendor/bin/phing sniff
... in: /home/bamboo/xml-data/build-dir/PHPBB3-PR-JOB1
... using extra environment variables:
bamboo_planRepository_1_branch=3.1.x
bamboo_planRepository_1_branchDisplayName=3.1.x
bamboo_repository_revision_number=3bf133c96ca34195024feb16bed812aa8dc77184
bamboo_PRref=master
bamboo_resultsUrl=https://bamboo.phpbb.com/browse/PHPBB3-PR-JOB1-6967
bamboo_capability_system_builder_command_Git=/usr/bin/git
bamboo_repository_75956235_git_username=bantu
bamboo_planRepository_1_name=phpBB Ascraeus
bamboo_build_working_directory=/home/bamboo/xml-data/build-dir/PHPBB3-PR-JOB1
bamboo_buildKey=PHPBB3-PR-JOB1
bamboo_capability_phpbb_tests=true
bamboo_shortPlanName=Pull Requests
bamboo_capability_system_builder_command_fop=/usr/bin/fop
bamboo_capability_dbms_sqlite_2=true
bamboo_planRepository_name=phpBB Ascraeus
bamboo_PRnumber=4789
bamboo_buildNumber=6967
bamboo_repository_75956235_git_repositoryUrl=https://github.com/phpbb/phpbb.git
bamboo_capability_system_builder_phpunit_PHPUnit=/usr/bin/phpunit
bamboo_shortJobName=Build and Test Job
bamboo_buildResultsUrl=https://bamboo.phpbb.com/browse/PHPBB3-PR-JOB1-6967
bamboo_repository_75956235_branch_name=3.1.x
bamboo_planRepository_repositoryUrl=https://github.com/phpbb/phpbb.git
bamboo_agentId=131073
bamboo_planName=phpBB3 - Pull Requests
bamboo_build_commandline_com_atlassian_bamboo_plugins_scripttask_task_builder_script_7=/bin/sh /home/bamboo/temp/PHPBB3-PR-JOB1-6967-ScriptBuildTask-9142415841936091134.sh
bamboo_shortPlanKey=PR
bamboo_shortJobKey=JOB1
bamboo_capability_dbms_mysql_55=true
bamboo_capability_system_jdk_JDK_1_7_0_65=/usr/lib/jvm/java-7-openjdk-amd64
bamboo_planRepository_revision=3bf133c96ca34195024feb16bed812aa8dc77184
bamboo_repository_previous_revision_number=827ded82b8110fd2c587d9d7c84731ee7215b166
bamboo_buildTimeStamp=2017-04-09T22:09:38.066Z
bamboo_planRepository_previousRevision=827ded82b8110fd2c587d9d7c84731ee7215b166
bamboo_capability_system_builder_mvn2_Maven_2=/usr/share/maven2
bamboo_capability_system_jdk_JDK_1_6_0_16=/usr/lib/jvm/java-6-sun-1.6.0.16
bamboo_build_commandline_com_atlassian_bamboo_plugins_scripttask_task_builder_script_4=/bin/sh /home/bamboo/temp/PHPBB3-PR-JOB1-6967-ScriptBuildTask-5538606915343189016.sh
bamboo_buildResultKey=PHPBB3-PR-JOB1-6967
bamboo_repository_git_branch=3.1.x
bamboo_repository_branch_name=3.1.x
bamboo_buildPlanName=phpBB3 - Pull Requests - Build and Test Job
bamboo_planRepository_1_revision=3bf133c96ca34195024feb16bed812aa8dc77184
bamboo_repository_name=phpBB Ascraeus
bamboo_capability_system_docker_executable=/usr/bin/docker
bamboo_build_commandline_com_atlassian_bamboo_plugins_bamboo_docker_plugin_task_docker_cli_12=/usr/bin/docker run --volume /home/bamboo/xml-data/build-dir/PHPBB3-PR-JOB1:/data --workdir /data/phpBB --rm -e HOME=/home/bamboo -u=991 phpbb:php-5.6 /bin/bash -c php ../composer.phar install --dev; cd ../build; ../phpBB/vendor/bin/phing clean prepare
bamboo_planRepository_branch=3.1.x
bamboo_agentWorkingDirectory=/home/bamboo/xml-data/build-dir
bamboo_capability_system_git_executable=/usr/bin/git
bamboo_planRepository_1_previousRevision=827ded82b8110fd2c587d9d7c84731ee7215b166
bamboo_capability_system_builder_phpunit_PHPUnit_3_4=/usr/bin/phpunit
bamboo_repository_git_username=bantu
bamboo_repository_75956235_revision_number=3bf133c96ca34195024feb16bed812aa8dc77184
bamboo_planRepository_branchDisplayName=3.1.x
bamboo_planRepository_1_type=gitv2
bamboo_planRepository_branchName=3.1.x
bamboo_repository_75956235_previous_revision_number=827ded82b8110fd2c587d9d7c84731ee7215b166
bamboo_capability_system_jdk_JDK=/usr/lib/jvm/java-6-sun
bamboo_plan_storageTag=PHPBB3-PR
bamboo_planRepository_type=gitv2
bamboo_planRepository_1_username=bantu
bamboo_ManualBuildTriggerReason_userName=Build Robot
bamboo_repository_git_repositoryUrl=https://github.com/phpbb/phpbb.git
bamboo_repository_75956235_git_branch=3.1.x
bamboo_capability_system_builder_ant_Ant=/usr/share/ant
bamboo_repository_75956235_name=phpBB Ascraeus
bamboo_working_directory=/home/bamboo/xml-data/build-dir/PHPBB3-PR-JOB1
bamboo_planKey=PHPBB3-PR
bamboo_planRepository_1_repositoryUrl=https://github.com/phpbb/phpbb.git
bamboo_planRepository_username=bantu
bamboo_capability_local=true
bamboo_capability_system_jdk_JDK_1_6=/usr/lib/jvm/java-6-sun
bamboo_capability_system_jdk_JDK_1_7=/usr/lib/jvm/java-7-openjdk-amd64
bamboo_planRepository_1_branchName=3.1.x
09-Apr-2017 22:11:00 Buildfile: /data/build/build.xml
09-Apr-2017 22:11:00
09-Apr-2017 22:11:00 phpBB > sniff:
09-Apr-2017 22:11:00
09-Apr-2017 22:11:08 ............................................................  60 / 683 (9%)
09-Apr-2017 22:11:09 ............................................................ 120 / 683 (18%)
09-Apr-2017 22:11:10 ............................................................ 180 / 683 (26%)
09-Apr-2017 22:11:12 ............................................................ 240 / 683 (35%)
09-Apr-2017 22:11:18 ............................................................ 300 / 683 (44%)
09-Apr-2017 22:11:22 ............................................................ 360 / 683 (53%)
09-Apr-2017 22:11:28 ............................................................ 420 / 683 (61%)
09-Apr-2017 22:11:32 ............................................................ 480 / 683 (70%)
09-Apr-2017 22:11:36 ............................................................ 540 / 683 (79%)
09-Apr-2017 22:11:40 ............................................................ 600 / 683 (88%)
09-Apr-2017 22:11:42 .............................E.......................E...... 660 / 683 (97%)
09-Apr-2017 22:11:43 .......................
09-Apr-2017 22:11:43
09-Apr-2017 22:11:43
09-Apr-2017 22:11:43 FILE: /data/phpBB/phpbb/bitfield/bitfield.php
09-Apr-2017 22:11:43 ----------------------------------------------------------------------
09-Apr-2017 22:11:43 FOUND 2 ERRORS AFFECTING 2 LINES
09-Apr-2017 22:11:43 ----------------------------------------------------------------------
09-Apr-2017 22:11:43 1 | ERROR | Missing required file doc comment.
09-Apr-2017 22:11:43    |       | (phpbb.Commenting.FileComment)
09-Apr-2017 22:11:43 9 | ERROR | PHP4 style constructors are not allowed; use "__construct()"
09-Apr-2017 22:11:43    |       | instead (Generic.NamingConventions.ConstructorName.OldStyle)
09-Apr-2017 22:11:43 ----------------------------------------------------------------------
09-Apr-2017 22:11:43
09-Apr-2017 22:11:43
09-Apr-2017 22:11:43 FILE: /data/phpBB/phpbb/style/manager.php
09-Apr-2017 22:11:43 ----------------------------------------------------------------------
09-Apr-2017 22:11:43 FOUND 2 ERRORS AFFECTING 2 LINES
09-Apr-2017 22:11:43 ----------------------------------------------------------------------
09-Apr-2017 22:11:43 16 | ERROR | There must not be unused USE statements.
09-Apr-2017 22:11:43     |       | (phpbb.Namespaces.UnusedUse.Unused)
09-Apr-2017 22:11:43 45 | ERROR | Arguments with default values must be at the end of the
09-Apr-2017 22:11:43     |       | argument list (PEAR.Functions.ValidDefaultValue.NotAtEnd)
09-Apr-2017 22:11:43 ----------------------------------------------------------------------
09-Apr-2017 22:11:43
09-Apr-2017 22:11:43 Time: 43.57 secs; Memory: 77.25Mb
09-Apr-2017 22:11:43
09-Apr-2017 22:11:51 ............................................................  60 / 206 (29%)
09-Apr-2017 22:12:10 ............................................................ 120 / 206 (58%)
09-Apr-2017 22:12:24 ............................................................ 180 / 206 (87%)
09-Apr-2017 22:12:31 ..........................
09-Apr-2017 22:12:31
09-Apr-2017 22:12:31 Time: 47.25 secs; Memory: 60.5Mb
09-Apr-2017 22:12:31
09-Apr-2017 22:12:31
09-Apr-2017 22:12:31
09-Apr-2017 22:12:31 Time: 16ms; Memory: 3.75Mb
09-Apr-2017 22:12:31
09-Apr-2017 22:12:31        [if] Error in IfTask
09-Apr-2017 22:12:31 Execution of target "sniff" failed for the following reason: /data/build/build.xml:108:6: /data/build/build.xml:114:9: PHP Code Sniffer failed.
09-Apr-2017 22:12:31
09-Apr-2017 22:12:31 BUILD FAILED
09-Apr-2017 22:12:31 /data/build/build.xml:108:6: /data/build/build.xml:114:9: PHP Code Sniffer failed.
09-Apr-2017 22:12:31 Total time: 2 minutes  31.19 seconds
09-Apr-2017 22:12:31
09-Apr-2017 22:12:31 Failing task since return code of [/usr/bin/docker run --volume /home/bamboo/xml-data/build-dir/PHPBB3-PR-JOB1:/data --workdir /data/build --rm -u=991 phpbb:php-5.6 ../phpBB/vendor/bin/phing sniff] was 1 while expected 0
09-Apr-2017 22:12:31 Error occurred while running Task 'Run sniffs(11)' of type com.atlassian.bamboo.plugins.bamboo-docker-plugin:task.docker.cli.
09-Apr-2017 22:12:31 com.atlassian.bamboo.task.TaskException: Failed to execute task
09-Apr-2017 22:12:31         at com.atlassian.bamboo.plugins.docker.service.RunService.execute(RunService.java:71)
09-Apr-2017 22:12:31         at com.atlassian.bamboo.plugins.docker.tasks.cli.DockerCliTask.execute(DockerCliTask.java:60)
09-Apr-2017 22:12:31         at com.atlassian.bamboo.task.TaskExecutorImpl.lambda$executeTasks$3(TaskExecutorImpl.java:317)
09-Apr-2017 22:12:31         at com.atlassian.bamboo.task.TaskExecutorImpl.executeTaskWithPrePostActions(TaskExecutorImpl.java:246)
09-Apr-2017 22:12:31         at com.atlassian.bamboo.task.TaskExecutorImpl.executeTasks(TaskExecutorImpl.java:317)
09-Apr-2017 22:12:31         at com.atlassian.bamboo.task.TaskExecutorImpl.execute(TaskExecutorImpl.java:118)
09-Apr-2017 22:12:31         at com.atlassian.bamboo.build.pipeline.tasks.ExecuteBuildTask.call(ExecuteBuildTask.java:74)
09-Apr-2017 22:12:31         at com.atlassian.bamboo.v2.build.agent.DefaultBuildAgent.build(DefaultBuildAgent.java:216)
09-Apr-2017 22:12:31         at com.atlassian.bamboo.v2.build.agent.BuildAgentControllerImpl$1.call(BuildAgentControllerImpl.java:139)
09-Apr-2017 22:12:31         at com.atlassian.bamboo.v2.build.agent.BuildAgentControllerImpl$1.call(BuildAgentControllerImpl.java:130)
09-Apr-2017 22:12:31         at com.atlassian.bamboo.variable.CustomVariableContextImpl.withVariableSubstitutor(CustomVariableContextImpl.java:221)
09-Apr-2017 22:12:31         at com.atlassian.bamboo.v2.build.agent.BuildAgentControllerImpl.waitAndPerformBuild(BuildAgentControllerImpl.java:129)
09-Apr-2017 22:12:31         at com.atlassian.bamboo.v2.build.agent.DefaultBuildAgent$1.run(DefaultBuildAgent.java:138)
09-Apr-2017 22:12:31         at com.atlassian.bamboo.utils.BambooRunnables$1.run(BambooRunnables.java:51)
09-Apr-2017 22:12:31         at com.atlassian.bamboo.security.ImpersonationHelper.runWith(ImpersonationHelper.java:31)
09-Apr-2017 22:12:31         at com.atlassian.bamboo.security.ImpersonationHelper.runWithSystemAuthority(ImpersonationHelper.java:20)
09-Apr-2017 22:12:31         at com.atlassian.bamboo.security.ImpersonationHelper$1.run(ImpersonationHelper.java:52)
09-Apr-2017 22:12:31         at java.lang.Thread.run(Thread.java:745)
09-Apr-2017 22:12:31 Caused by: com.atlassian.bamboo.plugins.docker.client.DockerException: Error running Docker run command
09-Apr-2017 22:12:31         at com.atlassian.bamboo.plugins.docker.client.DockerCmd.run(DockerCmd.java:103)
09-Apr-2017 22:12:31         at com.atlassian.bamboo.plugins.docker.service.RunService.execute(RunService.java:60)
09-Apr-2017 22:12:31         ... 17 more
09-Apr-2017 22:12:31 Caused by: com.atlassian.utils.process.ProcessException: Error executing /usr/bin/docker run --volume /home/bamboo/xml-data/build-dir/PHPBB3-PR-JOB1:/data --workdir /data/build --rm -u=991 phpbb:php-5.6 ../phpBB/vendor/bin/phing sniff
09-Apr-2017 22:12:31         at com.atlassian.bamboo.plugins.docker.process.DockerTaskProcessService.execute(DockerTaskProcessService.java:60)
09-Apr-2017 22:12:31         at com.atlassian.bamboo.plugins.docker.client.DockerCmd.run(DockerCmd.java:99)
09-Apr-2017 22:12:31         ... 18 more
09-Apr-2017 22:12:31 Starting task 'Parsing test results produced by script' of type 'com.atlassian.bamboo.plugins.testresultparser:task.testresultparser.junit'
09-Apr-2017 22:12:31 Parsing test results under /home/bamboo/xml-data/build-dir/PHPBB3-PR-JOB1...
09-Apr-2017 22:12:31 Failing task since test cases were expected but none were found.
09-Apr-2017 22:12:31 Finished task 'Parsing test results produced by script' with result: Failed
09-Apr-2017 22:12:31
Substituting variable: ${bamboo.PRnumber} with 4789
09-Apr-2017 22:12:31
Substituting variable: ${bamboo.buildResultsUrl} with https://bamboo.phpbb.com/browse/PHPBB3-PR-JOB1-6967
09-Apr-2017 22:12:31
Substituting variable: ${bamboo.buildResultsUrl} with https://bamboo.phpbb.com/browse/PHPBB3-PR-JOB1-6967
09-Apr-2017 22:12:31 Starting task 'Set result build status' of type 'com.atlassian.bamboo.plugins.scripttask:task.builder.script'
09-Apr-2017 22:12:31
Beginning to execute external process for build 'phpBB3 - Pull Requests - Build and Test Job #6967 (PHPBB3-PR-JOB1-6967)'
... running command line:
/bin/sh /home/bamboo/temp/PHPBB3-PR-JOB1-6967-ScriptBuildTask-3757815202003456474.sh
... in: /home/bamboo/xml-data/build-dir/PHPBB3-PR-JOB1
... using extra environment variables:
bamboo_planRepository_1_branch=3.1.x
bamboo_planRepository_1_branchDisplayName=3.1.x
bamboo_repository_revision_number=3bf133c96ca34195024feb16bed812aa8dc77184
bamboo_PRref=master
bamboo_resultsUrl=https://bamboo.phpbb.com/browse/PHPBB3-PR-JOB1-6967
bamboo_capability_system_builder_command_Git=/usr/bin/git
bamboo_repository_75956235_git_username=bantu
bamboo_planRepository_1_name=phpBB Ascraeus
bamboo_build_working_directory=/home/bamboo/xml-data/build-dir/PHPBB3-PR-JOB1
bamboo_buildKey=PHPBB3-PR-JOB1
bamboo_capability_phpbb_tests=true
bamboo_shortPlanName=Pull Requests
bamboo_capability_system_builder_command_fop=/usr/bin/fop
bamboo_capability_dbms_sqlite_2=true
bamboo_planRepository_name=phpBB Ascraeus
bamboo_PRnumber=4789
bamboo_buildNumber=6967
bamboo_repository_75956235_git_repositoryUrl=https://github.com/phpbb/phpbb.git
bamboo_capability_system_builder_phpunit_PHPUnit=/usr/bin/phpunit
bamboo_shortJobName=Build and Test Job
bamboo_buildResultsUrl=https://bamboo.phpbb.com/browse/PHPBB3-PR-JOB1-6967
bamboo_repository_75956235_branch_name=3.1.x
bamboo_planRepository_repositoryUrl=https://github.com/phpbb/phpbb.git
bamboo_agentId=131073
bamboo_planName=phpBB3 - Pull Requests
bamboo_build_commandline_com_atlassian_bamboo_plugins_scripttask_task_builder_script_7=/bin/sh /home/bamboo/temp/PHPBB3-PR-JOB1-6967-ScriptBuildTask-9142415841936091134.sh
bamboo_shortPlanKey=PR
bamboo_shortJobKey=JOB1
bamboo_capability_dbms_mysql_55=true
bamboo_capability_system_jdk_JDK_1_7_0_65=/usr/lib/jvm/java-7-openjdk-amd64
bamboo_planRepository_revision=3bf133c96ca34195024feb16bed812aa8dc77184
bamboo_repository_previous_revision_number=827ded82b8110fd2c587d9d7c84731ee7215b166
bamboo_buildTimeStamp=2017-04-09T22:09:38.066Z
bamboo_planRepository_previousRevision=827ded82b8110fd2c587d9d7c84731ee7215b166
bamboo_capability_system_builder_mvn2_Maven_2=/usr/share/maven2
bamboo_capability_system_jdk_JDK_1_6_0_16=/usr/lib/jvm/java-6-sun-1.6.0.16
bamboo_build_commandline_com_atlassian_bamboo_plugins_scripttask_task_builder_script_4=/bin/sh /home/bamboo/temp/PHPBB3-PR-JOB1-6967-ScriptBuildTask-5538606915343189016.sh
bamboo_buildResultKey=PHPBB3-PR-JOB1-6967
bamboo_repository_git_branch=3.1.x
bamboo_repository_branch_name=3.1.x
bamboo_buildPlanName=phpBB3 - Pull Requests - Build and Test Job
bamboo_planRepository_1_revision=3bf133c96ca34195024feb16bed812aa8dc77184
bamboo_repository_name=phpBB Ascraeus
bamboo_capability_system_docker_executable=/usr/bin/docker
bamboo_build_commandline_com_atlassian_bamboo_plugins_bamboo_docker_plugin_task_docker_cli_11=/usr/bin/docker run --volume /home/bamboo/xml-data/build-dir/PHPBB3-PR-JOB1:/data --workdir /data/build --rm -u=991 phpbb:php-5.6 ../phpBB/vendor/bin/phing sniff
bamboo_build_commandline_com_atlassian_bamboo_plugins_bamboo_docker_plugin_task_docker_cli_12=/usr/bin/docker run --volume /home/bamboo/xml-data/build-dir/PHPBB3-PR-JOB1:/data --workdir /data/phpBB --rm -e HOME=/home/bamboo -u=991 phpbb:php-5.6 /bin/bash -c php ../composer.phar install --dev; cd ../build; ../phpBB/vendor/bin/phing clean prepare
bamboo_planRepository_branch=3.1.x
bamboo_agentWorkingDirectory=/home/bamboo/xml-data/build-dir
bamboo_capability_system_git_executable=/usr/bin/git
bamboo_planRepository_1_previousRevision=827ded82b8110fd2c587d9d7c84731ee7215b166
bamboo_capability_system_builder_phpunit_PHPUnit_3_4=/usr/bin/phpunit
bamboo_repository_git_username=bantu
bamboo_repository_75956235_revision_number=3bf133c96ca34195024feb16bed812aa8dc77184
bamboo_planRepository_branchDisplayName=3.1.x
bamboo_planRepository_1_type=gitv2
bamboo_planRepository_branchName=3.1.x
bamboo_repository_75956235_previous_revision_number=827ded82b8110fd2c587d9d7c84731ee7215b166
bamboo_capability_system_jdk_JDK=/usr/lib/jvm/java-6-sun
bamboo_plan_storageTag=PHPBB3-PR
bamboo_planRepository_type=gitv2
bamboo_planRepository_1_username=bantu
bamboo_ManualBuildTriggerReason_userName=Build Robot
bamboo_repository_git_repositoryUrl=https://github.com/phpbb/phpbb.git
bamboo_repository_75956235_git_branch=3.1.x
bamboo_capability_system_builder_ant_Ant=/usr/share/ant
bamboo_repository_75956235_name=phpBB Ascraeus
bamboo_working_directory=/home/bamboo/xml-data/build-dir/PHPBB3-PR-JOB1
bamboo_planKey=PHPBB3-PR
bamboo_planRepository_1_repositoryUrl=https://github.com/phpbb/phpbb.git
bamboo_planRepository_username=bantu
bamboo_capability_local=true
bamboo_capability_system_jdk_JDK_1_6=/usr/lib/jvm/java-6-sun
bamboo_capability_system_jdk_JDK_1_7=/usr/lib/jvm/java-7-openjdk-amd64
bamboo_planRepository_1_branchName=3.1.x
09-Apr-2017 22:12:31 From https://github.com/phpbb/phpbb
09-Apr-2017 22:12:31 * branch            refs/pull/4789/head -> FETCH_HEAD
09-Apr-2017 22:12:31 grep: build/logs/phpunit.xml: No such file or directory
09-Apr-2017 22:12:31 grep: build/logs/phpunit.xml: No such file or directory
09-Apr-2017 22:12:31   % Total    % Received % Xferd  Average Speed   Time    Time     Time  Current
09-Apr-2017 22:12:31                                  Dload  Upload   Total   Spent    Left  Speed
09-Apr-2017 22:12:31
09-Apr-2017 22:12:32   0     0    0     0    0     0      0      0 --:--:-- --:--:-- --:--:--     0
09-Apr-2017 22:12:32   0     0    0     0    0     0      0      0 --:--:-- --:--:-- --:--:--     0
09-Apr-2017 22:12:32 100   273  100    93  100   180    128    248 --:--:-- --:--:-- --:--:--   248
09-Apr-2017 22:12:32 Finished task 'Set result build status' with result: Success
09-Apr-2017 22:12:32 Running post build plugin 'NCover Results Collector'
09-Apr-2017 22:12:32 Running post build plugin 'Artifact Copier'
09-Apr-2017 22:12:32 Running post build plugin 'npm Cache Cleanup'
09-Apr-2017 22:12:32 Running post build plugin 'Clover Results Collector'
09-Apr-2017 22:12:32 Running post build plugin 'Docker Container Cleanup'
09-Apr-2017 22:12:32 Successfully removed working directory at '/home/bamboo/xml-data/build-dir/PHPBB3-PR-JOB1'
09-Apr-2017 22:12:32 Finalising the build...
09-Apr-2017 22:12:32 Stopping timer.
09-Apr-2017 22:12:32 Build PHPBB3-PR-JOB1-6967 completed.
09-Apr-2017 22:12:32 Running on server: post build plugin 'NCover Results Collector'
09-Apr-2017 22:12:32 Running on server: post build plugin 'Build Hanging Detection Configuration'
09-Apr-2017 22:12:32 Running on server: post build plugin 'Clover Delta Calculator'
09-Apr-2017 22:12:33 Running on server: post build plugin 'Maven Dependencies Postprocessor'
09-Apr-2017 22:12:33 All post build plugins have finished
09-Apr-2017 22:12:33 Generating build results summary...
09-Apr-2017 22:12:33 Saving build results to disk...
09-Apr-2017 22:12:33 Logging substituted variables...
09-Apr-2017 22:12:33 Indexing build results...
09-Apr-2017 22:12:33 Finished building PHPBB3-PR-JOB1-6967.
09-Apr-2017 22:12:33
Substituting variable: ${bamboo.PRnumber} with 4789