Tests pending pull requests

Build: #6968 failed

Job: Build and Test Job failed

Stages & jobs

  1. Build and Test

Build log

The build generated 443 lines of output. Download or view full build log

10-Apr-2017 00:14:17 Build phpBB3 - Pull Requests - Build and Test Job #6968 (PHPBB3-PR-JOB1-6968) started building on agent Default Agent
10-Apr-2017 00:14:17
10-Apr-2017 00:14:17 Build working directory is /home/bamboo/xml-data/build-dir/PHPBB3-PR-JOB1
10-Apr-2017 00:14:17 Executing build phpBB3 - Pull Requests - Build and Test Job #6968 (PHPBB3-PR-JOB1-6968)
10-Apr-2017 00:14:17 Starting task 'Checkout develop branch' of type 'com.atlassian.bamboo.plugins.vcs:task.vcs.checkout'
10-Apr-2017 00:14:17 Build always requires a clean checkout
10-Apr-2017 00:14:17 Cleaning build directory '/home/bamboo/xml-data/build-dir/PHPBB3-PR-JOB1'
10-Apr-2017 00:14:17 Updating source code to revision: 3bf133c96ca34195024feb16bed812aa8dc77184
10-Apr-2017 00:14:17 Fetching 'refs/heads/3.1.x' from 'https://github.com/phpbb/phpbb.git'.
10-Apr-2017 00:14:17 Checking out revision 3bf133c96ca34195024feb16bed812aa8dc77184.
10-Apr-2017 00:14:17 Creating local git repository in '/home/bamboo/xml-data/build-dir/PHPBB3-PR-JOB1/.git'.
10-Apr-2017 00:14:17 Cloning into '/home/bamboo/xml-data/build-dir/PHPBB3-PR-JOB1'...
10-Apr-2017 00:14:17 done.
10-Apr-2017 00:14:18 Branch 3.1.x set up to track remote branch 3.1.x from origin.
10-Apr-2017 00:14:18 Switched to a new branch '3.1.x'
10-Apr-2017 00:14:19 Updated source code to revision: 3bf133c96ca34195024feb16bed812aa8dc77184
10-Apr-2017 00:14:19 Finished task 'Checkout develop branch' with result: Success
10-Apr-2017 00:14:19 Running pre-build action: VCS Version Collector
10-Apr-2017 00:14:19
Substituting variable: ${bamboo.PRnumber} with 4789
10-Apr-2017 00:14:19
Substituting variable: ${bamboo.buildResultsUrl} with https://bamboo.phpbb.com/browse/PHPBB3-PR-JOB1-6968
10-Apr-2017 00:14:19 Starting task 'Set pending build status' of type 'com.atlassian.bamboo.plugins.scripttask:task.builder.script'
10-Apr-2017 00:14:19
Beginning to execute external process for build 'phpBB3 - Pull Requests - Build and Test Job #6968 (PHPBB3-PR-JOB1-6968)'
... running command line:
/bin/sh /home/bamboo/temp/PHPBB3-PR-JOB1-6968-ScriptBuildTask-8348191571132531260.sh
... in: /home/bamboo/xml-data/build-dir/PHPBB3-PR-JOB1
... using extra environment variables:
bamboo_planRepository_1_branch=3.1.x
bamboo_planRepository_1_branchDisplayName=3.1.x
bamboo_repository_revision_number=3bf133c96ca34195024feb16bed812aa8dc77184
bamboo_PRref=master
bamboo_resultsUrl=https://bamboo.phpbb.com/browse/PHPBB3-PR-JOB1-6968
bamboo_capability_system_builder_command_Git=/usr/bin/git
bamboo_repository_75956235_git_username=bantu
bamboo_planRepository_1_name=phpBB Ascraeus
bamboo_build_working_directory=/home/bamboo/xml-data/build-dir/PHPBB3-PR-JOB1
bamboo_buildKey=PHPBB3-PR-JOB1
bamboo_capability_phpbb_tests=true
bamboo_shortPlanName=Pull Requests
bamboo_capability_system_builder_command_fop=/usr/bin/fop
bamboo_capability_dbms_sqlite_2=true
bamboo_planRepository_name=phpBB Ascraeus
bamboo_PRnumber=4789
bamboo_buildNumber=6968
bamboo_repository_75956235_git_repositoryUrl=https://github.com/phpbb/phpbb.git
bamboo_capability_system_builder_phpunit_PHPUnit=/usr/bin/phpunit
bamboo_shortJobName=Build and Test Job
bamboo_buildResultsUrl=https://bamboo.phpbb.com/browse/PHPBB3-PR-JOB1-6968
bamboo_repository_75956235_branch_name=3.1.x
bamboo_planRepository_repositoryUrl=https://github.com/phpbb/phpbb.git
bamboo_agentId=131073
bamboo_planName=phpBB3 - Pull Requests
bamboo_shortPlanKey=PR
bamboo_shortJobKey=JOB1
bamboo_capability_dbms_mysql_55=true
bamboo_capability_system_jdk_JDK_1_7_0_65=/usr/lib/jvm/java-7-openjdk-amd64
bamboo_planRepository_revision=3bf133c96ca34195024feb16bed812aa8dc77184
bamboo_repository_previous_revision_number=3bf133c96ca34195024feb16bed812aa8dc77184
bamboo_buildTimeStamp=2017-04-10T00:14:17.202Z
bamboo_planRepository_previousRevision=3bf133c96ca34195024feb16bed812aa8dc77184
bamboo_capability_system_builder_mvn2_Maven_2=/usr/share/maven2
bamboo_capability_system_jdk_JDK_1_6_0_16=/usr/lib/jvm/java-6-sun-1.6.0.16
bamboo_buildResultKey=PHPBB3-PR-JOB1-6968
bamboo_repository_git_branch=3.1.x
bamboo_repository_branch_name=3.1.x
bamboo_buildPlanName=phpBB3 - Pull Requests - Build and Test Job
bamboo_planRepository_1_revision=3bf133c96ca34195024feb16bed812aa8dc77184
bamboo_repository_name=phpBB Ascraeus
bamboo_capability_system_docker_executable=/usr/bin/docker
bamboo_planRepository_branch=3.1.x
bamboo_agentWorkingDirectory=/home/bamboo/xml-data/build-dir
bamboo_capability_system_git_executable=/usr/bin/git
bamboo_planRepository_1_previousRevision=3bf133c96ca34195024feb16bed812aa8dc77184
bamboo_capability_system_builder_phpunit_PHPUnit_3_4=/usr/bin/phpunit
bamboo_repository_git_username=bantu
bamboo_repository_75956235_revision_number=3bf133c96ca34195024feb16bed812aa8dc77184
bamboo_planRepository_branchDisplayName=3.1.x
bamboo_planRepository_1_type=gitv2
bamboo_planRepository_branchName=3.1.x
bamboo_repository_75956235_previous_revision_number=3bf133c96ca34195024feb16bed812aa8dc77184
bamboo_capability_system_jdk_JDK=/usr/lib/jvm/java-6-sun
bamboo_plan_storageTag=PHPBB3-PR
bamboo_planRepository_type=gitv2
bamboo_planRepository_1_username=bantu
bamboo_ManualBuildTriggerReason_userName=Build Robot
bamboo_repository_git_repositoryUrl=https://github.com/phpbb/phpbb.git
bamboo_repository_75956235_git_branch=3.1.x
bamboo_capability_system_builder_ant_Ant=/usr/share/ant
bamboo_repository_75956235_name=phpBB Ascraeus
bamboo_working_directory=/home/bamboo/xml-data/build-dir/PHPBB3-PR-JOB1
bamboo_planKey=PHPBB3-PR
bamboo_planRepository_1_repositoryUrl=https://github.com/phpbb/phpbb.git
bamboo_planRepository_username=bantu
bamboo_capability_local=true
bamboo_capability_system_jdk_JDK_1_6=/usr/lib/jvm/java-6-sun
bamboo_capability_system_jdk_JDK_1_7=/usr/lib/jvm/java-7-openjdk-amd64
bamboo_planRepository_1_branchName=3.1.x
10-Apr-2017 00:14:19 From https://github.com/phpbb/phpbb
10-Apr-2017 00:14:19 * branch            refs/pull/4789/head -> FETCH_HEAD
10-Apr-2017 00:14:19   % Total    % Received % Xferd  Average Speed   Time    Time     Time  Current
10-Apr-2017 00:14:19                                  Dload  Upload   Total   Spent    Left  Speed
10-Apr-2017 00:14:19
10-Apr-2017 00:14:20   0     0    0     0    0     0      0      0 --:--:-- --:--:-- --:--:--     0
10-Apr-2017 00:14:20   0     0    0     0    0     0      0      0 --:--:-- --:--:-- --:--:--     0
10-Apr-2017 00:14:20 100   275  100    93  100   182    127    248 --:--:-- --:--:-- --:--:--   248
10-Apr-2017 00:14:20 Finished task 'Set pending build status' with result: Success
10-Apr-2017 00:14:20
Substituting variable: ${bamboo.PRnumber} with 4789
10-Apr-2017 00:14:20 Starting task 'Fetch PR' of type 'com.atlassian.bamboo.plugins.scripttask:task.builder.script'
10-Apr-2017 00:14:20
Beginning to execute external process for build 'phpBB3 - Pull Requests - Build and Test Job #6968 (PHPBB3-PR-JOB1-6968)'
... running command line:
/bin/sh /home/bamboo/temp/PHPBB3-PR-JOB1-6968-ScriptBuildTask-3317503114440974297.sh
... in: /home/bamboo/xml-data/build-dir/PHPBB3-PR-JOB1
... using extra environment variables:
bamboo_planRepository_1_branch=3.1.x
bamboo_planRepository_1_branchDisplayName=3.1.x
bamboo_repository_revision_number=3bf133c96ca34195024feb16bed812aa8dc77184
bamboo_PRref=master
bamboo_resultsUrl=https://bamboo.phpbb.com/browse/PHPBB3-PR-JOB1-6968
bamboo_capability_system_builder_command_Git=/usr/bin/git
bamboo_repository_75956235_git_username=bantu
bamboo_planRepository_1_name=phpBB Ascraeus
bamboo_build_working_directory=/home/bamboo/xml-data/build-dir/PHPBB3-PR-JOB1
bamboo_buildKey=PHPBB3-PR-JOB1
bamboo_capability_phpbb_tests=true
bamboo_shortPlanName=Pull Requests
bamboo_capability_system_builder_command_fop=/usr/bin/fop
bamboo_capability_dbms_sqlite_2=true
bamboo_planRepository_name=phpBB Ascraeus
bamboo_PRnumber=4789
bamboo_buildNumber=6968
bamboo_repository_75956235_git_repositoryUrl=https://github.com/phpbb/phpbb.git
bamboo_capability_system_builder_phpunit_PHPUnit=/usr/bin/phpunit
bamboo_shortJobName=Build and Test Job
bamboo_buildResultsUrl=https://bamboo.phpbb.com/browse/PHPBB3-PR-JOB1-6968
bamboo_repository_75956235_branch_name=3.1.x
bamboo_planRepository_repositoryUrl=https://github.com/phpbb/phpbb.git
bamboo_agentId=131073
bamboo_planName=phpBB3 - Pull Requests
bamboo_build_commandline_com_atlassian_bamboo_plugins_scripttask_task_builder_script_7=/bin/sh /home/bamboo/temp/PHPBB3-PR-JOB1-6968-ScriptBuildTask-8348191571132531260.sh
bamboo_shortPlanKey=PR
bamboo_shortJobKey=JOB1
bamboo_capability_dbms_mysql_55=true
bamboo_capability_system_jdk_JDK_1_7_0_65=/usr/lib/jvm/java-7-openjdk-amd64
bamboo_planRepository_revision=3bf133c96ca34195024feb16bed812aa8dc77184
bamboo_repository_previous_revision_number=3bf133c96ca34195024feb16bed812aa8dc77184
bamboo_buildTimeStamp=2017-04-10T00:14:17.202Z
bamboo_planRepository_previousRevision=3bf133c96ca34195024feb16bed812aa8dc77184
bamboo_capability_system_builder_mvn2_Maven_2=/usr/share/maven2
bamboo_capability_system_jdk_JDK_1_6_0_16=/usr/lib/jvm/java-6-sun-1.6.0.16
bamboo_buildResultKey=PHPBB3-PR-JOB1-6968
bamboo_repository_git_branch=3.1.x
bamboo_repository_branch_name=3.1.x
bamboo_buildPlanName=phpBB3 - Pull Requests - Build and Test Job
bamboo_planRepository_1_revision=3bf133c96ca34195024feb16bed812aa8dc77184
bamboo_repository_name=phpBB Ascraeus
bamboo_capability_system_docker_executable=/usr/bin/docker
bamboo_planRepository_branch=3.1.x
bamboo_agentWorkingDirectory=/home/bamboo/xml-data/build-dir
bamboo_capability_system_git_executable=/usr/bin/git
bamboo_planRepository_1_previousRevision=3bf133c96ca34195024feb16bed812aa8dc77184
bamboo_capability_system_builder_phpunit_PHPUnit_3_4=/usr/bin/phpunit
bamboo_repository_git_username=bantu
bamboo_repository_75956235_revision_number=3bf133c96ca34195024feb16bed812aa8dc77184
bamboo_planRepository_branchDisplayName=3.1.x
bamboo_planRepository_1_type=gitv2
bamboo_planRepository_branchName=3.1.x
bamboo_repository_75956235_previous_revision_number=3bf133c96ca34195024feb16bed812aa8dc77184
bamboo_capability_system_jdk_JDK=/usr/lib/jvm/java-6-sun
bamboo_plan_storageTag=PHPBB3-PR
bamboo_planRepository_type=gitv2
bamboo_planRepository_1_username=bantu
bamboo_ManualBuildTriggerReason_userName=Build Robot
bamboo_repository_git_repositoryUrl=https://github.com/phpbb/phpbb.git
bamboo_repository_75956235_git_branch=3.1.x
bamboo_capability_system_builder_ant_Ant=/usr/share/ant
bamboo_repository_75956235_name=phpBB Ascraeus
bamboo_working_directory=/home/bamboo/xml-data/build-dir/PHPBB3-PR-JOB1
bamboo_planKey=PHPBB3-PR
bamboo_planRepository_1_repositoryUrl=https://github.com/phpbb/phpbb.git
bamboo_planRepository_username=bantu
bamboo_capability_local=true
bamboo_capability_system_jdk_JDK_1_6=/usr/lib/jvm/java-6-sun
bamboo_capability_system_jdk_JDK_1_7=/usr/lib/jvm/java-7-openjdk-amd64
bamboo_planRepository_1_branchName=3.1.x
10-Apr-2017 00:14:21 From https://github.com/phpbb/phpbb
10-Apr-2017 00:14:21 * branch            refs/pull/4789/merge -> FETCH_HEAD
10-Apr-2017 00:14:21 Note: checking out 'FETCH_HEAD'.
10-Apr-2017 00:14:21
10-Apr-2017 00:14:21 You are in 'detached HEAD' state. You can look around, make experimental
10-Apr-2017 00:14:21 changes and commit them, and you can discard any commits you make in this
10-Apr-2017 00:14:21 state without impacting any branches by performing another checkout.
10-Apr-2017 00:14:21
10-Apr-2017 00:14:21 If you want to create a new branch to retain commits you create, you may
10-Apr-2017 00:14:21 do so (now or later) by using -b with the checkout command again. Example:
10-Apr-2017 00:14:21
10-Apr-2017 00:14:21   git checkout -b new_branch_name
10-Apr-2017 00:14:21
10-Apr-2017 00:14:21 HEAD is now at cb466eb... Merge de4f72b0bc553f8111815296e34e4cad0843933c into 4a657d073259e59431264965c6300e365bef1664
10-Apr-2017 00:14:21 Finished task 'Fetch PR' with result: Success
10-Apr-2017 00:14:21 Skipping execution of task 'Prepare directory' as it is disabled
10-Apr-2017 00:14:21
Substituting variable: ${bamboo.working.directory} with /home/bamboo/xml-data/build-dir/PHPBB3-PR-JOB1
10-Apr-2017 00:14:21 Starting task 'Prepare directory' of type 'com.atlassian.bamboo.plugins.bamboo-docker-plugin:task.docker.cli'
10-Apr-2017 00:14:21 Running image name (phpbb:php-5.6)
10-Apr-2017 00:14:21
Beginning to execute external process for build 'phpBB3 - Pull Requests - Build and Test Job #6968 (PHPBB3-PR-JOB1-6968)'
... running command line:
/usr/bin/docker run --volume /home/bamboo/xml-data/build-dir/PHPBB3-PR-JOB1:/data --workdir /data/phpBB --rm -e HOME=/home/bamboo -u=991 phpbb:php-5.6 /bin/bash -c php ../composer.phar install --dev; cd ../build; ../phpBB/vendor/bin/phing clean prepare
... in: /home/bamboo/xml-data/build-dir/PHPBB3-PR-JOB1
... using extra environment variables:
bamboo_planRepository_1_branch=3.1.x
bamboo_planRepository_1_branchDisplayName=3.1.x
bamboo_repository_revision_number=3bf133c96ca34195024feb16bed812aa8dc77184
bamboo_PRref=master
bamboo_resultsUrl=https://bamboo.phpbb.com/browse/PHPBB3-PR-JOB1-6968
bamboo_capability_system_builder_command_Git=/usr/bin/git
bamboo_repository_75956235_git_username=bantu
bamboo_planRepository_1_name=phpBB Ascraeus
bamboo_build_working_directory=/home/bamboo/xml-data/build-dir/PHPBB3-PR-JOB1
bamboo_buildKey=PHPBB3-PR-JOB1
bamboo_capability_phpbb_tests=true
bamboo_shortPlanName=Pull Requests
bamboo_capability_system_builder_command_fop=/usr/bin/fop
bamboo_capability_dbms_sqlite_2=true
bamboo_planRepository_name=phpBB Ascraeus
bamboo_PRnumber=4789
bamboo_buildNumber=6968
bamboo_repository_75956235_git_repositoryUrl=https://github.com/phpbb/phpbb.git
bamboo_capability_system_builder_phpunit_PHPUnit=/usr/bin/phpunit
bamboo_shortJobName=Build and Test Job
bamboo_buildResultsUrl=https://bamboo.phpbb.com/browse/PHPBB3-PR-JOB1-6968
bamboo_repository_75956235_branch_name=3.1.x
bamboo_planRepository_repositoryUrl=https://github.com/phpbb/phpbb.git
bamboo_agentId=131073
bamboo_planName=phpBB3 - Pull Requests
bamboo_build_commandline_com_atlassian_bamboo_plugins_scripttask_task_builder_script_7=/bin/sh /home/bamboo/temp/PHPBB3-PR-JOB1-6968-ScriptBuildTask-8348191571132531260.sh
bamboo_shortPlanKey=PR
bamboo_shortJobKey=JOB1
bamboo_capability_dbms_mysql_55=true
bamboo_capability_system_jdk_JDK_1_7_0_65=/usr/lib/jvm/java-7-openjdk-amd64
bamboo_planRepository_revision=3bf133c96ca34195024feb16bed812aa8dc77184
bamboo_repository_previous_revision_number=3bf133c96ca34195024feb16bed812aa8dc77184
bamboo_buildTimeStamp=2017-04-10T00:14:17.202Z
bamboo_planRepository_previousRevision=3bf133c96ca34195024feb16bed812aa8dc77184
bamboo_capability_system_builder_mvn2_Maven_2=/usr/share/maven2
bamboo_capability_system_jdk_JDK_1_6_0_16=/usr/lib/jvm/java-6-sun-1.6.0.16
bamboo_build_commandline_com_atlassian_bamboo_plugins_scripttask_task_builder_script_4=/bin/sh /home/bamboo/temp/PHPBB3-PR-JOB1-6968-ScriptBuildTask-3317503114440974297.sh
bamboo_buildResultKey=PHPBB3-PR-JOB1-6968
bamboo_repository_git_branch=3.1.x
bamboo_repository_branch_name=3.1.x
bamboo_buildPlanName=phpBB3 - Pull Requests - Build and Test Job
bamboo_planRepository_1_revision=3bf133c96ca34195024feb16bed812aa8dc77184
bamboo_repository_name=phpBB Ascraeus
bamboo_capability_system_docker_executable=/usr/bin/docker
bamboo_planRepository_branch=3.1.x
bamboo_agentWorkingDirectory=/home/bamboo/xml-data/build-dir
bamboo_capability_system_git_executable=/usr/bin/git
bamboo_planRepository_1_previousRevision=3bf133c96ca34195024feb16bed812aa8dc77184
bamboo_capability_system_builder_phpunit_PHPUnit_3_4=/usr/bin/phpunit
bamboo_repository_git_username=bantu
bamboo_repository_75956235_revision_number=3bf133c96ca34195024feb16bed812aa8dc77184
bamboo_planRepository_branchDisplayName=3.1.x
bamboo_planRepository_1_type=gitv2
bamboo_planRepository_branchName=3.1.x
bamboo_repository_75956235_previous_revision_number=3bf133c96ca34195024feb16bed812aa8dc77184
bamboo_capability_system_jdk_JDK=/usr/lib/jvm/java-6-sun
bamboo_plan_storageTag=PHPBB3-PR
bamboo_planRepository_type=gitv2
bamboo_planRepository_1_username=bantu
bamboo_ManualBuildTriggerReason_userName=Build Robot
bamboo_repository_git_repositoryUrl=https://github.com/phpbb/phpbb.git
bamboo_repository_75956235_git_branch=3.1.x
bamboo_capability_system_builder_ant_Ant=/usr/share/ant
bamboo_repository_75956235_name=phpBB Ascraeus
bamboo_working_directory=/home/bamboo/xml-data/build-dir/PHPBB3-PR-JOB1
bamboo_planKey=PHPBB3-PR
bamboo_planRepository_1_repositoryUrl=https://github.com/phpbb/phpbb.git
bamboo_planRepository_username=bantu
bamboo_capability_local=true
bamboo_capability_system_jdk_JDK_1_6=/usr/lib/jvm/java-6-sun
bamboo_capability_system_jdk_JDK_1_7=/usr/lib/jvm/java-7-openjdk-amd64
bamboo_planRepository_1_branchName=3.1.x
10-Apr-2017 00:14:22 You are running composer with xdebug enabled. This has a major impact on runtime performance. See https://getcomposer.org/xdebug
10-Apr-2017 00:14:22 You are using the deprecated option "dev". Dev packages are installed by default now.
10-Apr-2017 00:14:22 Cannot create cache directory /home/bamboo/.composer/cache/repo/https---packagist.org/, or directory is not writable. Proceeding without cache
10-Apr-2017 00:14:22 Cannot create cache directory /home/bamboo/.composer/cache/files/, or directory is not writable. Proceeding without cache
10-Apr-2017 00:14:22 Loading composer repositories with package information
10-Apr-2017 00:14:22 Installing dependencies (including require-dev) from lock file
10-Apr-2017 00:14:22   - Installing bantu/ini-get-wrapper (v1.0.1)
10-Apr-2017 00:14:24     Downloading: Connecting...    Downloading: 100%         
10-Apr-2017 00:14:24
10-Apr-2017 00:14:24   - Installing google/recaptcha (1.1.2)
10-Apr-2017 00:14:25     Downloading: Connecting...    Downloading: 0%               Downloading: 30%    Downloading: 55%    Downloading: 65%    Downloading: 70%    Downloading: 85%    Downloading: 90%    Downloading: 100%    Downloading: 100%
10-Apr-2017 00:14:25
10-Apr-2017 00:14:25   - Installing guzzlehttp/promises (1.3.0)
10-Apr-2017 00:14:27     Downloading: Connecting...    Downloading: 0%               Downloading: 15%    Downloading: 25%    Downloading: 40%    Downloading: 60%    Downloading: 70%    Downloading: 85%    Downloading: 100%    Downloading: 100%
10-Apr-2017 00:14:27
10-Apr-2017 00:14:27   - Installing psr/http-message (1.0.1)
10-Apr-2017 00:14:28     Downloading: Connecting...    Downloading: 0%               Downloading: 95%    Downloading: 100%    Downloading: 100%
10-Apr-2017 00:14:28
10-Apr-2017 00:14:28   - Installing guzzlehttp/psr7 (1.3.1)
10-Apr-2017 00:14:29     Downloading: Connecting...    Downloading: 0%               Downloading: 5%    Downloading: 15%    Downloading: 20%    Downloading: 30%    Downloading: 35%    Downloading: 45%    Downloading: 50%    Downloading: 65%    Downloading: 70%    Downloading: 85%    Downloading: 90%    Downloading: 100%    Downloading: 100%
10-Apr-2017 00:14:29
10-Apr-2017 00:14:29   - Installing lusitanian/oauth (v0.8.9)
10-Apr-2017 00:14:30     Downloading: Connecting...    Downloading: 0%               Downloading: 5%    Downloading: 10%    Downloading: 15%    Downloading: 20%    Downloading: 25%    Downloading: 30%    Downloading: 35%    Downloading: 40%    Downloading: 45%    Downloading: 50%    Downloading: 55%    Downloading: 60%    Downloading: 65%    Downloading: 70%    Downloading: 75%    Downloading: 80%    Downloading: 85%    Downloading: 90%    Downloading: 95%    Downloading: 100%    Downloading: 100%
10-Apr-2017 00:14:30
10-Apr-2017 00:14:30   - Installing marc1706/fast-image-size (v1.1.2)
10-Apr-2017 00:14:31     Downloading: Connecting...    Downloading: 100%         
10-Apr-2017 00:14:31
10-Apr-2017 00:14:31   - Installing paragonie/random_compat (v1.4.1)
10-Apr-2017 00:14:32     Downloading: Connecting...    Downloading: 0%               Downloading: 20%    Downloading: 35%    Downloading: 60%    Downloading: 90%    Downloading: 100%    Downloading: 100%
10-Apr-2017 00:14:32
10-Apr-2017 00:14:32   - Installing patchwork/utf8 (v1.3.1)
10-Apr-2017 00:14:34     Downloading: Connecting...    Downloading: 0%               Downloading: 5%    Downloading: 10%    Downloading: 15%    Downloading: 20%    Downloading: 25%    Downloading: 30%    Downloading: 35%    Downloading: 40%    Downloading: 45%    Downloading: 50%    Downloading: 55%    Downloading: 60%    Downloading: 65%    Downloading: 70%    Downloading: 75%    Downloading: 80%    Downloading: 85%    Downloading: 90%    Downloading: 95%    Downloading: 100%    Downloading: 100%
10-Apr-2017 00:14:34
10-Apr-2017 00:14:34   - Installing s9e/text-formatter (0.9.1)
10-Apr-2017 00:14:35     Downloading: Connecting...    Downloading: 100%         
10-Apr-2017 00:14:35
10-Apr-2017 00:14:35   - Installing symfony/filesystem (v3.2.0)
10-Apr-2017 00:14:36     Downloading: Connecting...    Downloading: 100%         
10-Apr-2017 00:14:36
10-Apr-2017 00:14:36   - Installing symfony/config (v3.2.0)
10-Apr-2017 00:14:37     Downloading: Connecting...    Downloading: 100%         
10-Apr-2017 00:14:37
10-Apr-2017 00:14:37   - Installing symfony/finder (v3.2.0)
10-Apr-2017 00:14:39     Downloading: Connecting...    Downloading: 100%         
10-Apr-2017 00:14:39
10-Apr-2017 00:14:39   - Installing symfony/polyfill-mbstring (v1.3.0)
10-Apr-2017 00:14:40     Downloading: Connecting...    Downloading: 0%               Downloading: 35%    Downloading: 70%    Downloading: 90%    Downloading: 100%
10-Apr-2017 00:14:40
10-Apr-2017 00:14:40   - Installing symfony/http-foundation (v3.2.0)
10-Apr-2017 00:14:41     Downloading: Connecting...    Downloading: 100%         
10-Apr-2017 00:14:41
10-Apr-2017 00:14:41   - Installing symfony/event-dispatcher (v3.2.0)
10-Apr-2017 00:14:42     Downloading: Connecting...    Downloading: 0%               Downloading: 5%    Downloading: 10%    Downloading: 15%    Downloading: 65%    Downloading: 70%    Downloading: 75%    Downloading: 80%    Downloading: 85%    Downloading: 90%    Downloading: 100%    Downloading: 100%
10-Apr-2017 00:14:42
10-Apr-2017 00:14:42   - Installing psr/log (1.0.2)
10-Apr-2017 00:14:43     Downloading: Connecting...    Downloading: 0%               Downloading: 15%    Downloading: 100%    Downloading: 100%
10-Apr-2017 00:14:43
10-Apr-2017 00:14:43   - Installing symfony/debug (v3.2.0)
10-Apr-2017 00:14:44     Downloading: Connecting...    Downloading: 100%         
10-Apr-2017 00:14:44
10-Apr-2017 00:14:44   - Installing symfony/http-kernel (v3.2.0)
10-Apr-2017 00:14:45     Downloading: Connecting...    Downloading: 0%               Downloading: 5%    Downloading: 10%    Downloading: 15%    Downloading: 20%    Downloading: 25%    Downloading: 30%    Downloading: 35%    Downloading: 40%    Downloading: 45%    Downloading: 50%    Downloading: 55%    Downloading: 60%    Downloading: 65%    Downloading: 70%    Downloading: 75%    Downloading: 80%    Downloading: 85%    Downloading: 90%    Downloading: 95%    Downloading: 100%    Downloading: 100%
10-Apr-2017 00:14:45
10-Apr-2017 00:14:45   - Installing symfony/dependency-injection (v3.2.0)
10-Apr-2017 00:14:47     Downloading: Connecting...    Downloading: 0%               Downloading: 5%    Downloading: 10%    Downloading: 15%    Downloading: 20%    Downloading: 25%    Downloading: 30%    Downloading: 35%    Downloading: 40%    Downloading: 45%    Downloading: 50%    Downloading: 55%    Downloading: 60%    Downloading: 65%    Downloading: 70%    Downloading: 75%    Downloading: 80%    Downloading: 85%    Downloading: 90%    Downloading: 95%    Downloading: 100%    Downloading: 100%
10-Apr-2017 00:14:47
10-Apr-2017 00:14:47   - Installing zendframework/zend-eventmanager (3.0.1)
10-Apr-2017 00:14:48     Downloading: Connecting...    Downloading: 0%               Downloading: 15%    Downloading: 30%    Downloading: 75%    Downloading: 90%    Downloading: 100%    Downloading: 100%
10-Apr-2017 00:14:48
10-Apr-2017 00:14:48   - Installing zendframework/zend-code (2.6.3)
10-Apr-2017 00:14:49     Downloading: Connecting...    Downloading: 0%               Downloading: 5%    Downloading: 10%    Downloading: 15%    Downloading: 20%    Downloading: 25%    Downloading: 30%    Downloading: 35%    Downloading: 40%    Downloading: 45%    Downloading: 50%    Downloading: 55%    Downloading: 60%    Downloading: 65%    Downloading: 70%    Downloading: 75%    Downloading: 80%    Downloading: 85%    Downloading: 90%    Downloading: 100%    Downloading: 100%
10-Apr-2017 00:14:49
10-Apr-2017 00:14:49   - Installing ocramius/proxy-manager (1.0.2)
10-Apr-2017 00:14:50     Downloading: Connecting...    Downloading: 0%               Downloading: 5%    Downloading: 10%    Downloading: 15%    Downloading: 20%    Downloading: 25%    Downloading: 30%    Downloading: 35%    Downloading: 40%    Downloading: 45%    Downloading: 50%    Downloading: 55%    Downloading: 65%    Downloading: 70%    Downloading: 75%    Downloading: 80%    Downloading: 85%    Downloading: 90%    Downloading: 95%    Downloading: 100%    Downloading: 100%
10-Apr-2017 00:14:50
10-Apr-2017 00:14:50   - Installing symfony/proxy-manager-bridge (v3.2.0)
10-Apr-2017 00:14:51     Downloading: Connecting...    Downloading: 100%         
10-Apr-2017 00:14:51
10-Apr-2017 00:14:51   - Installing symfony/routing (v3.2.0)
10-Apr-2017 00:14:53     Downloading: Connecting...    Downloading: 100%         
10-Apr-2017 00:14:53
10-Apr-2017 00:14:53   - Installing twig/twig (v1.24.2)
10-Apr-2017 00:14:54     Downloading: Connecting...    Downloading: 0%               Downloading: 5%    Downloading: 10%    Downloading: 15%    Downloading: 20%    Downloading: 25%    Downloading: 30%    Downloading: 35%    Downloading: 40%    Downloading: 45%    Downloading: 50%    Downloading: 55%    Downloading: 60%    Downloading: 65%    Downloading: 70%    Downloading: 75%    Downloading: 80%    Downloading: 85%    Downloading: 90%    Downloading: 95%    Downloading: 100%    Downloading: 100%
10-Apr-2017 00:14:54
10-Apr-2017 00:14:54   - Installing symfony/twig-bridge (v3.1.4)
10-Apr-2017 00:14:56     Downloading: Connecting...    Downloading: 100%         
10-Apr-2017 00:14:56
10-Apr-2017 00:14:56   - Installing symfony/dom-crawler (v3.2.0)
10-Apr-2017 00:14:57     Downloading: Connecting...    Downloading: 100%         
10-Apr-2017 00:14:57
10-Apr-2017 00:14:57   - Installing symfony/css-selector (v3.2.0)
10-Apr-2017 00:14:58     Downloading: Connecting...    Downloading: 100%         
10-Apr-2017 00:14:58
10-Apr-2017 00:14:58   - Installing symfony/browser-kit (v3.2.0)
10-Apr-2017 00:15:00     Downloading: Connecting...    Downloading: 100%         
10-Apr-2017 00:15:00
10-Apr-2017 00:15:00   - Installing guzzlehttp/guzzle (6.2.2)
10-Apr-2017 00:15:01     Downloading: Connecting...    Downloading: 0%               Downloading: 5%    Downloading: 10%    Downloading: 15%    Downloading: 20%    Downloading: 25%    Downloading: 35%    Downloading: 45%    Downloading: 50%    Downloading: 60%    Downloading: 65%    Downloading: 70%    Downloading: 75%    Downloading: 85%    Downloading: 90%    Downloading: 100%    Downloading: 100%
10-Apr-2017 00:15:01
10-Apr-2017 00:15:01   - Installing fabpot/goutte (v3.2.0)
10-Apr-2017 00:15:02     Downloading: Connecting...    Downloading: 0%               Downloading: 70%    Downloading: 100%
10-Apr-2017 00:15:02
10-Apr-2017 00:15:02   - Installing facebook/webdriver (1.2.0)
10-Apr-2017 00:15:03     Downloading: Connecting...    Downloading: 0%               Downloading: 5%    Downloading: 10%    Downloading: 15%    Downloading: 20%    Downloading: 25%    Downloading: 30%    Downloading: 35%    Downloading: 40%    Downloading: 45%    Downloading: 50%    Downloading: 55%    Downloading: 60%    Downloading: 65%    Downloading: 70%    Downloading: 75%    Downloading: 80%    Downloading: 85%    Downloading: 90%    Downloading: 95%    Downloading: 100%    Downloading: 100%
10-Apr-2017 00:15:03
10-Apr-2017 00:15:03   - Installing symfony/process (v3.2.0)
10-Apr-2017 00:15:04     Downloading: Connecting...    Downloading: 0%               Downloading: 20%    Downloading: 35%    Downloading: 50%    Downloading: 65%    Downloading: 70%    Downloading: 80%    Downloading: 95%    Downloading: 100%    Downloading: 100%
10-Apr-2017 00:15:04
10-Apr-2017 00:15:04   - Installing symfony/console (v3.2.0)
10-Apr-2017 00:15:06     Downloading: Connecting...    Downloading: 0%               Downloading: 5%    Downloading: 10%    Downloading: 15%    Downloading: 20%    Downloading: 25%    Downloading: 30%    Downloading: 35%    Downloading: 40%    Downloading: 45%    Downloading: 50%    Downloading: 55%    Downloading: 60%    Downloading: 65%    Downloading: 70%    Downloading: 75%    Downloading: 80%    Downloading: 85%    Downloading: 90%    Downloading: 95%    Downloading: 100%    Downloading: 100%
10-Apr-2017 00:15:06
10-Apr-2017 00:15:06   - Installing laravel/homestead (v4.0.5)
10-Apr-2017 00:15:07     Downloading: Connecting...    Downloading: 100%         
10-Apr-2017 00:15:07
10-Apr-2017 00:15:07   - Installing phing/phing (2.4.14)
10-Apr-2017 00:15:09     Downloading: Connecting...    Downloading: 100%         
10-Apr-2017 00:15:09
10-Apr-2017 00:15:09   - Installing phpdocumentor/reflection-docblock (2.0.4)
10-Apr-2017 00:15:10     Downloading: Connecting...    Downloading: 0%               Downloading: 15%    Downloading: 20%    Downloading: 30%    Downloading: 35%    Downloading: 50%    Downloading: 55%    Downloading: 70%    Downloading: 85%    Downloading: 90%    Downloading: 100%
10-Apr-2017 00:15:10
10-Apr-2017 00:15:10   - Installing phpdocumentor/reflection-common (1.0)
10-Apr-2017 00:15:11     Downloading: Connecting...    Downloading: 0%               Downloading: 65%    Downloading: 100%    Downloading: 100%
10-Apr-2017 00:15:11
10-Apr-2017 00:15:11   - Installing phpdocumentor/type-resolver (0.2.1)
10-Apr-2017 00:15:12     Downloading: Connecting...    Downloading: 0%               Downloading: 20%    Downloading: 35%    Downloading: 80%    Downloading: 100%    Downloading: 100%
10-Apr-2017 00:15:12
10-Apr-2017 00:15:12   - Installing symfony/yaml (v3.2.0)
10-Apr-2017 00:15:13     Downloading: Connecting...    Downloading: 0%               Downloading: 10%    Downloading: 15%    Downloading: 25%    Downloading: 35%    Downloading: 50%    Downloading: 60%    Downloading: 70%    Downloading: 75%    Downloading: 85%    Downloading: 95%    Downloading: 100%    Downloading: 100%
10-Apr-2017 00:15:13
10-Apr-2017 00:15:13   - Installing sebastian/version (1.0.6)
10-Apr-2017 00:15:14     Downloading: Connecting...    Downloading: 0%               Downloading: 100%    Downloading: 100%
10-Apr-2017 00:15:14
10-Apr-2017 00:15:14   - Installing sebastian/global-state (1.1.1)
10-Apr-2017 00:15:15     Downloading: Connecting...    Downloading: 0%               Downloading: 40%    Downloading: 70%    Downloading: 100%    Downloading: 100%
10-Apr-2017 00:15:15
10-Apr-2017 00:15:15   - Installing sebastian/recursion-context (1.0.2)
10-Apr-2017 00:15:16     Downloading: Connecting...    Downloading: 0%               Downloading: 35%    Downloading: 70%    Downloading: 100%    Downloading: 100%
10-Apr-2017 00:15:16
10-Apr-2017 00:15:16   - Installing sebastian/exporter (1.2.2)
10-Apr-2017 00:15:17     Downloading: Connecting...    Downloading: 0%               Downloading: 100%    Downloading: 100%
10-Apr-2017 00:15:17
10-Apr-2017 00:15:17   - Installing sebastian/environment (1.3.8)
10-Apr-2017 00:15:18     Downloading: Connecting...    Downloading: 0%               Downloading: 15%    Downloading: 30%    Downloading: 45%    Downloading: 60%    Downloading: 75%    Downloading: 100%    Downloading: 100%
10-Apr-2017 00:15:18
10-Apr-2017 00:15:18   - Installing sebastian/diff (1.4.1)
10-Apr-2017 00:15:19     Downloading: Connecting...    Downloading: 0%               Downloading: 15%    Downloading: 30%    Downloading: 45%    Downloading: 100%    Downloading: 100%
10-Apr-2017 00:15:19
10-Apr-2017 00:15:19   - Installing sebastian/comparator (1.2.2)
10-Apr-2017 00:15:20     Downloading: Connecting...    Downloading: 0%               Downloading: 10%    Downloading: 20%    Downloading: 30%    Downloading: 40%    Downloading: 45%    Downloading: 55%    Downloading: 65%    Downloading: 75%    Downloading: 85%    Downloading: 100%    Downloading: 100%
10-Apr-2017 00:15:20
10-Apr-2017 00:15:20   - Installing phpunit/php-text-template (1.2.1)
10-Apr-2017 00:15:21     Downloading: Connecting...    Downloading: 0%               Downloading: 35%    Downloading: 100%    Downloading: 100%
10-Apr-2017 00:15:21
10-Apr-2017 00:15:21   - Installing doctrine/instantiator (1.0.5)
10-Apr-2017 00:15:22     Downloading: Connecting...    Downloading: 0%               Downloading: 15%    Downloading: 25%    Downloading: 40%    Downloading: 50%    Downloading: 65%    Downloading: 75%    Downloading: 90%    Downloading: 100%    Downloading: 100%
10-Apr-2017 00:15:22
10-Apr-2017 00:15:22   - Installing phpunit/phpunit-mock-objects (2.3.8)
10-Apr-2017 00:15:23     Downloading: Connecting...    Downloading: 0%               Downloading: 5%    Downloading: 20%    Downloading: 25%    Downloading: 35%    Downloading: 40%    Downloading: 45%    Downloading: 50%    Downloading: 60%    Downloading: 65%    Downloading: 70%    Downloading: 75%    Downloading: 90%    Downloading: 95%    Downloading: 100%    Downloading: 100%
10-Apr-2017 00:15:23
10-Apr-2017 00:15:23   - Installing phpunit/php-timer (1.0.8)
10-Apr-2017 00:15:24     Downloading: Connecting...    Downloading: 0%               Downloading: 100%    Downloading: 100%
10-Apr-2017 00:15:24
10-Apr-2017 00:15:24   - Installing phpunit/php-file-iterator (1.4.2)
10-Apr-2017 00:15:25     Downloading: Connecting...    Downloading: 0%               Downloading: 20%    Downloading: 40%    Downloading: 60%    Downloading: 100%    Downloading: 100%
10-Apr-2017 00:15:25
10-Apr-2017 00:15:25   - Installing phpunit/php-token-stream (1.4.9)
10-Apr-2017 00:15:26     Downloading: Connecting...    Downloading: 0%               Downloading: 5%    Downloading: 10%    Downloading: 15%    Downloading: 20%    Downloading: 65%    Downloading: 70%    Downloading: 75%    Downloading: 80%    Downloading: 85%    Downloading: 90%    Downloading: 95%    Downloading: 100%    Downloading: 100%
10-Apr-2017 00:15:26
10-Apr-2017 00:15:26   - Installing phpunit/php-code-coverage (2.2.4)
10-Apr-2017 00:15:28     Downloading: Connecting...    Downloading: 0%               Downloading: 5%    Downloading: 10%    Downloading: 15%    Downloading: 20%    Downloading: 25%    Downloading: 30%    Downloading: 35%    Downloading: 40%    Downloading: 45%    Downloading: 50%    Downloading: 55%    Downloading: 60%    Downloading: 65%    Downloading: 75%    Downloading: 85%    Downloading: 90%    Downloading: 100%    Downloading: 100%
10-Apr-2017 00:15:28
10-Apr-2017 00:15:28   - Installing phpspec/prophecy (v1.6.2)
10-Apr-2017 00:15:29     Downloading: Connecting...    Downloading: 0%               Downloading: 5%    Downloading: 10%    Downloading: 15%    Downloading: 20%    Downloading: 25%    Downloading: 30%    Downloading: 35%    Downloading: 40%    Downloading: 45%    Downloading: 50%    Downloading: 55%    Downloading: 60%    Downloading: 65%    Downloading: 70%    Downloading: 75%    Downloading: 80%    Downloading: 85%    Downloading: 90%    Downloading: 95%    Downloading: 100%    Downloading: 100%
10-Apr-2017 00:15:29
10-Apr-2017 00:15:29   - Installing phpunit/phpunit (4.8.31)
10-Apr-2017 00:15:31     Downloading: Connecting...    Downloading: 0%               Downloading: 5%    Downloading: 10%    Downloading: 15%    Downloading: 20%    Downloading: 25%    Downloading: 30%    Downloading: 35%    Downloading: 40%    Downloading: 45%    Downloading: 50%    Downloading: 55%    Downloading: 60%    Downloading: 65%    Downloading: 70%    Downloading: 80%    Downloading: 90%    Downloading: 100%    Downloading: 100%
10-Apr-2017 00:15:31
10-Apr-2017 00:15:31   - Installing phpunit/dbunit (2.0.3)
10-Apr-2017 00:15:32     Downloading: Connecting...    Downloading: 100%         
10-Apr-2017 00:15:32
10-Apr-2017 00:15:32   - Installing squizlabs/php_codesniffer (2.7.1)
10-Apr-2017 00:15:34     Downloading: Connecting...    Downloading: 0%               Downloading: 5%    Downloading: 10%    Downloading: 15%    Downloading: 20%    Downloading: 25%    Downloading: 30%    Downloading: 35%    Downloading: 40%    Downloading: 45%    Downloading: 50%    Downloading: 55%    Downloading: 60%    Downloading: 65%    Downloading: 75%    Downloading: 80%    Downloading: 85%    Downloading: 90%    Downloading: 95%    Downloading: 100%    Downloading: 100%
10-Apr-2017 00:15:34
10-Apr-2017 00:15:34   - Installing webmozart/assert (1.2.0)
10-Apr-2017 00:15:35     Downloading: Connecting...    Downloading: 0%               Downloading: 55%    Downloading: 80%    Downloading: 100%    Downloading: 100%
10-Apr-2017 00:15:35
10-Apr-2017 00:15:37 lusitanian/oauth suggests installing predis/predis (Allows using the Redis storage backend.)
10-Apr-2017 00:15:37 paragonie/random_compat suggests installing ext-libsodium (Provides a modern crypto API that can be used to generate random bytes.)
10-Apr-2017 00:15:37 patchwork/utf8 suggests installing ext-intl (Use Intl for best performance)
10-Apr-2017 00:15:37 patchwork/utf8 suggests installing ext-wfio (Use WFIO for UTF-8 filesystem access on Windows)
10-Apr-2017 00:15:37 s9e/text-formatter suggests installing ext-intl (Allows international URLs to be accepted by the URL filter)
10-Apr-2017 00:15:37 s9e/text-formatter suggests installing ext-xsl (Enables the XSLT renderer)
10-Apr-2017 00:15:37 symfony/http-kernel suggests installing symfony/class-loader ()
10-Apr-2017 00:15:37 symfony/http-kernel suggests installing symfony/var-dumper ()
10-Apr-2017 00:15:37 symfony/dependency-injection suggests installing symfony/expression-language (For using expressions in service container configuration)
10-Apr-2017 00:15:37 zendframework/zend-eventmanager suggests installing container-interop/container-interop (^1.1.0, to use the lazy listeners feature)
10-Apr-2017 00:15:37 zendframework/zend-eventmanager suggests installing zendframework/zend-stdlib (^2.7.3 || ^3.0, to use the FilterChain feature)
10-Apr-2017 00:15:37 zendframework/zend-code suggests installing doctrine/annotations (Doctrine\Common\Annotations >=1.0 for annotation features)
10-Apr-2017 00:15:37 zendframework/zend-code suggests installing zendframework/zend-stdlib (Zend\Stdlib component)
10-Apr-2017 00:15:37 ocramius/proxy-manager suggests installing ocramius/generated-hydrator (To have very fast object to array to object conversion for ghost objects)
10-Apr-2017 00:15:37 ocramius/proxy-manager suggests installing zendframework/zend-json (To have the JsonRpc adapter (Remote Object feature))
10-Apr-2017 00:15:37 ocramius/proxy-manager suggests installing zendframework/zend-soap (To have the Soap adapter (Remote Object feature))
10-Apr-2017 00:15:37 ocramius/proxy-manager suggests installing zendframework/zend-stdlib (To use the hydrator proxy)
10-Apr-2017 00:15:37 ocramius/proxy-manager suggests installing zendframework/zend-xmlrpc (To have the XmlRpc adapter (Remote Object feature))
10-Apr-2017 00:15:37 symfony/routing suggests installing doctrine/annotations (For using the annotation loader)
10-Apr-2017 00:15:37 symfony/routing suggests installing symfony/expression-language (For using expression matching)
10-Apr-2017 00:15:37 symfony/twig-bridge suggests installing symfony/asset (For using the AssetExtension)
10-Apr-2017 00:15:37 symfony/twig-bridge suggests installing symfony/expression-language (For using the ExpressionExtension)
10-Apr-2017 00:15:37 symfony/twig-bridge suggests installing symfony/form (For using the FormExtension)
10-Apr-2017 00:15:37 symfony/twig-bridge suggests installing symfony/security (For using the SecurityExtension)
10-Apr-2017 00:15:37 symfony/twig-bridge suggests installing symfony/stopwatch (For using the StopwatchExtension)
10-Apr-2017 00:15:37 symfony/twig-bridge suggests installing symfony/templating (For using the TwigEngine)
10-Apr-2017 00:15:37 symfony/twig-bridge suggests installing symfony/translation (For using the TranslationExtension)
10-Apr-2017 00:15:37 symfony/twig-bridge suggests installing symfony/var-dumper (For using the DumpExtension)
10-Apr-2017 00:15:37 facebook/webdriver suggests installing phpdocumentor/phpdocumentor (2.*)
10-Apr-2017 00:15:37 phpdocumentor/reflection-docblock suggests installing dflydev/markdown (~1.0)
10-Apr-2017 00:15:37 phpdocumentor/reflection-docblock suggests installing erusev/parsedown (~1.0)
10-Apr-2017 00:15:37 sebastian/global-state suggests installing ext-uopz (*)
10-Apr-2017 00:15:37 phpunit/phpunit-mock-objects suggests installing ext-soap (*)
10-Apr-2017 00:15:37 phpunit/phpunit suggests installing phpunit/php-invoker (~1.1)
10-Apr-2017 00:15:37 Generating autoload files
10-Apr-2017 00:15:37 Buildfile: /data/build/build.xml
10-Apr-2017 00:15:37
10-Apr-2017 00:15:37 phpBB > clean:
10-Apr-2017 00:15:37
10-Apr-2017 00:15:37    [delete] Directory /data/build/logs does not exist or is not a directory.
10-Apr-2017 00:15:37    [delete] Directory /data/build/api does not exist or is not a directory.
10-Apr-2017 00:15:37    [delete] Directory /data/build/codebrowser does not exist or is not a directory.
10-Apr-2017 00:15:37    [delete] Directory /data/build/coverage does not exist or is not a directory.
10-Apr-2017 00:15:37    [delete] Directory /data/build/cpd does not exist or is not a directory.
10-Apr-2017 00:15:37    [delete] Directory /data/build/dependencies does not exist or is not a directory.
10-Apr-2017 00:15:37    [delete] Directory /data/build/new_version does not exist or is not a directory.
10-Apr-2017 00:15:37    [delete] Directory /data/build/old_versions does not exist or is not a directory.
10-Apr-2017 00:15:37    [delete] Directory /data/build/save does not exist or is not a directory.
10-Apr-2017 00:15:37
10-Apr-2017 00:15:37 phpBB > prepare:
10-Apr-2017 00:15:37
10-Apr-2017 00:15:37     [mkdir] Created dir: /data/build/logs
10-Apr-2017 00:15:37     [mkdir] Created dir: /data/build/api
10-Apr-2017 00:15:37     [mkdir] Created dir: /data/build/codebrowser
10-Apr-2017 00:15:37     [mkdir] Created dir: /data/build/coverage
10-Apr-2017 00:15:37     [mkdir] Created dir: /data/build/cpd
10-Apr-2017 00:15:37     [mkdir] Created dir: /data/build/dependencies
10-Apr-2017 00:15:37     [mkdir] Created dir: /data/build/new_version
10-Apr-2017 00:15:37     [mkdir] Created dir: /data/build/new_version/files
10-Apr-2017 00:15:37     [mkdir] Created dir: /data/build/new_version/patches
10-Apr-2017 00:15:37     [mkdir] Created dir: /data/build/new_version/release_files
10-Apr-2017 00:15:37     [mkdir] Created dir: /data/build/new_version/update
10-Apr-2017 00:15:37     [mkdir] Created dir: /data/build/old_versions
10-Apr-2017 00:15:37     [mkdir] Created dir: /data/build/save
10-Apr-2017 00:15:37
10-Apr-2017 00:15:37 BUILD FINISHED
10-Apr-2017 00:15:37
10-Apr-2017 00:15:37 Total time: 0.1136 seconds
10-Apr-2017 00:15:37
10-Apr-2017 00:15:38 Finished task 'Prepare directory' with result: Success
10-Apr-2017 00:15:38 Skipping execution of task 'Run sniffs' as it is disabled
10-Apr-2017 00:15:38
Substituting variable: ${bamboo.working.directory} with /home/bamboo/xml-data/build-dir/PHPBB3-PR-JOB1
10-Apr-2017 00:15:38 Starting task 'Run sniffs' of type 'com.atlassian.bamboo.plugins.bamboo-docker-plugin:task.docker.cli'
10-Apr-2017 00:15:38 Running image name (phpbb:php-5.6)
10-Apr-2017 00:15:38
Beginning to execute external process for build 'phpBB3 - Pull Requests - Build and Test Job #6968 (PHPBB3-PR-JOB1-6968)'
... running command line:
/usr/bin/docker run --volume /home/bamboo/xml-data/build-dir/PHPBB3-PR-JOB1:/data --workdir /data/build --rm -u=991 phpbb:php-5.6 ../phpBB/vendor/bin/phing sniff
... in: /home/bamboo/xml-data/build-dir/PHPBB3-PR-JOB1
... using extra environment variables:
bamboo_planRepository_1_branch=3.1.x
bamboo_planRepository_1_branchDisplayName=3.1.x
bamboo_repository_revision_number=3bf133c96ca34195024feb16bed812aa8dc77184
bamboo_PRref=master
bamboo_resultsUrl=https://bamboo.phpbb.com/browse/PHPBB3-PR-JOB1-6968
bamboo_capability_system_builder_command_Git=/usr/bin/git
bamboo_repository_75956235_git_username=bantu
bamboo_planRepository_1_name=phpBB Ascraeus
bamboo_build_working_directory=/home/bamboo/xml-data/build-dir/PHPBB3-PR-JOB1
bamboo_buildKey=PHPBB3-PR-JOB1
bamboo_capability_phpbb_tests=true
bamboo_shortPlanName=Pull Requests
bamboo_capability_system_builder_command_fop=/usr/bin/fop
bamboo_capability_dbms_sqlite_2=true
bamboo_planRepository_name=phpBB Ascraeus
bamboo_PRnumber=4789
bamboo_buildNumber=6968
bamboo_repository_75956235_git_repositoryUrl=https://github.com/phpbb/phpbb.git
bamboo_capability_system_builder_phpunit_PHPUnit=/usr/bin/phpunit
bamboo_shortJobName=Build and Test Job
bamboo_buildResultsUrl=https://bamboo.phpbb.com/browse/PHPBB3-PR-JOB1-6968
bamboo_repository_75956235_branch_name=3.1.x
bamboo_planRepository_repositoryUrl=https://github.com/phpbb/phpbb.git
bamboo_agentId=131073
bamboo_planName=phpBB3 - Pull Requests
bamboo_build_commandline_com_atlassian_bamboo_plugins_scripttask_task_builder_script_7=/bin/sh /home/bamboo/temp/PHPBB3-PR-JOB1-6968-ScriptBuildTask-8348191571132531260.sh
bamboo_shortPlanKey=PR
bamboo_shortJobKey=JOB1
bamboo_capability_dbms_mysql_55=true
bamboo_capability_system_jdk_JDK_1_7_0_65=/usr/lib/jvm/java-7-openjdk-amd64
bamboo_planRepository_revision=3bf133c96ca34195024feb16bed812aa8dc77184
bamboo_repository_previous_revision_number=3bf133c96ca34195024feb16bed812aa8dc77184
bamboo_buildTimeStamp=2017-04-10T00:14:17.202Z
bamboo_planRepository_previousRevision=3bf133c96ca34195024feb16bed812aa8dc77184
bamboo_capability_system_builder_mvn2_Maven_2=/usr/share/maven2
bamboo_capability_system_jdk_JDK_1_6_0_16=/usr/lib/jvm/java-6-sun-1.6.0.16
bamboo_build_commandline_com_atlassian_bamboo_plugins_scripttask_task_builder_script_4=/bin/sh /home/bamboo/temp/PHPBB3-PR-JOB1-6968-ScriptBuildTask-3317503114440974297.sh
bamboo_buildResultKey=PHPBB3-PR-JOB1-6968
bamboo_repository_git_branch=3.1.x
bamboo_repository_branch_name=3.1.x
bamboo_buildPlanName=phpBB3 - Pull Requests - Build and Test Job
bamboo_planRepository_1_revision=3bf133c96ca34195024feb16bed812aa8dc77184
bamboo_repository_name=phpBB Ascraeus
bamboo_capability_system_docker_executable=/usr/bin/docker
bamboo_build_commandline_com_atlassian_bamboo_plugins_bamboo_docker_plugin_task_docker_cli_12=/usr/bin/docker run --volume /home/bamboo/xml-data/build-dir/PHPBB3-PR-JOB1:/data --workdir /data/phpBB --rm -e HOME=/home/bamboo -u=991 phpbb:php-5.6 /bin/bash -c php ../composer.phar install --dev; cd ../build; ../phpBB/vendor/bin/phing clean prepare
bamboo_planRepository_branch=3.1.x
bamboo_agentWorkingDirectory=/home/bamboo/xml-data/build-dir
bamboo_capability_system_git_executable=/usr/bin/git
bamboo_planRepository_1_previousRevision=3bf133c96ca34195024feb16bed812aa8dc77184
bamboo_capability_system_builder_phpunit_PHPUnit_3_4=/usr/bin/phpunit
bamboo_repository_git_username=bantu
bamboo_repository_75956235_revision_number=3bf133c96ca34195024feb16bed812aa8dc77184
bamboo_planRepository_branchDisplayName=3.1.x
bamboo_planRepository_1_type=gitv2
bamboo_planRepository_branchName=3.1.x
bamboo_repository_75956235_previous_revision_number=3bf133c96ca34195024feb16bed812aa8dc77184
bamboo_capability_system_jdk_JDK=/usr/lib/jvm/java-6-sun
bamboo_plan_storageTag=PHPBB3-PR
bamboo_planRepository_type=gitv2
bamboo_planRepository_1_username=bantu
bamboo_ManualBuildTriggerReason_userName=Build Robot
bamboo_repository_git_repositoryUrl=https://github.com/phpbb/phpbb.git
bamboo_repository_75956235_git_branch=3.1.x
bamboo_capability_system_builder_ant_Ant=/usr/share/ant
bamboo_repository_75956235_name=phpBB Ascraeus
bamboo_working_directory=/home/bamboo/xml-data/build-dir/PHPBB3-PR-JOB1
bamboo_planKey=PHPBB3-PR
bamboo_planRepository_1_repositoryUrl=https://github.com/phpbb/phpbb.git
bamboo_planRepository_username=bantu
bamboo_capability_local=true
bamboo_capability_system_jdk_JDK_1_6=/usr/lib/jvm/java-6-sun
bamboo_capability_system_jdk_JDK_1_7=/usr/lib/jvm/java-7-openjdk-amd64
bamboo_planRepository_1_branchName=3.1.x
10-Apr-2017 00:15:38 Buildfile: /data/build/build.xml
10-Apr-2017 00:15:38
10-Apr-2017 00:15:38 phpBB > sniff:
10-Apr-2017 00:15:38
10-Apr-2017 00:15:46 ............................................................  60 / 683 (9%)
10-Apr-2017 00:15:47 ............................................................ 120 / 683 (18%)
10-Apr-2017 00:15:48 ............................................................ 180 / 683 (26%)
10-Apr-2017 00:15:50 ............................................................ 240 / 683 (35%)
10-Apr-2017 00:15:55 ............................................................ 300 / 683 (44%)
10-Apr-2017 00:16:00 ............................................................ 360 / 683 (53%)
10-Apr-2017 00:16:05 ............................................................ 420 / 683 (61%)
10-Apr-2017 00:16:09 ............................................................ 480 / 683 (70%)
10-Apr-2017 00:16:13 ............................................................ 540 / 683 (79%)
10-Apr-2017 00:16:17 ............................................................ 600 / 683 (88%)
10-Apr-2017 00:16:19 .............................E.......................E...... 660 / 683 (97%)
10-Apr-2017 00:16:20 .......................
10-Apr-2017 00:16:20
10-Apr-2017 00:16:20
10-Apr-2017 00:16:20 FILE: /data/phpBB/phpbb/bitfield/bitfield.php
10-Apr-2017 00:16:20 ----------------------------------------------------------------------
10-Apr-2017 00:16:20 FOUND 2 ERRORS AFFECTING 2 LINES
10-Apr-2017 00:16:20 ----------------------------------------------------------------------
10-Apr-2017 00:16:20 1 | ERROR | Missing required file doc comment.
10-Apr-2017 00:16:20    |       | (phpbb.Commenting.FileComment)
10-Apr-2017 00:16:20 9 | ERROR | PHP4 style constructors are not allowed; use "__construct()"
10-Apr-2017 00:16:20    |       | instead (Generic.NamingConventions.ConstructorName.OldStyle)
10-Apr-2017 00:16:20 ----------------------------------------------------------------------
10-Apr-2017 00:16:20
10-Apr-2017 00:16:20
10-Apr-2017 00:16:20 FILE: /data/phpBB/phpbb/style/manager.php
10-Apr-2017 00:16:20 ----------------------------------------------------------------------
10-Apr-2017 00:16:20 FOUND 2 ERRORS AFFECTING 2 LINES
10-Apr-2017 00:16:20 ----------------------------------------------------------------------
10-Apr-2017 00:16:20 16 | ERROR | There must not be unused USE statements.
10-Apr-2017 00:16:20     |       | (phpbb.Namespaces.UnusedUse.Unused)
10-Apr-2017 00:16:20 45 | ERROR | Arguments with default values must be at the end of the
10-Apr-2017 00:16:20     |       | argument list (PEAR.Functions.ValidDefaultValue.NotAtEnd)
10-Apr-2017 00:16:20 ----------------------------------------------------------------------
10-Apr-2017 00:16:20
10-Apr-2017 00:16:20 Time: 42.27 secs; Memory: 77.25Mb
10-Apr-2017 00:16:20
10-Apr-2017 00:16:28 ............................................................  60 / 206 (29%)
10-Apr-2017 00:16:46 ............................................................ 120 / 206 (58%)
10-Apr-2017 00:17:00 ............................................................ 180 / 206 (87%)
10-Apr-2017 00:17:07 ..........................
10-Apr-2017 00:17:07
10-Apr-2017 00:17:07 Time: 46.56 secs; Memory: 60.5Mb
10-Apr-2017 00:17:07
10-Apr-2017 00:17:07
10-Apr-2017 00:17:07
10-Apr-2017 00:17:07 Time: 16ms; Memory: 3.75Mb
10-Apr-2017 00:17:07
10-Apr-2017 00:17:07        [if] Error in IfTask
10-Apr-2017 00:17:07 Execution of target "sniff" failed for the following reason: /data/build/build.xml:108:6: /data/build/build.xml:114:9: PHP Code Sniffer failed.
10-Apr-2017 00:17:07
10-Apr-2017 00:17:07 BUILD FAILED
10-Apr-2017 00:17:07 /data/build/build.xml:108:6: /data/build/build.xml:114:9: PHP Code Sniffer failed.
10-Apr-2017 00:17:07 Total time: 1 minutes  29.21 seconds
10-Apr-2017 00:17:07
10-Apr-2017 00:17:07 Failing task since return code of [/usr/bin/docker run --volume /home/bamboo/xml-data/build-dir/PHPBB3-PR-JOB1:/data --workdir /data/build --rm -u=991 phpbb:php-5.6 ../phpBB/vendor/bin/phing sniff] was 1 while expected 0
10-Apr-2017 00:17:07 Error occurred while running Task 'Run sniffs(11)' of type com.atlassian.bamboo.plugins.bamboo-docker-plugin:task.docker.cli.
10-Apr-2017 00:17:07 com.atlassian.bamboo.task.TaskException: Failed to execute task
10-Apr-2017 00:17:07         at com.atlassian.bamboo.plugins.docker.service.RunService.execute(RunService.java:71)
10-Apr-2017 00:17:07         at com.atlassian.bamboo.plugins.docker.tasks.cli.DockerCliTask.execute(DockerCliTask.java:60)
10-Apr-2017 00:17:07         at com.atlassian.bamboo.task.TaskExecutorImpl.lambda$executeTasks$3(TaskExecutorImpl.java:317)
10-Apr-2017 00:17:07         at com.atlassian.bamboo.task.TaskExecutorImpl.executeTaskWithPrePostActions(TaskExecutorImpl.java:246)
10-Apr-2017 00:17:07         at com.atlassian.bamboo.task.TaskExecutorImpl.executeTasks(TaskExecutorImpl.java:317)
10-Apr-2017 00:17:07         at com.atlassian.bamboo.task.TaskExecutorImpl.execute(TaskExecutorImpl.java:118)
10-Apr-2017 00:17:07         at com.atlassian.bamboo.build.pipeline.tasks.ExecuteBuildTask.call(ExecuteBuildTask.java:74)
10-Apr-2017 00:17:07         at com.atlassian.bamboo.v2.build.agent.DefaultBuildAgent.build(DefaultBuildAgent.java:216)
10-Apr-2017 00:17:07         at com.atlassian.bamboo.v2.build.agent.BuildAgentControllerImpl$1.call(BuildAgentControllerImpl.java:139)
10-Apr-2017 00:17:07         at com.atlassian.bamboo.v2.build.agent.BuildAgentControllerImpl$1.call(BuildAgentControllerImpl.java:130)
10-Apr-2017 00:17:07         at com.atlassian.bamboo.variable.CustomVariableContextImpl.withVariableSubstitutor(CustomVariableContextImpl.java:221)
10-Apr-2017 00:17:07         at com.atlassian.bamboo.v2.build.agent.BuildAgentControllerImpl.waitAndPerformBuild(BuildAgentControllerImpl.java:129)
10-Apr-2017 00:17:07         at com.atlassian.bamboo.v2.build.agent.DefaultBuildAgent$1.run(DefaultBuildAgent.java:138)
10-Apr-2017 00:17:07         at com.atlassian.bamboo.utils.BambooRunnables$1.run(BambooRunnables.java:51)
10-Apr-2017 00:17:07         at com.atlassian.bamboo.security.ImpersonationHelper.runWith(ImpersonationHelper.java:31)
10-Apr-2017 00:17:07         at com.atlassian.bamboo.security.ImpersonationHelper.runWithSystemAuthority(ImpersonationHelper.java:20)
10-Apr-2017 00:17:07         at com.atlassian.bamboo.security.ImpersonationHelper$1.run(ImpersonationHelper.java:52)
10-Apr-2017 00:17:07         at java.lang.Thread.run(Thread.java:745)
10-Apr-2017 00:17:07 Caused by: com.atlassian.bamboo.plugins.docker.client.DockerException: Error running Docker run command
10-Apr-2017 00:17:07         at com.atlassian.bamboo.plugins.docker.client.DockerCmd.run(DockerCmd.java:103)
10-Apr-2017 00:17:07         at com.atlassian.bamboo.plugins.docker.service.RunService.execute(RunService.java:60)
10-Apr-2017 00:17:07         ... 17 more
10-Apr-2017 00:17:07 Caused by: com.atlassian.utils.process.ProcessException: Error executing /usr/bin/docker run --volume /home/bamboo/xml-data/build-dir/PHPBB3-PR-JOB1:/data --workdir /data/build --rm -u=991 phpbb:php-5.6 ../phpBB/vendor/bin/phing sniff
10-Apr-2017 00:17:07         at com.atlassian.bamboo.plugins.docker.process.DockerTaskProcessService.execute(DockerTaskProcessService.java:60)
10-Apr-2017 00:17:07         at com.atlassian.bamboo.plugins.docker.client.DockerCmd.run(DockerCmd.java:99)
10-Apr-2017 00:17:07         ... 18 more
10-Apr-2017 00:17:07 Starting task 'Parsing test results produced by script' of type 'com.atlassian.bamboo.plugins.testresultparser:task.testresultparser.junit'
10-Apr-2017 00:17:07 Parsing test results under /home/bamboo/xml-data/build-dir/PHPBB3-PR-JOB1...
10-Apr-2017 00:17:07 Failing task since test cases were expected but none were found.
10-Apr-2017 00:17:07 Finished task 'Parsing test results produced by script' with result: Failed
10-Apr-2017 00:17:07
Substituting variable: ${bamboo.PRnumber} with 4789
10-Apr-2017 00:17:07
Substituting variable: ${bamboo.buildResultsUrl} with https://bamboo.phpbb.com/browse/PHPBB3-PR-JOB1-6968
10-Apr-2017 00:17:07
Substituting variable: ${bamboo.buildResultsUrl} with https://bamboo.phpbb.com/browse/PHPBB3-PR-JOB1-6968
10-Apr-2017 00:17:07 Starting task 'Set result build status' of type 'com.atlassian.bamboo.plugins.scripttask:task.builder.script'
10-Apr-2017 00:17:07
Beginning to execute external process for build 'phpBB3 - Pull Requests - Build and Test Job #6968 (PHPBB3-PR-JOB1-6968)'
... running command line:
/bin/sh /home/bamboo/temp/PHPBB3-PR-JOB1-6968-ScriptBuildTask-5350746341242481220.sh
... in: /home/bamboo/xml-data/build-dir/PHPBB3-PR-JOB1
... using extra environment variables:
bamboo_planRepository_1_branch=3.1.x
bamboo_planRepository_1_branchDisplayName=3.1.x
bamboo_repository_revision_number=3bf133c96ca34195024feb16bed812aa8dc77184
bamboo_PRref=master
bamboo_resultsUrl=https://bamboo.phpbb.com/browse/PHPBB3-PR-JOB1-6968
bamboo_capability_system_builder_command_Git=/usr/bin/git
bamboo_repository_75956235_git_username=bantu
bamboo_planRepository_1_name=phpBB Ascraeus
bamboo_build_working_directory=/home/bamboo/xml-data/build-dir/PHPBB3-PR-JOB1
bamboo_buildKey=PHPBB3-PR-JOB1
bamboo_capability_phpbb_tests=true
bamboo_shortPlanName=Pull Requests
bamboo_capability_system_builder_command_fop=/usr/bin/fop
bamboo_capability_dbms_sqlite_2=true
bamboo_planRepository_name=phpBB Ascraeus
bamboo_PRnumber=4789
bamboo_buildNumber=6968
bamboo_repository_75956235_git_repositoryUrl=https://github.com/phpbb/phpbb.git
bamboo_capability_system_builder_phpunit_PHPUnit=/usr/bin/phpunit
bamboo_shortJobName=Build and Test Job
bamboo_buildResultsUrl=https://bamboo.phpbb.com/browse/PHPBB3-PR-JOB1-6968
bamboo_repository_75956235_branch_name=3.1.x
bamboo_planRepository_repositoryUrl=https://github.com/phpbb/phpbb.git
bamboo_agentId=131073
bamboo_planName=phpBB3 - Pull Requests
bamboo_build_commandline_com_atlassian_bamboo_plugins_scripttask_task_builder_script_7=/bin/sh /home/bamboo/temp/PHPBB3-PR-JOB1-6968-ScriptBuildTask-8348191571132531260.sh
bamboo_shortPlanKey=PR
bamboo_shortJobKey=JOB1
bamboo_capability_dbms_mysql_55=true
bamboo_capability_system_jdk_JDK_1_7_0_65=/usr/lib/jvm/java-7-openjdk-amd64
bamboo_planRepository_revision=3bf133c96ca34195024feb16bed812aa8dc77184
bamboo_repository_previous_revision_number=3bf133c96ca34195024feb16bed812aa8dc77184
bamboo_buildTimeStamp=2017-04-10T00:14:17.202Z
bamboo_planRepository_previousRevision=3bf133c96ca34195024feb16bed812aa8dc77184
bamboo_capability_system_builder_mvn2_Maven_2=/usr/share/maven2
bamboo_capability_system_jdk_JDK_1_6_0_16=/usr/lib/jvm/java-6-sun-1.6.0.16
bamboo_build_commandline_com_atlassian_bamboo_plugins_scripttask_task_builder_script_4=/bin/sh /home/bamboo/temp/PHPBB3-PR-JOB1-6968-ScriptBuildTask-3317503114440974297.sh
bamboo_buildResultKey=PHPBB3-PR-JOB1-6968
bamboo_repository_git_branch=3.1.x
bamboo_repository_branch_name=3.1.x
bamboo_buildPlanName=phpBB3 - Pull Requests - Build and Test Job
bamboo_planRepository_1_revision=3bf133c96ca34195024feb16bed812aa8dc77184
bamboo_repository_name=phpBB Ascraeus
bamboo_capability_system_docker_executable=/usr/bin/docker
bamboo_build_commandline_com_atlassian_bamboo_plugins_bamboo_docker_plugin_task_docker_cli_11=/usr/bin/docker run --volume /home/bamboo/xml-data/build-dir/PHPBB3-PR-JOB1:/data --workdir /data/build --rm -u=991 phpbb:php-5.6 ../phpBB/vendor/bin/phing sniff
bamboo_build_commandline_com_atlassian_bamboo_plugins_bamboo_docker_plugin_task_docker_cli_12=/usr/bin/docker run --volume /home/bamboo/xml-data/build-dir/PHPBB3-PR-JOB1:/data --workdir /data/phpBB --rm -e HOME=/home/bamboo -u=991 phpbb:php-5.6 /bin/bash -c php ../composer.phar install --dev; cd ../build; ../phpBB/vendor/bin/phing clean prepare
bamboo_planRepository_branch=3.1.x
bamboo_agentWorkingDirectory=/home/bamboo/xml-data/build-dir
bamboo_capability_system_git_executable=/usr/bin/git
bamboo_planRepository_1_previousRevision=3bf133c96ca34195024feb16bed812aa8dc77184
bamboo_capability_system_builder_phpunit_PHPUnit_3_4=/usr/bin/phpunit
bamboo_repository_git_username=bantu
bamboo_repository_75956235_revision_number=3bf133c96ca34195024feb16bed812aa8dc77184
bamboo_planRepository_branchDisplayName=3.1.x
bamboo_planRepository_1_type=gitv2
bamboo_planRepository_branchName=3.1.x
bamboo_repository_75956235_previous_revision_number=3bf133c96ca34195024feb16bed812aa8dc77184
bamboo_capability_system_jdk_JDK=/usr/lib/jvm/java-6-sun
bamboo_plan_storageTag=PHPBB3-PR
bamboo_planRepository_type=gitv2
bamboo_planRepository_1_username=bantu
bamboo_ManualBuildTriggerReason_userName=Build Robot
bamboo_repository_git_repositoryUrl=https://github.com/phpbb/phpbb.git
bamboo_repository_75956235_git_branch=3.1.x
bamboo_capability_system_builder_ant_Ant=/usr/share/ant
bamboo_repository_75956235_name=phpBB Ascraeus
bamboo_working_directory=/home/bamboo/xml-data/build-dir/PHPBB3-PR-JOB1
bamboo_planKey=PHPBB3-PR
bamboo_planRepository_1_repositoryUrl=https://github.com/phpbb/phpbb.git
bamboo_planRepository_username=bantu
bamboo_capability_local=true
bamboo_capability_system_jdk_JDK_1_6=/usr/lib/jvm/java-6-sun
bamboo_capability_system_jdk_JDK_1_7=/usr/lib/jvm/java-7-openjdk-amd64
bamboo_planRepository_1_branchName=3.1.x
10-Apr-2017 00:17:07 From https://github.com/phpbb/phpbb
10-Apr-2017 00:17:07 * branch            refs/pull/4789/head -> FETCH_HEAD
10-Apr-2017 00:17:07 grep: build/logs/phpunit.xml: No such file or directory
10-Apr-2017 00:17:07 grep: build/logs/phpunit.xml: No such file or directory
10-Apr-2017 00:17:07   % Total    % Received % Xferd  Average Speed   Time    Time     Time  Current
10-Apr-2017 00:17:07                                  Dload  Upload   Total   Spent    Left  Speed
10-Apr-2017 00:17:07
10-Apr-2017 00:17:08   0     0    0     0    0     0      0      0 --:--:-- --:--:-- --:--:--     0
10-Apr-2017 00:17:08   0     0    0     0    0     0      0      0 --:--:-- --:--:-- --:--:--     0
10-Apr-2017 00:17:08 100   273  100    93  100   180    155    301 --:--:-- --:--:-- --:--:--   301
10-Apr-2017 00:17:08 Finished task 'Set result build status' with result: Success
10-Apr-2017 00:17:08 Running post build plugin 'NCover Results Collector'
10-Apr-2017 00:17:08 Running post build plugin 'Artifact Copier'
10-Apr-2017 00:17:08 Running post build plugin 'npm Cache Cleanup'
10-Apr-2017 00:17:08 Running post build plugin 'Clover Results Collector'
10-Apr-2017 00:17:08 Running post build plugin 'Docker Container Cleanup'
10-Apr-2017 00:17:08 Successfully removed working directory at '/home/bamboo/xml-data/build-dir/PHPBB3-PR-JOB1'
10-Apr-2017 00:17:08 Finalising the build...
10-Apr-2017 00:17:08 Stopping timer.
10-Apr-2017 00:17:08 Build PHPBB3-PR-JOB1-6968 completed.
10-Apr-2017 00:17:08 Running on server: post build plugin 'NCover Results Collector'
10-Apr-2017 00:17:08 Running on server: post build plugin 'Build Hanging Detection Configuration'
10-Apr-2017 00:17:08 Running on server: post build plugin 'Clover Delta Calculator'
10-Apr-2017 00:17:08 Running on server: post build plugin 'Maven Dependencies Postprocessor'
10-Apr-2017 00:17:08 All post build plugins have finished
10-Apr-2017 00:17:08 Generating build results summary...
10-Apr-2017 00:17:08 Saving build results to disk...
10-Apr-2017 00:17:09 Logging substituted variables...
10-Apr-2017 00:17:09 Indexing build results...
10-Apr-2017 00:17:09 Finished building PHPBB3-PR-JOB1-6968.
10-Apr-2017 00:17:09
Substituting variable: ${bamboo.PRnumber} with 4789