Tests pending pull requests

Build: #6970 failed

Job: Build and Test Job failed

Stages & jobs

  1. Build and Test

Build log

The build generated 431 lines of output. Download or view full build log

11-Apr-2017 09:07:54 Build phpBB3 - Pull Requests - Build and Test Job #6970 (PHPBB3-PR-JOB1-6970) started building on agent Default Agent
11-Apr-2017 09:07:54
11-Apr-2017 09:07:54 Build working directory is /home/bamboo/xml-data/build-dir/PHPBB3-PR-JOB1
11-Apr-2017 09:07:54 Executing build phpBB3 - Pull Requests - Build and Test Job #6970 (PHPBB3-PR-JOB1-6970)
11-Apr-2017 09:07:54 Starting task 'Checkout develop branch' of type 'com.atlassian.bamboo.plugins.vcs:task.vcs.checkout'
11-Apr-2017 09:07:54 Build always requires a clean checkout
11-Apr-2017 09:07:54 Cleaning build directory '/home/bamboo/xml-data/build-dir/PHPBB3-PR-JOB1'
11-Apr-2017 09:07:54 Updating source code to revision: 3bf133c96ca34195024feb16bed812aa8dc77184
11-Apr-2017 09:07:54 Fetching 'refs/heads/3.1.x' from 'https://github.com/phpbb/phpbb.git'.
11-Apr-2017 09:07:54 Checking out revision 3bf133c96ca34195024feb16bed812aa8dc77184.
11-Apr-2017 09:07:54 Creating local git repository in '/home/bamboo/xml-data/build-dir/PHPBB3-PR-JOB1/.git'.
11-Apr-2017 09:07:54 Cloning into '/home/bamboo/xml-data/build-dir/PHPBB3-PR-JOB1'...
11-Apr-2017 09:07:54 done.
11-Apr-2017 09:07:56 Branch 3.1.x set up to track remote branch 3.1.x from origin.
11-Apr-2017 09:07:56 Switched to a new branch '3.1.x'
11-Apr-2017 09:07:56 Updated source code to revision: 3bf133c96ca34195024feb16bed812aa8dc77184
11-Apr-2017 09:07:56 Finished task 'Checkout develop branch' with result: Success
11-Apr-2017 09:07:56 Running pre-build action: VCS Version Collector
11-Apr-2017 09:07:56
Substituting variable: ${bamboo.PRnumber} with 4789
11-Apr-2017 09:07:56
Substituting variable: ${bamboo.buildResultsUrl} with https://bamboo.phpbb.com/browse/PHPBB3-PR-JOB1-6970
11-Apr-2017 09:07:56 Starting task 'Set pending build status' of type 'com.atlassian.bamboo.plugins.scripttask:task.builder.script'
11-Apr-2017 09:07:56
Beginning to execute external process for build 'phpBB3 - Pull Requests - Build and Test Job #6970 (PHPBB3-PR-JOB1-6970)'
... running command line:
/bin/sh /home/bamboo/temp/PHPBB3-PR-JOB1-6970-ScriptBuildTask-7760612421244672713.sh
... in: /home/bamboo/xml-data/build-dir/PHPBB3-PR-JOB1
... using extra environment variables:
bamboo_planRepository_1_branch=3.1.x
bamboo_planRepository_1_branchDisplayName=3.1.x
bamboo_repository_revision_number=3bf133c96ca34195024feb16bed812aa8dc77184
bamboo_PRref=master
bamboo_resultsUrl=https://bamboo.phpbb.com/browse/PHPBB3-PR-JOB1-6970
bamboo_capability_system_builder_command_Git=/usr/bin/git
bamboo_repository_75956235_git_username=bantu
bamboo_planRepository_1_name=phpBB Ascraeus
bamboo_build_working_directory=/home/bamboo/xml-data/build-dir/PHPBB3-PR-JOB1
bamboo_buildKey=PHPBB3-PR-JOB1
bamboo_capability_phpbb_tests=true
bamboo_shortPlanName=Pull Requests
bamboo_capability_system_builder_command_fop=/usr/bin/fop
bamboo_capability_dbms_sqlite_2=true
bamboo_planRepository_name=phpBB Ascraeus
bamboo_PRnumber=4789
bamboo_buildNumber=6970
bamboo_repository_75956235_git_repositoryUrl=https://github.com/phpbb/phpbb.git
bamboo_capability_system_builder_phpunit_PHPUnit=/usr/bin/phpunit
bamboo_shortJobName=Build and Test Job
bamboo_buildResultsUrl=https://bamboo.phpbb.com/browse/PHPBB3-PR-JOB1-6970
bamboo_repository_75956235_branch_name=3.1.x
bamboo_planRepository_repositoryUrl=https://github.com/phpbb/phpbb.git
bamboo_agentId=131073
bamboo_planName=phpBB3 - Pull Requests
bamboo_shortPlanKey=PR
bamboo_shortJobKey=JOB1
bamboo_capability_dbms_mysql_55=true
bamboo_capability_system_jdk_JDK_1_7_0_65=/usr/lib/jvm/java-7-openjdk-amd64
bamboo_planRepository_revision=3bf133c96ca34195024feb16bed812aa8dc77184
bamboo_repository_previous_revision_number=3bf133c96ca34195024feb16bed812aa8dc77184
bamboo_buildTimeStamp=2017-04-11T09:07:54.236Z
bamboo_planRepository_previousRevision=3bf133c96ca34195024feb16bed812aa8dc77184
bamboo_capability_system_builder_mvn2_Maven_2=/usr/share/maven2
bamboo_capability_system_jdk_JDK_1_6_0_16=/usr/lib/jvm/java-6-sun-1.6.0.16
bamboo_buildResultKey=PHPBB3-PR-JOB1-6970
bamboo_repository_git_branch=3.1.x
bamboo_repository_branch_name=3.1.x
bamboo_buildPlanName=phpBB3 - Pull Requests - Build and Test Job
bamboo_planRepository_1_revision=3bf133c96ca34195024feb16bed812aa8dc77184
bamboo_repository_name=phpBB Ascraeus
bamboo_capability_system_docker_executable=/usr/bin/docker
bamboo_planRepository_branch=3.1.x
bamboo_agentWorkingDirectory=/home/bamboo/xml-data/build-dir
bamboo_capability_system_git_executable=/usr/bin/git
bamboo_planRepository_1_previousRevision=3bf133c96ca34195024feb16bed812aa8dc77184
bamboo_capability_system_builder_phpunit_PHPUnit_3_4=/usr/bin/phpunit
bamboo_repository_git_username=bantu
bamboo_repository_75956235_revision_number=3bf133c96ca34195024feb16bed812aa8dc77184
bamboo_planRepository_branchDisplayName=3.1.x
bamboo_planRepository_1_type=gitv2
bamboo_planRepository_branchName=3.1.x
bamboo_repository_75956235_previous_revision_number=3bf133c96ca34195024feb16bed812aa8dc77184
bamboo_capability_system_jdk_JDK=/usr/lib/jvm/java-6-sun
bamboo_plan_storageTag=PHPBB3-PR
bamboo_planRepository_type=gitv2
bamboo_planRepository_1_username=bantu
bamboo_ManualBuildTriggerReason_userName=Build Robot
bamboo_repository_git_repositoryUrl=https://github.com/phpbb/phpbb.git
bamboo_repository_75956235_git_branch=3.1.x
bamboo_capability_system_builder_ant_Ant=/usr/share/ant
bamboo_repository_75956235_name=phpBB Ascraeus
bamboo_working_directory=/home/bamboo/xml-data/build-dir/PHPBB3-PR-JOB1
bamboo_planKey=PHPBB3-PR
bamboo_planRepository_1_repositoryUrl=https://github.com/phpbb/phpbb.git
bamboo_planRepository_username=bantu
bamboo_capability_local=true
bamboo_capability_system_jdk_JDK_1_6=/usr/lib/jvm/java-6-sun
bamboo_capability_system_jdk_JDK_1_7=/usr/lib/jvm/java-7-openjdk-amd64
bamboo_planRepository_1_branchName=3.1.x
11-Apr-2017 09:07:57 From https://github.com/phpbb/phpbb
11-Apr-2017 09:07:57 * branch            refs/pull/4789/head -> FETCH_HEAD
11-Apr-2017 09:07:57   % Total    % Received % Xferd  Average Speed   Time    Time     Time  Current
11-Apr-2017 09:07:57                                  Dload  Upload   Total   Spent    Left  Speed
11-Apr-2017 09:07:57
11-Apr-2017 09:07:58   0     0    0     0    0     0      0      0 --:--:-- --:--:-- --:--:--     0
11-Apr-2017 09:07:58 100   275  100    93  100   182    123    240 --:--:-- --:--:-- --:--:--   241
11-Apr-2017 09:07:58 Finished task 'Set pending build status' with result: Success
11-Apr-2017 09:07:58
Substituting variable: ${bamboo.PRnumber} with 4789
11-Apr-2017 09:07:58 Starting task 'Fetch PR' of type 'com.atlassian.bamboo.plugins.scripttask:task.builder.script'
11-Apr-2017 09:07:58
Beginning to execute external process for build 'phpBB3 - Pull Requests - Build and Test Job #6970 (PHPBB3-PR-JOB1-6970)'
... running command line:
/bin/sh /home/bamboo/temp/PHPBB3-PR-JOB1-6970-ScriptBuildTask-3850658871084853690.sh
... in: /home/bamboo/xml-data/build-dir/PHPBB3-PR-JOB1
... using extra environment variables:
bamboo_planRepository_1_branch=3.1.x
bamboo_planRepository_1_branchDisplayName=3.1.x
bamboo_repository_revision_number=3bf133c96ca34195024feb16bed812aa8dc77184
bamboo_PRref=master
bamboo_resultsUrl=https://bamboo.phpbb.com/browse/PHPBB3-PR-JOB1-6970
bamboo_capability_system_builder_command_Git=/usr/bin/git
bamboo_repository_75956235_git_username=bantu
bamboo_planRepository_1_name=phpBB Ascraeus
bamboo_build_working_directory=/home/bamboo/xml-data/build-dir/PHPBB3-PR-JOB1
bamboo_buildKey=PHPBB3-PR-JOB1
bamboo_capability_phpbb_tests=true
bamboo_shortPlanName=Pull Requests
bamboo_capability_system_builder_command_fop=/usr/bin/fop
bamboo_capability_dbms_sqlite_2=true
bamboo_planRepository_name=phpBB Ascraeus
bamboo_PRnumber=4789
bamboo_buildNumber=6970
bamboo_repository_75956235_git_repositoryUrl=https://github.com/phpbb/phpbb.git
bamboo_capability_system_builder_phpunit_PHPUnit=/usr/bin/phpunit
bamboo_shortJobName=Build and Test Job
bamboo_buildResultsUrl=https://bamboo.phpbb.com/browse/PHPBB3-PR-JOB1-6970
bamboo_repository_75956235_branch_name=3.1.x
bamboo_planRepository_repositoryUrl=https://github.com/phpbb/phpbb.git
bamboo_agentId=131073
bamboo_planName=phpBB3 - Pull Requests
bamboo_build_commandline_com_atlassian_bamboo_plugins_scripttask_task_builder_script_7=/bin/sh /home/bamboo/temp/PHPBB3-PR-JOB1-6970-ScriptBuildTask-7760612421244672713.sh
bamboo_shortPlanKey=PR
bamboo_shortJobKey=JOB1
bamboo_capability_dbms_mysql_55=true
bamboo_capability_system_jdk_JDK_1_7_0_65=/usr/lib/jvm/java-7-openjdk-amd64
bamboo_planRepository_revision=3bf133c96ca34195024feb16bed812aa8dc77184
bamboo_repository_previous_revision_number=3bf133c96ca34195024feb16bed812aa8dc77184
bamboo_buildTimeStamp=2017-04-11T09:07:54.236Z
bamboo_planRepository_previousRevision=3bf133c96ca34195024feb16bed812aa8dc77184
bamboo_capability_system_builder_mvn2_Maven_2=/usr/share/maven2
bamboo_capability_system_jdk_JDK_1_6_0_16=/usr/lib/jvm/java-6-sun-1.6.0.16
bamboo_buildResultKey=PHPBB3-PR-JOB1-6970
bamboo_repository_git_branch=3.1.x
bamboo_repository_branch_name=3.1.x
bamboo_buildPlanName=phpBB3 - Pull Requests - Build and Test Job
bamboo_planRepository_1_revision=3bf133c96ca34195024feb16bed812aa8dc77184
bamboo_repository_name=phpBB Ascraeus
bamboo_capability_system_docker_executable=/usr/bin/docker
bamboo_planRepository_branch=3.1.x
bamboo_agentWorkingDirectory=/home/bamboo/xml-data/build-dir
bamboo_capability_system_git_executable=/usr/bin/git
bamboo_planRepository_1_previousRevision=3bf133c96ca34195024feb16bed812aa8dc77184
bamboo_capability_system_builder_phpunit_PHPUnit_3_4=/usr/bin/phpunit
bamboo_repository_git_username=bantu
bamboo_repository_75956235_revision_number=3bf133c96ca34195024feb16bed812aa8dc77184
bamboo_planRepository_branchDisplayName=3.1.x
bamboo_planRepository_1_type=gitv2
bamboo_planRepository_branchName=3.1.x
bamboo_repository_75956235_previous_revision_number=3bf133c96ca34195024feb16bed812aa8dc77184
bamboo_capability_system_jdk_JDK=/usr/lib/jvm/java-6-sun
bamboo_plan_storageTag=PHPBB3-PR
bamboo_planRepository_type=gitv2
bamboo_planRepository_1_username=bantu
bamboo_ManualBuildTriggerReason_userName=Build Robot
bamboo_repository_git_repositoryUrl=https://github.com/phpbb/phpbb.git
bamboo_repository_75956235_git_branch=3.1.x
bamboo_capability_system_builder_ant_Ant=/usr/share/ant
bamboo_repository_75956235_name=phpBB Ascraeus
bamboo_working_directory=/home/bamboo/xml-data/build-dir/PHPBB3-PR-JOB1
bamboo_planKey=PHPBB3-PR
bamboo_planRepository_1_repositoryUrl=https://github.com/phpbb/phpbb.git
bamboo_planRepository_username=bantu
bamboo_capability_local=true
bamboo_capability_system_jdk_JDK_1_6=/usr/lib/jvm/java-6-sun
bamboo_capability_system_jdk_JDK_1_7=/usr/lib/jvm/java-7-openjdk-amd64
bamboo_planRepository_1_branchName=3.1.x
11-Apr-2017 09:07:59 From https://github.com/phpbb/phpbb
11-Apr-2017 09:07:59 * branch            refs/pull/4789/merge -> FETCH_HEAD
11-Apr-2017 09:07:59 Note: checking out 'FETCH_HEAD'.
11-Apr-2017 09:07:59
11-Apr-2017 09:07:59 You are in 'detached HEAD' state. You can look around, make experimental
11-Apr-2017 09:07:59 changes and commit them, and you can discard any commits you make in this
11-Apr-2017 09:07:59 state without impacting any branches by performing another checkout.
11-Apr-2017 09:07:59
11-Apr-2017 09:07:59 If you want to create a new branch to retain commits you create, you may
11-Apr-2017 09:07:59 do so (now or later) by using -b with the checkout command again. Example:
11-Apr-2017 09:07:59
11-Apr-2017 09:07:59   git checkout -b new_branch_name
11-Apr-2017 09:07:59
11-Apr-2017 09:07:59 HEAD is now at 726e6cf... Merge 34f1b7e725fb642abdc5456141c6d150328391eb into 4a657d073259e59431264965c6300e365bef1664
11-Apr-2017 09:07:59 Finished task 'Fetch PR' with result: Success
11-Apr-2017 09:07:59 Skipping execution of task 'Prepare directory' as it is disabled
11-Apr-2017 09:07:59
Substituting variable: ${bamboo.working.directory} with /home/bamboo/xml-data/build-dir/PHPBB3-PR-JOB1
11-Apr-2017 09:07:59 Starting task 'Prepare directory' of type 'com.atlassian.bamboo.plugins.bamboo-docker-plugin:task.docker.cli'
11-Apr-2017 09:07:59 Running image name (phpbb:php-5.6)
11-Apr-2017 09:07:59
Beginning to execute external process for build 'phpBB3 - Pull Requests - Build and Test Job #6970 (PHPBB3-PR-JOB1-6970)'
... running command line:
/usr/bin/docker run --volume /home/bamboo/xml-data/build-dir/PHPBB3-PR-JOB1:/data --workdir /data/phpBB --rm -e HOME=/home/bamboo -u=991 phpbb:php-5.6 /bin/bash -c php ../composer.phar install --dev; cd ../build; ../phpBB/vendor/bin/phing clean prepare
... in: /home/bamboo/xml-data/build-dir/PHPBB3-PR-JOB1
... using extra environment variables:
bamboo_planRepository_1_branch=3.1.x
bamboo_planRepository_1_branchDisplayName=3.1.x
bamboo_repository_revision_number=3bf133c96ca34195024feb16bed812aa8dc77184
bamboo_PRref=master
bamboo_resultsUrl=https://bamboo.phpbb.com/browse/PHPBB3-PR-JOB1-6970
bamboo_capability_system_builder_command_Git=/usr/bin/git
bamboo_repository_75956235_git_username=bantu
bamboo_planRepository_1_name=phpBB Ascraeus
bamboo_build_working_directory=/home/bamboo/xml-data/build-dir/PHPBB3-PR-JOB1
bamboo_buildKey=PHPBB3-PR-JOB1
bamboo_capability_phpbb_tests=true
bamboo_shortPlanName=Pull Requests
bamboo_capability_system_builder_command_fop=/usr/bin/fop
bamboo_capability_dbms_sqlite_2=true
bamboo_planRepository_name=phpBB Ascraeus
bamboo_PRnumber=4789
bamboo_buildNumber=6970
bamboo_repository_75956235_git_repositoryUrl=https://github.com/phpbb/phpbb.git
bamboo_capability_system_builder_phpunit_PHPUnit=/usr/bin/phpunit
bamboo_shortJobName=Build and Test Job
bamboo_buildResultsUrl=https://bamboo.phpbb.com/browse/PHPBB3-PR-JOB1-6970
bamboo_repository_75956235_branch_name=3.1.x
bamboo_planRepository_repositoryUrl=https://github.com/phpbb/phpbb.git
bamboo_agentId=131073
bamboo_planName=phpBB3 - Pull Requests
bamboo_build_commandline_com_atlassian_bamboo_plugins_scripttask_task_builder_script_7=/bin/sh /home/bamboo/temp/PHPBB3-PR-JOB1-6970-ScriptBuildTask-7760612421244672713.sh
bamboo_shortPlanKey=PR
bamboo_shortJobKey=JOB1
bamboo_capability_dbms_mysql_55=true
bamboo_capability_system_jdk_JDK_1_7_0_65=/usr/lib/jvm/java-7-openjdk-amd64
bamboo_planRepository_revision=3bf133c96ca34195024feb16bed812aa8dc77184
bamboo_repository_previous_revision_number=3bf133c96ca34195024feb16bed812aa8dc77184
bamboo_buildTimeStamp=2017-04-11T09:07:54.236Z
bamboo_planRepository_previousRevision=3bf133c96ca34195024feb16bed812aa8dc77184
bamboo_capability_system_builder_mvn2_Maven_2=/usr/share/maven2
bamboo_capability_system_jdk_JDK_1_6_0_16=/usr/lib/jvm/java-6-sun-1.6.0.16
bamboo_build_commandline_com_atlassian_bamboo_plugins_scripttask_task_builder_script_4=/bin/sh /home/bamboo/temp/PHPBB3-PR-JOB1-6970-ScriptBuildTask-3850658871084853690.sh
bamboo_buildResultKey=PHPBB3-PR-JOB1-6970
bamboo_repository_git_branch=3.1.x
bamboo_repository_branch_name=3.1.x
bamboo_buildPlanName=phpBB3 - Pull Requests - Build and Test Job
bamboo_planRepository_1_revision=3bf133c96ca34195024feb16bed812aa8dc77184
bamboo_repository_name=phpBB Ascraeus
bamboo_capability_system_docker_executable=/usr/bin/docker
bamboo_planRepository_branch=3.1.x
bamboo_agentWorkingDirectory=/home/bamboo/xml-data/build-dir
bamboo_capability_system_git_executable=/usr/bin/git
bamboo_planRepository_1_previousRevision=3bf133c96ca34195024feb16bed812aa8dc77184
bamboo_capability_system_builder_phpunit_PHPUnit_3_4=/usr/bin/phpunit
bamboo_repository_git_username=bantu
bamboo_repository_75956235_revision_number=3bf133c96ca34195024feb16bed812aa8dc77184
bamboo_planRepository_branchDisplayName=3.1.x
bamboo_planRepository_1_type=gitv2
bamboo_planRepository_branchName=3.1.x
bamboo_repository_75956235_previous_revision_number=3bf133c96ca34195024feb16bed812aa8dc77184
bamboo_capability_system_jdk_JDK=/usr/lib/jvm/java-6-sun
bamboo_plan_storageTag=PHPBB3-PR
bamboo_planRepository_type=gitv2
bamboo_planRepository_1_username=bantu
bamboo_ManualBuildTriggerReason_userName=Build Robot
bamboo_repository_git_repositoryUrl=https://github.com/phpbb/phpbb.git
bamboo_repository_75956235_git_branch=3.1.x
bamboo_capability_system_builder_ant_Ant=/usr/share/ant
bamboo_repository_75956235_name=phpBB Ascraeus
bamboo_working_directory=/home/bamboo/xml-data/build-dir/PHPBB3-PR-JOB1
bamboo_planKey=PHPBB3-PR
bamboo_planRepository_1_repositoryUrl=https://github.com/phpbb/phpbb.git
bamboo_planRepository_username=bantu
bamboo_capability_local=true
bamboo_capability_system_jdk_JDK_1_6=/usr/lib/jvm/java-6-sun
bamboo_capability_system_jdk_JDK_1_7=/usr/lib/jvm/java-7-openjdk-amd64
bamboo_planRepository_1_branchName=3.1.x
11-Apr-2017 09:07:59 You are running composer with xdebug enabled. This has a major impact on runtime performance. See https://getcomposer.org/xdebug
11-Apr-2017 09:07:59 You are using the deprecated option "dev". Dev packages are installed by default now.
11-Apr-2017 09:07:59 Cannot create cache directory /home/bamboo/.composer/cache/repo/https---packagist.org/, or directory is not writable. Proceeding without cache
11-Apr-2017 09:07:59 Cannot create cache directory /home/bamboo/.composer/cache/files/, or directory is not writable. Proceeding without cache
11-Apr-2017 09:07:59 Loading composer repositories with package information
11-Apr-2017 09:07:59 Installing dependencies (including require-dev) from lock file
11-Apr-2017 09:07:59   - Installing bantu/ini-get-wrapper (v1.0.1)
11-Apr-2017 09:08:02     Downloading: Connecting...    Downloading: 0%               Downloading: 100%    Downloading: 100%
11-Apr-2017 09:08:02
11-Apr-2017 09:08:02   - Installing google/recaptcha (1.1.2)
11-Apr-2017 09:08:03     Downloading: Connecting...    Downloading: 0%               Downloading: 30%    Downloading: 55%    Downloading: 65%    Downloading: 70%    Downloading: 95%    Downloading: 100%    Downloading: 100%
11-Apr-2017 09:08:03
11-Apr-2017 09:08:03   - Installing guzzlehttp/promises (1.3.0)
11-Apr-2017 09:08:05     Downloading: Connecting...    Downloading: 0%               Downloading: 15%    Downloading: 25%    Downloading: 40%    Downloading: 60%    Downloading: 70%    Downloading: 85%    Downloading: 100%    Downloading: 100%
11-Apr-2017 09:08:05
11-Apr-2017 09:08:05   - Installing psr/http-message (1.0.1)
11-Apr-2017 09:08:06     Downloading: Connecting...    Downloading: 0%               Downloading: 95%    Downloading: 100%    Downloading: 100%
11-Apr-2017 09:08:06
11-Apr-2017 09:08:06   - Installing guzzlehttp/psr7 (1.3.1)
11-Apr-2017 09:08:07     Downloading: Connecting...    Downloading: 0%               Downloading: 5%    Downloading: 15%    Downloading: 20%    Downloading: 25%    Downloading: 40%    Downloading: 45%    Downloading: 55%    Downloading: 60%    Downloading: 75%    Downloading: 80%    Downloading: 95%    Downloading: 100%
11-Apr-2017 09:08:07
11-Apr-2017 09:08:07   - Installing lusitanian/oauth (v0.8.9)
11-Apr-2017 09:08:08     Downloading: Connecting...    Downloading: 0%               Downloading: 5%    Downloading: 10%    Downloading: 15%    Downloading: 20%    Downloading: 25%    Downloading: 30%    Downloading: 35%    Downloading: 40%    Downloading: 45%    Downloading: 50%    Downloading: 55%    Downloading: 60%    Downloading: 65%    Downloading: 70%    Downloading: 75%    Downloading: 80%    Downloading: 85%    Downloading: 90%    Downloading: 95%    Downloading: 100%    Downloading: 100%
11-Apr-2017 09:08:08
11-Apr-2017 09:08:08   - Installing marc1706/fast-image-size (v1.1.2)
11-Apr-2017 09:08:09     Downloading: Connecting...    Downloading: 0%               Downloading: 35%    Downloading: 55%    Downloading: 100%
11-Apr-2017 09:08:09
11-Apr-2017 09:08:09   - Installing paragonie/random_compat (v1.4.1)
11-Apr-2017 09:08:10     Downloading: Connecting...    Downloading: 0%               Downloading: 20%    Downloading: 35%    Downloading: 60%    Downloading: 90%    Downloading: 100%    Downloading: 100%
11-Apr-2017 09:08:10
11-Apr-2017 09:08:10   - Installing patchwork/utf8 (v1.3.1)
11-Apr-2017 09:08:12     Downloading: Connecting...    Downloading: 0%               Downloading: 5%    Downloading: 10%    Downloading: 15%    Downloading: 20%    Downloading: 25%    Downloading: 30%    Downloading: 35%    Downloading: 40%    Downloading: 45%    Downloading: 50%    Downloading: 55%    Downloading: 60%    Downloading: 65%    Downloading: 70%    Downloading: 75%    Downloading: 80%    Downloading: 85%    Downloading: 90%    Downloading: 95%    Downloading: 100%    Downloading: 100%
11-Apr-2017 09:08:12
11-Apr-2017 09:08:12   - Installing s9e/text-formatter (0.9.1)
11-Apr-2017 09:08:13     Downloading: Connecting...    Downloading: 100%         
11-Apr-2017 09:08:13
11-Apr-2017 09:08:13   - Installing symfony/filesystem (v3.2.0)
11-Apr-2017 09:08:14     Downloading: Connecting...    Downloading: 0%               Downloading: 35%    Downloading: 50%    Downloading: 95%    Downloading: 100%    Downloading: 100%
11-Apr-2017 09:08:14
11-Apr-2017 09:08:14   - Installing symfony/config (v3.2.0)
11-Apr-2017 09:08:15     Downloading: Connecting...    Downloading: 0%               Downloading: 5%    Downloading: 15%    Downloading: 20%    Downloading: 25%    Downloading: 30%    Downloading: 40%    Downloading: 45%    Downloading: 50%    Downloading: 60%    Downloading: 65%    Downloading: 70%    Downloading: 75%    Downloading: 80%    Downloading: 85%    Downloading: 95%    Downloading: 100%    Downloading: 100%
11-Apr-2017 09:08:15
11-Apr-2017 09:08:15   - Installing symfony/finder (v3.2.0)
11-Apr-2017 09:08:16     Downloading: Connecting...    Downloading: 0%               Downloading: 5%    Downloading: 10%    Downloading: 15%    Downloading: 20%    Downloading: 25%    Downloading: 35%    Downloading: 40%    Downloading: 45%    Downloading: 50%    Downloading: 55%    Downloading: 60%    Downloading: 65%    Downloading: 70%    Downloading: 75%    Downloading: 80%    Downloading: 100%    Downloading: 100%
11-Apr-2017 09:08:16
11-Apr-2017 09:08:16   - Installing symfony/polyfill-mbstring (v1.3.0)
11-Apr-2017 09:08:17     Downloading: Connecting...    Downloading: 0%               Downloading: 35%    Downloading: 70%    Downloading: 100%    Downloading: 100%
11-Apr-2017 09:08:17
11-Apr-2017 09:08:17   - Installing symfony/http-foundation (v3.2.0)
11-Apr-2017 09:08:19     Downloading: Connecting...    Downloading: 0%               Downloading: 5%    Downloading: 10%    Downloading: 15%    Downloading: 20%    Downloading: 25%    Downloading: 30%    Downloading: 35%    Downloading: 40%    Downloading: 45%    Downloading: 50%    Downloading: 55%    Downloading: 60%    Downloading: 65%    Downloading: 70%    Downloading: 75%    Downloading: 80%    Downloading: 85%    Downloading: 90%    Downloading: 95%    Downloading: 100%    Downloading: 100%
11-Apr-2017 09:08:19
11-Apr-2017 09:08:19   - Installing symfony/event-dispatcher (v3.2.0)
11-Apr-2017 09:08:20     Downloading: Connecting...    Downloading: 0%               Downloading: 5%    Downloading: 10%    Downloading: 15%    Downloading: 65%    Downloading: 70%    Downloading: 75%    Downloading: 80%    Downloading: 85%    Downloading: 90%    Downloading: 100%    Downloading: 100%
11-Apr-2017 09:08:20
11-Apr-2017 09:08:20   - Installing psr/log (1.0.2)
11-Apr-2017 09:08:21     Downloading: Connecting...    Downloading: 0%               Downloading: 15%    Downloading: 100%    Downloading: 100%
11-Apr-2017 09:08:21
11-Apr-2017 09:08:21   - Installing symfony/debug (v3.2.0)
11-Apr-2017 09:08:22     Downloading: Connecting...    Downloading: 0%               Downloading: 5%    Downloading: 15%    Downloading: 20%    Downloading: 25%    Downloading: 35%    Downloading: 40%    Downloading: 45%    Downloading: 70%    Downloading: 75%    Downloading: 95%    Downloading: 100%    Downloading: 100%
11-Apr-2017 09:08:22
11-Apr-2017 09:08:22   - Installing symfony/http-kernel (v3.2.0)
11-Apr-2017 09:08:23     Downloading: Connecting...    Downloading: 100%         
11-Apr-2017 09:08:23
11-Apr-2017 09:08:23   - Installing symfony/dependency-injection (v3.2.0)
11-Apr-2017 09:08:24     Downloading: Connecting...    Downloading: 0%               Downloading: 5%    Downloading: 10%    Downloading: 15%    Downloading: 20%    Downloading: 25%    Downloading: 30%    Downloading: 35%    Downloading: 40%    Downloading: 45%    Downloading: 50%    Downloading: 55%    Downloading: 60%    Downloading: 65%    Downloading: 70%    Downloading: 75%    Downloading: 80%    Downloading: 85%    Downloading: 90%    Downloading: 95%    Downloading: 100%    Downloading: 100%
11-Apr-2017 09:08:24
11-Apr-2017 09:08:24   - Installing zendframework/zend-eventmanager (3.0.1)
11-Apr-2017 09:08:25     Downloading: Connecting...    Downloading: 0%               Downloading: 15%    Downloading: 30%    Downloading: 55%    Downloading: 70%    Downloading: 85%    Downloading: 100%
11-Apr-2017 09:08:25
11-Apr-2017 09:08:25   - Installing zendframework/zend-code (2.6.3)
11-Apr-2017 09:08:27     Downloading: Connecting...    Downloading: 0%               Downloading: 5%    Downloading: 10%    Downloading: 15%    Downloading: 20%    Downloading: 25%    Downloading: 30%    Downloading: 35%    Downloading: 40%    Downloading: 45%    Downloading: 50%    Downloading: 55%    Downloading: 60%    Downloading: 65%    Downloading: 70%    Downloading: 75%    Downloading: 80%    Downloading: 85%    Downloading: 90%    Downloading: 95%    Downloading: 100%    Downloading: 100%
11-Apr-2017 09:08:27
11-Apr-2017 09:08:27   - Installing ocramius/proxy-manager (1.0.2)
11-Apr-2017 09:08:28     Downloading: Connecting...    Downloading: 0%               Downloading: 5%    Downloading: 10%    Downloading: 15%    Downloading: 20%    Downloading: 25%    Downloading: 30%    Downloading: 35%    Downloading: 40%    Downloading: 45%    Downloading: 50%    Downloading: 55%    Downloading: 60%    Downloading: 65%    Downloading: 70%    Downloading: 75%    Downloading: 80%    Downloading: 85%    Downloading: 95%    Downloading: 100%    Downloading: 100%
11-Apr-2017 09:08:28
11-Apr-2017 09:08:28   - Installing symfony/proxy-manager-bridge (v3.2.0)
11-Apr-2017 09:08:29     Downloading: Connecting...    Downloading: 100%         
11-Apr-2017 09:08:29
11-Apr-2017 09:08:29   - Installing symfony/routing (v3.2.0)
11-Apr-2017 09:08:31     Downloading: Connecting...    Downloading: 0%               Downloading: 5%    Downloading: 10%    Downloading: 15%    Downloading: 20%    Downloading: 25%    Downloading: 30%    Downloading: 35%    Downloading: 40%    Downloading: 45%    Downloading: 50%    Downloading: 55%    Downloading: 60%    Downloading: 65%    Downloading: 70%    Downloading: 75%    Downloading: 80%    Downloading: 85%    Downloading: 90%    Downloading: 95%    Downloading: 100%    Downloading: 100%
11-Apr-2017 09:08:31
11-Apr-2017 09:08:31   - Installing twig/twig (v1.24.2)
11-Apr-2017 09:08:32     Downloading: Connecting...    Downloading: 0%               Downloading: 5%    Downloading: 10%    Downloading: 15%    Downloading: 20%    Downloading: 25%    Downloading: 30%    Downloading: 35%    Downloading: 40%    Downloading: 45%    Downloading: 50%    Downloading: 55%    Downloading: 75%    Downloading: 80%    Downloading: 85%    Downloading: 90%    Downloading: 95%    Downloading: 100%    Downloading: 100%
11-Apr-2017 09:08:32
11-Apr-2017 09:08:32   - Installing symfony/twig-bridge (v3.1.4)
11-Apr-2017 09:08:33     Downloading: Connecting...    Downloading: 0%               Downloading: 10%    Downloading: 15%    Downloading: 25%    Downloading: 30%    Downloading: 40%    Downloading: 50%    Downloading: 60%    Downloading: 65%    Downloading: 75%    Downloading: 85%    Downloading: 95%    Downloading: 100%    Downloading: 100%
11-Apr-2017 09:08:33
11-Apr-2017 09:08:33   - Installing symfony/dom-crawler (v3.2.0)
11-Apr-2017 09:08:35     Downloading: Connecting...    Downloading: 0%               Downloading: 25%    Downloading: 30%    Downloading: 55%    Downloading: 80%    Downloading: 85%    Downloading: 100%
11-Apr-2017 09:08:35
11-Apr-2017 09:08:35   - Installing symfony/css-selector (v3.2.0)
11-Apr-2017 09:08:36     Downloading: Connecting...    Downloading: 0%               Downloading: 5%    Downloading: 10%    Downloading: 15%    Downloading: 20%    Downloading: 25%    Downloading: 30%    Downloading: 35%    Downloading: 40%    Downloading: 45%    Downloading: 50%    Downloading: 55%    Downloading: 60%    Downloading: 65%    Downloading: 95%    Downloading: 100%    Downloading: 100%
11-Apr-2017 09:08:36
11-Apr-2017 09:08:36   - Installing symfony/browser-kit (v3.2.0)
11-Apr-2017 09:08:37     Downloading: Connecting...    Downloading: 0%               Downloading: 50%    Downloading: 80%    Downloading: 85%    Downloading: 100%    Downloading: 100%
11-Apr-2017 09:08:37
11-Apr-2017 09:08:37   - Installing guzzlehttp/guzzle (6.2.2)
11-Apr-2017 09:08:38     Downloading: Connecting...    Downloading: 0%               Downloading: 5%    Downloading: 10%    Downloading: 15%    Downloading: 20%    Downloading: 30%    Downloading: 35%    Downloading: 40%    Downloading: 45%    Downloading: 50%    Downloading: 55%    Downloading: 60%    Downloading: 70%    Downloading: 75%    Downloading: 85%    Downloading: 90%    Downloading: 95%    Downloading: 100%
11-Apr-2017 09:08:38
11-Apr-2017 09:08:38   - Installing fabpot/goutte (v3.2.0)
11-Apr-2017 09:08:39     Downloading: Connecting...    Downloading: 0%               Downloading: 70%    Downloading: 100%    Downloading: 100%
11-Apr-2017 09:08:39
11-Apr-2017 09:08:39   - Installing facebook/webdriver (1.2.0)
11-Apr-2017 09:08:40     Downloading: Connecting...    Downloading: 0%               Downloading: 5%    Downloading: 10%    Downloading: 15%    Downloading: 20%    Downloading: 25%    Downloading: 30%    Downloading: 35%    Downloading: 40%    Downloading: 45%    Downloading: 50%    Downloading: 55%    Downloading: 60%    Downloading: 65%    Downloading: 70%    Downloading: 75%    Downloading: 80%    Downloading: 85%    Downloading: 90%    Downloading: 95%    Downloading: 100%    Downloading: 100%
11-Apr-2017 09:08:40
11-Apr-2017 09:08:40   - Installing symfony/process (v3.2.0)
11-Apr-2017 09:08:42     Downloading: Connecting...    Downloading: 0%               Downloading: 20%    Downloading: 35%    Downloading: 50%    Downloading: 65%    Downloading: 70%    Downloading: 85%    Downloading: 100%    Downloading: 100%
11-Apr-2017 09:08:42
11-Apr-2017 09:08:42   - Installing symfony/console (v3.2.0)
11-Apr-2017 09:08:43     Downloading: Connecting...    Downloading: 0%               Downloading: 5%    Downloading: 10%    Downloading: 15%    Downloading: 20%    Downloading: 25%    Downloading: 30%    Downloading: 35%    Downloading: 40%    Downloading: 45%    Downloading: 50%    Downloading: 55%    Downloading: 60%    Downloading: 65%    Downloading: 70%    Downloading: 75%    Downloading: 80%    Downloading: 85%    Downloading: 90%    Downloading: 95%    Downloading: 100%    Downloading: 100%
11-Apr-2017 09:08:43
11-Apr-2017 09:08:43   - Installing laravel/homestead (v4.0.5)
11-Apr-2017 09:08:44     Downloading: Connecting...    Downloading: 0%               Downloading: 5%    Downloading: 10%    Downloading: 70%    Downloading: 75%    Downloading: 80%    Downloading: 85%    Downloading: 100%    Downloading: 100%
11-Apr-2017 09:08:44
11-Apr-2017 09:08:44   - Installing phing/phing (2.4.14)
11-Apr-2017 09:08:46     Downloading: Connecting...    Downloading: 0%               Downloading: 5%    Downloading: 10%    Downloading: 15%    Downloading: 20%    Downloading: 25%    Downloading: 30%    Downloading: 35%    Downloading: 40%    Downloading: 45%    Downloading: 50%    Downloading: 55%    Downloading: 60%    Downloading: 65%    Downloading: 70%    Downloading: 75%    Downloading: 80%    Downloading: 85%    Downloading: 90%    Downloading: 95%    Downloading: 100%    Downloading: 100%
11-Apr-2017 09:08:46
11-Apr-2017 09:08:46   - Installing phpdocumentor/reflection-docblock (2.0.4)
11-Apr-2017 09:08:47     Downloading: Connecting...    Downloading: 0%               Downloading: 15%    Downloading: 20%    Downloading: 35%    Downloading: 40%    Downloading: 55%    Downloading: 70%    Downloading: 75%    Downloading: 90%    Downloading: 95%    Downloading: 100%    Downloading: 100%
11-Apr-2017 09:08:47
11-Apr-2017 09:08:47   - Installing phpdocumentor/reflection-common (1.0)
11-Apr-2017 09:08:48     Downloading: Connecting...    Downloading: 0%               Downloading: 65%    Downloading: 100%
11-Apr-2017 09:08:48
11-Apr-2017 09:08:48   - Installing phpdocumentor/type-resolver (0.2.1)
11-Apr-2017 09:08:49     Downloading: Connecting...    Downloading: 0%               Downloading: 20%    Downloading: 35%    Downloading: 80%    Downloading: 100%    Downloading: 100%
11-Apr-2017 09:08:49
11-Apr-2017 09:08:49   - Installing symfony/yaml (v3.2.0)
11-Apr-2017 09:08:50     Downloading: Connecting...    Downloading: 0%               Downloading: 10%    Downloading: 15%    Downloading: 30%    Downloading: 40%    Downloading: 50%    Downloading: 55%    Downloading: 65%    Downloading: 75%    Downloading: 80%    Downloading: 90%    Downloading: 100%    Downloading: 100%
11-Apr-2017 09:08:50
11-Apr-2017 09:08:50   - Installing sebastian/version (1.0.6)
11-Apr-2017 09:08:51     Downloading: Connecting...    Downloading: 0%               Downloading: 100%    Downloading: 100%
11-Apr-2017 09:08:51
11-Apr-2017 09:08:51   - Installing sebastian/global-state (1.1.1)
11-Apr-2017 09:08:52     Downloading: Connecting...    Downloading: 0%               Downloading: 40%    Downloading: 70%    Downloading: 100%    Downloading: 100%
11-Apr-2017 09:08:52
11-Apr-2017 09:08:52   - Installing sebastian/recursion-context (1.0.2)
11-Apr-2017 09:08:53     Downloading: Connecting...    Downloading: 0%               Downloading: 35%    Downloading: 70%    Downloading: 100%    Downloading: 100%
11-Apr-2017 09:08:53
11-Apr-2017 09:08:53   - Installing sebastian/exporter (1.2.2)
11-Apr-2017 09:08:54     Downloading: Connecting...    Downloading: 0%               Downloading: 100%    Downloading: 100%
11-Apr-2017 09:08:54
11-Apr-2017 09:08:54   - Installing sebastian/environment (1.3.8)
11-Apr-2017 09:08:55     Downloading: Connecting...    Downloading: 0%               Downloading: 15%    Downloading: 30%    Downloading: 45%    Downloading: 60%    Downloading: 75%    Downloading: 100%    Downloading: 100%
11-Apr-2017 09:08:55
11-Apr-2017 09:08:55   - Installing sebastian/diff (1.4.1)
11-Apr-2017 09:08:55     Downloading: Connecting...    Downloading: 0%               Downloading: 15%    Downloading: 30%    Downloading: 45%    Downloading: 100%    Downloading: 100%
11-Apr-2017 09:08:55
11-Apr-2017 09:08:55   - Installing sebastian/comparator (1.2.2)
11-Apr-2017 09:08:56     Downloading: Connecting...    Downloading: 0%               Downloading: 10%    Downloading: 20%    Downloading: 30%    Downloading: 40%    Downloading: 45%    Downloading: 55%    Downloading: 65%    Downloading: 75%    Downloading: 85%    Downloading: 95%    Downloading: 100%    Downloading: 100%
11-Apr-2017 09:08:57
11-Apr-2017 09:08:57   - Installing phpunit/php-text-template (1.2.1)
11-Apr-2017 09:08:57     Downloading: Connecting...    Downloading: 0%               Downloading: 35%    Downloading: 100%    Downloading: 100%
11-Apr-2017 09:08:57
11-Apr-2017 09:08:57   - Installing doctrine/instantiator (1.0.5)
11-Apr-2017 09:08:58     Downloading: Connecting...    Downloading: 0%               Downloading: 15%    Downloading: 30%    Downloading: 45%    Downloading: 50%    Downloading: 65%    Downloading: 80%    Downloading: 95%    Downloading: 100%    Downloading: 100%
11-Apr-2017 09:08:58
11-Apr-2017 09:08:58   - Installing phpunit/phpunit-mock-objects (2.3.8)
11-Apr-2017 09:09:00     Downloading: Connecting...    Downloading: 0%               Downloading: 5%    Downloading: 20%    Downloading: 25%    Downloading: 35%    Downloading: 40%    Downloading: 45%    Downloading: 50%    Downloading: 60%    Downloading: 65%    Downloading: 70%    Downloading: 75%    Downloading: 90%    Downloading: 95%    Downloading: 100%    Downloading: 100%
11-Apr-2017 09:09:00
11-Apr-2017 09:09:00   - Installing phpunit/php-timer (1.0.8)
11-Apr-2017 09:09:01     Downloading: Connecting...    Downloading: 0%               Downloading: 100%    Downloading: 100%
11-Apr-2017 09:09:01
11-Apr-2017 09:09:01   - Installing phpunit/php-file-iterator (1.4.2)
11-Apr-2017 09:09:02     Downloading: Connecting...    Downloading: 0%               Downloading: 20%    Downloading: 40%    Downloading: 60%    Downloading: 100%    Downloading: 100%
11-Apr-2017 09:09:02
11-Apr-2017 09:09:02   - Installing phpunit/php-token-stream (1.4.9)
11-Apr-2017 09:09:03     Downloading: Connecting...    Downloading: 0%               Downloading: 5%    Downloading: 10%    Downloading: 15%    Downloading: 20%    Downloading: 65%    Downloading: 70%    Downloading: 75%    Downloading: 80%    Downloading: 85%    Downloading: 90%    Downloading: 95%    Downloading: 100%    Downloading: 100%
11-Apr-2017 09:09:03
11-Apr-2017 09:09:03   - Installing phpunit/php-code-coverage (2.2.4)
11-Apr-2017 09:09:04     Downloading: Connecting...    Downloading: 0%               Downloading: 5%    Downloading: 10%    Downloading: 15%    Downloading: 20%    Downloading: 25%    Downloading: 30%    Downloading: 35%    Downloading: 40%    Downloading: 45%    Downloading: 50%    Downloading: 55%    Downloading: 60%    Downloading: 65%    Downloading: 70%    Downloading: 75%    Downloading: 80%    Downloading: 85%    Downloading: 90%    Downloading: 95%    Downloading: 100%    Downloading: 100%
11-Apr-2017 09:09:04
11-Apr-2017 09:09:04   - Installing phpspec/prophecy (v1.6.2)
11-Apr-2017 09:09:05     Downloading: Connecting...    Downloading: 0%               Downloading: 5%    Downloading: 10%    Downloading: 15%    Downloading: 20%    Downloading: 25%    Downloading: 30%    Downloading: 35%    Downloading: 40%    Downloading: 45%    Downloading: 50%    Downloading: 55%    Downloading: 60%    Downloading: 65%    Downloading: 70%    Downloading: 75%    Downloading: 80%    Downloading: 85%    Downloading: 90%    Downloading: 95%    Downloading: 100%    Downloading: 100%
11-Apr-2017 09:09:05
11-Apr-2017 09:09:05   - Installing phpunit/phpunit (4.8.31)
11-Apr-2017 09:09:07     Downloading: Connecting...    Downloading: 0%               Downloading: 5%    Downloading: 10%    Downloading: 15%    Downloading: 20%    Downloading: 25%    Downloading: 30%    Downloading: 35%    Downloading: 40%    Downloading: 45%    Downloading: 50%    Downloading: 55%    Downloading: 60%    Downloading: 65%    Downloading: 70%    Downloading: 80%    Downloading: 90%    Downloading: 100%    Downloading: 100%
11-Apr-2017 09:09:07
11-Apr-2017 09:09:07   - Installing phpunit/dbunit (2.0.3)
11-Apr-2017 09:09:08     Downloading: Connecting...    Downloading: 0%               Downloading: 5%    Downloading: 10%    Downloading: 15%    Downloading: 20%    Downloading: 25%    Downloading: 30%    Downloading: 35%    Downloading: 40%    Downloading: 45%    Downloading: 50%    Downloading: 55%    Downloading: 60%    Downloading: 65%    Downloading: 70%    Downloading: 75%    Downloading: 80%    Downloading: 85%    Downloading: 90%    Downloading: 95%    Downloading: 100%    Downloading: 100%
11-Apr-2017 09:09:08
11-Apr-2017 09:09:08   - Installing squizlabs/php_codesniffer (2.7.1)
11-Apr-2017 09:09:09     Downloading: Connecting...    Downloading: 0%               Downloading: 5%    Downloading: 10%    Downloading: 15%    Downloading: 20%    Downloading: 25%    Downloading: 30%    Downloading: 35%    Downloading: 40%    Downloading: 50%    Downloading: 55%    Downloading: 60%    Downloading: 65%    Downloading: 70%    Downloading: 75%    Downloading: 80%    Downloading: 95%    Downloading: 100%    Downloading: 100%
11-Apr-2017 09:09:09
11-Apr-2017 09:09:09   - Installing webmozart/assert (1.2.0)
11-Apr-2017 09:09:11     Downloading: Connecting...    Downloading: 0%               Downloading: 55%    Downloading: 80%    Downloading: 100%    Downloading: 100%
11-Apr-2017 09:09:11
11-Apr-2017 09:09:12 lusitanian/oauth suggests installing predis/predis (Allows using the Redis storage backend.)
11-Apr-2017 09:09:12 paragonie/random_compat suggests installing ext-libsodium (Provides a modern crypto API that can be used to generate random bytes.)
11-Apr-2017 09:09:12 patchwork/utf8 suggests installing ext-intl (Use Intl for best performance)
11-Apr-2017 09:09:12 patchwork/utf8 suggests installing ext-wfio (Use WFIO for UTF-8 filesystem access on Windows)
11-Apr-2017 09:09:12 s9e/text-formatter suggests installing ext-intl (Allows international URLs to be accepted by the URL filter)
11-Apr-2017 09:09:12 s9e/text-formatter suggests installing ext-xsl (Enables the XSLT renderer)
11-Apr-2017 09:09:12 symfony/http-kernel suggests installing symfony/class-loader ()
11-Apr-2017 09:09:12 symfony/http-kernel suggests installing symfony/var-dumper ()
11-Apr-2017 09:09:12 symfony/dependency-injection suggests installing symfony/expression-language (For using expressions in service container configuration)
11-Apr-2017 09:09:12 zendframework/zend-eventmanager suggests installing container-interop/container-interop (^1.1.0, to use the lazy listeners feature)
11-Apr-2017 09:09:12 zendframework/zend-eventmanager suggests installing zendframework/zend-stdlib (^2.7.3 || ^3.0, to use the FilterChain feature)
11-Apr-2017 09:09:12 zendframework/zend-code suggests installing doctrine/annotations (Doctrine\Common\Annotations >=1.0 for annotation features)
11-Apr-2017 09:09:12 zendframework/zend-code suggests installing zendframework/zend-stdlib (Zend\Stdlib component)
11-Apr-2017 09:09:12 ocramius/proxy-manager suggests installing ocramius/generated-hydrator (To have very fast object to array to object conversion for ghost objects)
11-Apr-2017 09:09:12 ocramius/proxy-manager suggests installing zendframework/zend-json (To have the JsonRpc adapter (Remote Object feature))
11-Apr-2017 09:09:12 ocramius/proxy-manager suggests installing zendframework/zend-soap (To have the Soap adapter (Remote Object feature))
11-Apr-2017 09:09:12 ocramius/proxy-manager suggests installing zendframework/zend-stdlib (To use the hydrator proxy)
11-Apr-2017 09:09:12 ocramius/proxy-manager suggests installing zendframework/zend-xmlrpc (To have the XmlRpc adapter (Remote Object feature))
11-Apr-2017 09:09:12 symfony/routing suggests installing doctrine/annotations (For using the annotation loader)
11-Apr-2017 09:09:12 symfony/routing suggests installing symfony/expression-language (For using expression matching)
11-Apr-2017 09:09:12 symfony/twig-bridge suggests installing symfony/asset (For using the AssetExtension)
11-Apr-2017 09:09:12 symfony/twig-bridge suggests installing symfony/expression-language (For using the ExpressionExtension)
11-Apr-2017 09:09:12 symfony/twig-bridge suggests installing symfony/form (For using the FormExtension)
11-Apr-2017 09:09:12 symfony/twig-bridge suggests installing symfony/security (For using the SecurityExtension)
11-Apr-2017 09:09:12 symfony/twig-bridge suggests installing symfony/stopwatch (For using the StopwatchExtension)
11-Apr-2017 09:09:12 symfony/twig-bridge suggests installing symfony/templating (For using the TwigEngine)
11-Apr-2017 09:09:12 symfony/twig-bridge suggests installing symfony/translation (For using the TranslationExtension)
11-Apr-2017 09:09:12 symfony/twig-bridge suggests installing symfony/var-dumper (For using the DumpExtension)
11-Apr-2017 09:09:12 facebook/webdriver suggests installing phpdocumentor/phpdocumentor (2.*)
11-Apr-2017 09:09:12 phpdocumentor/reflection-docblock suggests installing dflydev/markdown (~1.0)
11-Apr-2017 09:09:12 phpdocumentor/reflection-docblock suggests installing erusev/parsedown (~1.0)
11-Apr-2017 09:09:12 sebastian/global-state suggests installing ext-uopz (*)
11-Apr-2017 09:09:12 phpunit/phpunit-mock-objects suggests installing ext-soap (*)
11-Apr-2017 09:09:12 phpunit/phpunit suggests installing phpunit/php-invoker (~1.1)
11-Apr-2017 09:09:12 Generating autoload files
11-Apr-2017 09:09:13 Buildfile: /data/build/build.xml
11-Apr-2017 09:09:13
11-Apr-2017 09:09:13 phpBB > clean:
11-Apr-2017 09:09:13
11-Apr-2017 09:09:13    [delete] Directory /data/build/logs does not exist or is not a directory.
11-Apr-2017 09:09:13    [delete] Directory /data/build/api does not exist or is not a directory.
11-Apr-2017 09:09:13    [delete] Directory /data/build/codebrowser does not exist or is not a directory.
11-Apr-2017 09:09:13    [delete] Directory /data/build/coverage does not exist or is not a directory.
11-Apr-2017 09:09:13    [delete] Directory /data/build/cpd does not exist or is not a directory.
11-Apr-2017 09:09:13    [delete] Directory /data/build/dependencies does not exist or is not a directory.
11-Apr-2017 09:09:13    [delete] Directory /data/build/new_version does not exist or is not a directory.
11-Apr-2017 09:09:13    [delete] Directory /data/build/old_versions does not exist or is not a directory.
11-Apr-2017 09:09:13    [delete] Directory /data/build/save does not exist or is not a directory.
11-Apr-2017 09:09:13
11-Apr-2017 09:09:13 phpBB > prepare:
11-Apr-2017 09:09:13
11-Apr-2017 09:09:13     [mkdir] Created dir: /data/build/logs
11-Apr-2017 09:09:13     [mkdir] Created dir: /data/build/api
11-Apr-2017 09:09:13     [mkdir] Created dir: /data/build/codebrowser
11-Apr-2017 09:09:13     [mkdir] Created dir: /data/build/coverage
11-Apr-2017 09:09:13     [mkdir] Created dir: /data/build/cpd
11-Apr-2017 09:09:13     [mkdir] Created dir: /data/build/dependencies
11-Apr-2017 09:09:13     [mkdir] Created dir: /data/build/new_version
11-Apr-2017 09:09:13     [mkdir] Created dir: /data/build/new_version/files
11-Apr-2017 09:09:13     [mkdir] Created dir: /data/build/new_version/patches
11-Apr-2017 09:09:13     [mkdir] Created dir: /data/build/new_version/release_files
11-Apr-2017 09:09:13     [mkdir] Created dir: /data/build/new_version/update
11-Apr-2017 09:09:13     [mkdir] Created dir: /data/build/old_versions
11-Apr-2017 09:09:13     [mkdir] Created dir: /data/build/save
11-Apr-2017 09:09:13
11-Apr-2017 09:09:13 BUILD FINISHED
11-Apr-2017 09:09:13
11-Apr-2017 09:09:13 Total time: 0.1130 seconds
11-Apr-2017 09:09:13
11-Apr-2017 09:09:13 Finished task 'Prepare directory' with result: Success
11-Apr-2017 09:09:13 Skipping execution of task 'Run sniffs' as it is disabled
11-Apr-2017 09:09:13
Substituting variable: ${bamboo.working.directory} with /home/bamboo/xml-data/build-dir/PHPBB3-PR-JOB1
11-Apr-2017 09:09:13 Starting task 'Run sniffs' of type 'com.atlassian.bamboo.plugins.bamboo-docker-plugin:task.docker.cli'
11-Apr-2017 09:09:13 Running image name (phpbb:php-5.6)
11-Apr-2017 09:09:13
Beginning to execute external process for build 'phpBB3 - Pull Requests - Build and Test Job #6970 (PHPBB3-PR-JOB1-6970)'
... running command line:
/usr/bin/docker run --volume /home/bamboo/xml-data/build-dir/PHPBB3-PR-JOB1:/data --workdir /data/build --rm -u=991 phpbb:php-5.6 ../phpBB/vendor/bin/phing sniff
... in: /home/bamboo/xml-data/build-dir/PHPBB3-PR-JOB1
... using extra environment variables:
bamboo_planRepository_1_branch=3.1.x
bamboo_planRepository_1_branchDisplayName=3.1.x
bamboo_repository_revision_number=3bf133c96ca34195024feb16bed812aa8dc77184
bamboo_PRref=master
bamboo_resultsUrl=https://bamboo.phpbb.com/browse/PHPBB3-PR-JOB1-6970
bamboo_capability_system_builder_command_Git=/usr/bin/git
bamboo_repository_75956235_git_username=bantu
bamboo_planRepository_1_name=phpBB Ascraeus
bamboo_build_working_directory=/home/bamboo/xml-data/build-dir/PHPBB3-PR-JOB1
bamboo_buildKey=PHPBB3-PR-JOB1
bamboo_capability_phpbb_tests=true
bamboo_shortPlanName=Pull Requests
bamboo_capability_system_builder_command_fop=/usr/bin/fop
bamboo_capability_dbms_sqlite_2=true
bamboo_planRepository_name=phpBB Ascraeus
bamboo_PRnumber=4789
bamboo_buildNumber=6970
bamboo_repository_75956235_git_repositoryUrl=https://github.com/phpbb/phpbb.git
bamboo_capability_system_builder_phpunit_PHPUnit=/usr/bin/phpunit
bamboo_shortJobName=Build and Test Job
bamboo_buildResultsUrl=https://bamboo.phpbb.com/browse/PHPBB3-PR-JOB1-6970
bamboo_repository_75956235_branch_name=3.1.x
bamboo_planRepository_repositoryUrl=https://github.com/phpbb/phpbb.git
bamboo_agentId=131073
bamboo_planName=phpBB3 - Pull Requests
bamboo_build_commandline_com_atlassian_bamboo_plugins_scripttask_task_builder_script_7=/bin/sh /home/bamboo/temp/PHPBB3-PR-JOB1-6970-ScriptBuildTask-7760612421244672713.sh
bamboo_shortPlanKey=PR
bamboo_shortJobKey=JOB1
bamboo_capability_dbms_mysql_55=true
bamboo_capability_system_jdk_JDK_1_7_0_65=/usr/lib/jvm/java-7-openjdk-amd64
bamboo_planRepository_revision=3bf133c96ca34195024feb16bed812aa8dc77184
bamboo_repository_previous_revision_number=3bf133c96ca34195024feb16bed812aa8dc77184
bamboo_buildTimeStamp=2017-04-11T09:07:54.236Z
bamboo_planRepository_previousRevision=3bf133c96ca34195024feb16bed812aa8dc77184
bamboo_capability_system_builder_mvn2_Maven_2=/usr/share/maven2
bamboo_capability_system_jdk_JDK_1_6_0_16=/usr/lib/jvm/java-6-sun-1.6.0.16
bamboo_build_commandline_com_atlassian_bamboo_plugins_scripttask_task_builder_script_4=/bin/sh /home/bamboo/temp/PHPBB3-PR-JOB1-6970-ScriptBuildTask-3850658871084853690.sh
bamboo_buildResultKey=PHPBB3-PR-JOB1-6970
bamboo_repository_git_branch=3.1.x
bamboo_repository_branch_name=3.1.x
bamboo_buildPlanName=phpBB3 - Pull Requests - Build and Test Job
bamboo_planRepository_1_revision=3bf133c96ca34195024feb16bed812aa8dc77184
bamboo_repository_name=phpBB Ascraeus
bamboo_capability_system_docker_executable=/usr/bin/docker
bamboo_build_commandline_com_atlassian_bamboo_plugins_bamboo_docker_plugin_task_docker_cli_12=/usr/bin/docker run --volume /home/bamboo/xml-data/build-dir/PHPBB3-PR-JOB1:/data --workdir /data/phpBB --rm -e HOME=/home/bamboo -u=991 phpbb:php-5.6 /bin/bash -c php ../composer.phar install --dev; cd ../build; ../phpBB/vendor/bin/phing clean prepare
bamboo_planRepository_branch=3.1.x
bamboo_agentWorkingDirectory=/home/bamboo/xml-data/build-dir
bamboo_capability_system_git_executable=/usr/bin/git
bamboo_planRepository_1_previousRevision=3bf133c96ca34195024feb16bed812aa8dc77184
bamboo_capability_system_builder_phpunit_PHPUnit_3_4=/usr/bin/phpunit
bamboo_repository_git_username=bantu
bamboo_repository_75956235_revision_number=3bf133c96ca34195024feb16bed812aa8dc77184
bamboo_planRepository_branchDisplayName=3.1.x
bamboo_planRepository_1_type=gitv2
bamboo_planRepository_branchName=3.1.x
bamboo_repository_75956235_previous_revision_number=3bf133c96ca34195024feb16bed812aa8dc77184
bamboo_capability_system_jdk_JDK=/usr/lib/jvm/java-6-sun
bamboo_plan_storageTag=PHPBB3-PR
bamboo_planRepository_type=gitv2
bamboo_planRepository_1_username=bantu
bamboo_ManualBuildTriggerReason_userName=Build Robot
bamboo_repository_git_repositoryUrl=https://github.com/phpbb/phpbb.git
bamboo_repository_75956235_git_branch=3.1.x
bamboo_capability_system_builder_ant_Ant=/usr/share/ant
bamboo_repository_75956235_name=phpBB Ascraeus
bamboo_working_directory=/home/bamboo/xml-data/build-dir/PHPBB3-PR-JOB1
bamboo_planKey=PHPBB3-PR
bamboo_planRepository_1_repositoryUrl=https://github.com/phpbb/phpbb.git
bamboo_planRepository_username=bantu
bamboo_capability_local=true
bamboo_capability_system_jdk_JDK_1_6=/usr/lib/jvm/java-6-sun
bamboo_capability_system_jdk_JDK_1_7=/usr/lib/jvm/java-7-openjdk-amd64
bamboo_planRepository_1_branchName=3.1.x
11-Apr-2017 09:09:13 Buildfile: /data/build/build.xml
11-Apr-2017 09:09:13
11-Apr-2017 09:09:13 phpBB > sniff:
11-Apr-2017 09:09:13
11-Apr-2017 09:09:21 ............................................................  60 / 682 (9%)
11-Apr-2017 09:09:23 ............................................................ 120 / 682 (18%)
11-Apr-2017 09:09:24 ............................................................ 180 / 682 (26%)
11-Apr-2017 09:09:25 ............................................................ 240 / 682 (35%)
11-Apr-2017 09:09:31 ............................................................ 300 / 682 (44%)
11-Apr-2017 09:09:35 ............................................................ 360 / 682 (53%)
11-Apr-2017 09:09:41 ............................................................ 420 / 682 (62%)
11-Apr-2017 09:09:44 ............................................................ 480 / 682 (70%)
11-Apr-2017 09:09:48 ............................................................ 540 / 682 (79%)
11-Apr-2017 09:09:53 ............................................................ 600 / 682 (88%)
11-Apr-2017 09:09:55 ....................................................E....... 660 / 682 (97%)
11-Apr-2017 09:09:56 ......................
11-Apr-2017 09:09:56
11-Apr-2017 09:09:56
11-Apr-2017 09:09:56 FILE: /data/phpBB/phpbb/style/manager.php
11-Apr-2017 09:09:56 ----------------------------------------------------------------------
11-Apr-2017 09:09:56 FOUND 2 ERRORS AFFECTING 2 LINES
11-Apr-2017 09:09:56 ----------------------------------------------------------------------
11-Apr-2017 09:09:56 16 | ERROR | There must not be unused USE statements.
11-Apr-2017 09:09:56     |       | (phpbb.Namespaces.UnusedUse.Unused)
11-Apr-2017 09:09:56 45 | ERROR | Arguments with default values must be at the end of the
11-Apr-2017 09:09:56     |       | argument list (PEAR.Functions.ValidDefaultValue.NotAtEnd)
11-Apr-2017 09:09:56 ----------------------------------------------------------------------
11-Apr-2017 09:09:56
11-Apr-2017 09:09:56 Time: 42.43 secs; Memory: 77.25Mb
11-Apr-2017 09:09:56
11-Apr-2017 09:10:04 ............................................................  60 / 206 (29%)
11-Apr-2017 09:10:23 ............................................................ 120 / 206 (58%)
11-Apr-2017 09:10:38 ............................................................ 180 / 206 (87%)
11-Apr-2017 09:10:46 ..........................
11-Apr-2017 09:10:46
11-Apr-2017 09:10:46 Time: 49.65 secs; Memory: 60.25Mb
11-Apr-2017 09:10:46
11-Apr-2017 09:10:46
11-Apr-2017 09:10:46
11-Apr-2017 09:10:46 Time: 17ms; Memory: 3.75Mb
11-Apr-2017 09:10:46
11-Apr-2017 09:10:46        [if] Error in IfTask
11-Apr-2017 09:10:46 Execution of target "sniff" failed for the following reason: /data/build/build.xml:108:6: /data/build/build.xml:114:9: PHP Code Sniffer failed.
11-Apr-2017 09:10:46
11-Apr-2017 09:10:46 BUILD FAILED
11-Apr-2017 09:10:46 /data/build/build.xml:108:6: /data/build/build.xml:114:9: PHP Code Sniffer failed.
11-Apr-2017 09:10:46 Total time: 2 minutes  32.47 seconds
11-Apr-2017 09:10:46
11-Apr-2017 09:10:46 Failing task since return code of [/usr/bin/docker run --volume /home/bamboo/xml-data/build-dir/PHPBB3-PR-JOB1:/data --workdir /data/build --rm -u=991 phpbb:php-5.6 ../phpBB/vendor/bin/phing sniff] was 1 while expected 0
11-Apr-2017 09:10:46 Error occurred while running Task 'Run sniffs(11)' of type com.atlassian.bamboo.plugins.bamboo-docker-plugin:task.docker.cli.
11-Apr-2017 09:10:46 com.atlassian.bamboo.task.TaskException: Failed to execute task
11-Apr-2017 09:10:46         at com.atlassian.bamboo.plugins.docker.service.RunService.execute(RunService.java:71)
11-Apr-2017 09:10:46         at com.atlassian.bamboo.plugins.docker.tasks.cli.DockerCliTask.execute(DockerCliTask.java:60)
11-Apr-2017 09:10:46         at com.atlassian.bamboo.task.TaskExecutorImpl.lambda$executeTasks$3(TaskExecutorImpl.java:317)
11-Apr-2017 09:10:46         at com.atlassian.bamboo.task.TaskExecutorImpl.executeTaskWithPrePostActions(TaskExecutorImpl.java:246)
11-Apr-2017 09:10:46         at com.atlassian.bamboo.task.TaskExecutorImpl.executeTasks(TaskExecutorImpl.java:317)
11-Apr-2017 09:10:46         at com.atlassian.bamboo.task.TaskExecutorImpl.execute(TaskExecutorImpl.java:118)
11-Apr-2017 09:10:46         at com.atlassian.bamboo.build.pipeline.tasks.ExecuteBuildTask.call(ExecuteBuildTask.java:74)
11-Apr-2017 09:10:46         at com.atlassian.bamboo.v2.build.agent.DefaultBuildAgent.build(DefaultBuildAgent.java:216)
11-Apr-2017 09:10:46         at com.atlassian.bamboo.v2.build.agent.BuildAgentControllerImpl$1.call(BuildAgentControllerImpl.java:139)
11-Apr-2017 09:10:46         at com.atlassian.bamboo.v2.build.agent.BuildAgentControllerImpl$1.call(BuildAgentControllerImpl.java:130)
11-Apr-2017 09:10:46         at com.atlassian.bamboo.variable.CustomVariableContextImpl.withVariableSubstitutor(CustomVariableContextImpl.java:221)
11-Apr-2017 09:10:46         at com.atlassian.bamboo.v2.build.agent.BuildAgentControllerImpl.waitAndPerformBuild(BuildAgentControllerImpl.java:129)
11-Apr-2017 09:10:46         at com.atlassian.bamboo.v2.build.agent.DefaultBuildAgent$1.run(DefaultBuildAgent.java:138)
11-Apr-2017 09:10:46         at com.atlassian.bamboo.utils.BambooRunnables$1.run(BambooRunnables.java:51)
11-Apr-2017 09:10:46         at com.atlassian.bamboo.security.ImpersonationHelper.runWith(ImpersonationHelper.java:31)
11-Apr-2017 09:10:46         at com.atlassian.bamboo.security.ImpersonationHelper.runWithSystemAuthority(ImpersonationHelper.java:20)
11-Apr-2017 09:10:46         at com.atlassian.bamboo.security.ImpersonationHelper$1.run(ImpersonationHelper.java:52)
11-Apr-2017 09:10:46         at java.lang.Thread.run(Thread.java:745)
11-Apr-2017 09:10:46 Caused by: com.atlassian.bamboo.plugins.docker.client.DockerException: Error running Docker run command
11-Apr-2017 09:10:46         at com.atlassian.bamboo.plugins.docker.client.DockerCmd.run(DockerCmd.java:103)
11-Apr-2017 09:10:46         at com.atlassian.bamboo.plugins.docker.service.RunService.execute(RunService.java:60)
11-Apr-2017 09:10:46         ... 17 more
11-Apr-2017 09:10:46 Caused by: com.atlassian.utils.process.ProcessException: Error executing /usr/bin/docker run --volume /home/bamboo/xml-data/build-dir/PHPBB3-PR-JOB1:/data --workdir /data/build --rm -u=991 phpbb:php-5.6 ../phpBB/vendor/bin/phing sniff
11-Apr-2017 09:10:46         at com.atlassian.bamboo.plugins.docker.process.DockerTaskProcessService.execute(DockerTaskProcessService.java:60)
11-Apr-2017 09:10:46         at com.atlassian.bamboo.plugins.docker.client.DockerCmd.run(DockerCmd.java:99)
11-Apr-2017 09:10:46         ... 18 more
11-Apr-2017 09:10:46 Starting task 'Parsing test results produced by script' of type 'com.atlassian.bamboo.plugins.testresultparser:task.testresultparser.junit'
11-Apr-2017 09:10:46 Parsing test results under /home/bamboo/xml-data/build-dir/PHPBB3-PR-JOB1...
11-Apr-2017 09:10:46 Failing task since test cases were expected but none were found.
11-Apr-2017 09:10:46 Finished task 'Parsing test results produced by script' with result: Failed
11-Apr-2017 09:10:46
Substituting variable: ${bamboo.PRnumber} with 4789
11-Apr-2017 09:10:46
Substituting variable: ${bamboo.buildResultsUrl} with https://bamboo.phpbb.com/browse/PHPBB3-PR-JOB1-6970
11-Apr-2017 09:10:46
Substituting variable: ${bamboo.buildResultsUrl} with https://bamboo.phpbb.com/browse/PHPBB3-PR-JOB1-6970
11-Apr-2017 09:10:46 Starting task 'Set result build status' of type 'com.atlassian.bamboo.plugins.scripttask:task.builder.script'
11-Apr-2017 09:10:46
Beginning to execute external process for build 'phpBB3 - Pull Requests - Build and Test Job #6970 (PHPBB3-PR-JOB1-6970)'
... running command line:
/bin/sh /home/bamboo/temp/PHPBB3-PR-JOB1-6970-ScriptBuildTask-8789834319955486080.sh
... in: /home/bamboo/xml-data/build-dir/PHPBB3-PR-JOB1
... using extra environment variables:
bamboo_planRepository_1_branch=3.1.x
bamboo_planRepository_1_branchDisplayName=3.1.x
bamboo_repository_revision_number=3bf133c96ca34195024feb16bed812aa8dc77184
bamboo_PRref=master
bamboo_resultsUrl=https://bamboo.phpbb.com/browse/PHPBB3-PR-JOB1-6970
bamboo_capability_system_builder_command_Git=/usr/bin/git
bamboo_repository_75956235_git_username=bantu
bamboo_planRepository_1_name=phpBB Ascraeus
bamboo_build_working_directory=/home/bamboo/xml-data/build-dir/PHPBB3-PR-JOB1
bamboo_buildKey=PHPBB3-PR-JOB1
bamboo_capability_phpbb_tests=true
bamboo_shortPlanName=Pull Requests
bamboo_capability_system_builder_command_fop=/usr/bin/fop
bamboo_capability_dbms_sqlite_2=true
bamboo_planRepository_name=phpBB Ascraeus
bamboo_PRnumber=4789
bamboo_buildNumber=6970
bamboo_repository_75956235_git_repositoryUrl=https://github.com/phpbb/phpbb.git
bamboo_capability_system_builder_phpunit_PHPUnit=/usr/bin/phpunit
bamboo_shortJobName=Build and Test Job
bamboo_buildResultsUrl=https://bamboo.phpbb.com/browse/PHPBB3-PR-JOB1-6970
bamboo_repository_75956235_branch_name=3.1.x
bamboo_planRepository_repositoryUrl=https://github.com/phpbb/phpbb.git
bamboo_agentId=131073
bamboo_planName=phpBB3 - Pull Requests
bamboo_build_commandline_com_atlassian_bamboo_plugins_scripttask_task_builder_script_7=/bin/sh /home/bamboo/temp/PHPBB3-PR-JOB1-6970-ScriptBuildTask-7760612421244672713.sh
bamboo_shortPlanKey=PR
bamboo_shortJobKey=JOB1
bamboo_capability_dbms_mysql_55=true
bamboo_capability_system_jdk_JDK_1_7_0_65=/usr/lib/jvm/java-7-openjdk-amd64
bamboo_planRepository_revision=3bf133c96ca34195024feb16bed812aa8dc77184
bamboo_repository_previous_revision_number=3bf133c96ca34195024feb16bed812aa8dc77184
bamboo_buildTimeStamp=2017-04-11T09:07:54.236Z
bamboo_planRepository_previousRevision=3bf133c96ca34195024feb16bed812aa8dc77184
bamboo_capability_system_builder_mvn2_Maven_2=/usr/share/maven2
bamboo_capability_system_jdk_JDK_1_6_0_16=/usr/lib/jvm/java-6-sun-1.6.0.16
bamboo_build_commandline_com_atlassian_bamboo_plugins_scripttask_task_builder_script_4=/bin/sh /home/bamboo/temp/PHPBB3-PR-JOB1-6970-ScriptBuildTask-3850658871084853690.sh
bamboo_buildResultKey=PHPBB3-PR-JOB1-6970
bamboo_repository_git_branch=3.1.x
bamboo_repository_branch_name=3.1.x
bamboo_buildPlanName=phpBB3 - Pull Requests - Build and Test Job
bamboo_planRepository_1_revision=3bf133c96ca34195024feb16bed812aa8dc77184
bamboo_repository_name=phpBB Ascraeus
bamboo_capability_system_docker_executable=/usr/bin/docker
bamboo_build_commandline_com_atlassian_bamboo_plugins_bamboo_docker_plugin_task_docker_cli_11=/usr/bin/docker run --volume /home/bamboo/xml-data/build-dir/PHPBB3-PR-JOB1:/data --workdir /data/build --rm -u=991 phpbb:php-5.6 ../phpBB/vendor/bin/phing sniff
bamboo_build_commandline_com_atlassian_bamboo_plugins_bamboo_docker_plugin_task_docker_cli_12=/usr/bin/docker run --volume /home/bamboo/xml-data/build-dir/PHPBB3-PR-JOB1:/data --workdir /data/phpBB --rm -e HOME=/home/bamboo -u=991 phpbb:php-5.6 /bin/bash -c php ../composer.phar install --dev; cd ../build; ../phpBB/vendor/bin/phing clean prepare
bamboo_planRepository_branch=3.1.x
bamboo_agentWorkingDirectory=/home/bamboo/xml-data/build-dir
bamboo_capability_system_git_executable=/usr/bin/git
bamboo_planRepository_1_previousRevision=3bf133c96ca34195024feb16bed812aa8dc77184
bamboo_capability_system_builder_phpunit_PHPUnit_3_4=/usr/bin/phpunit
bamboo_repository_git_username=bantu
bamboo_repository_75956235_revision_number=3bf133c96ca34195024feb16bed812aa8dc77184
bamboo_planRepository_branchDisplayName=3.1.x
bamboo_planRepository_1_type=gitv2
bamboo_planRepository_branchName=3.1.x
bamboo_repository_75956235_previous_revision_number=3bf133c96ca34195024feb16bed812aa8dc77184
bamboo_capability_system_jdk_JDK=/usr/lib/jvm/java-6-sun
bamboo_plan_storageTag=PHPBB3-PR
bamboo_planRepository_type=gitv2
bamboo_planRepository_1_username=bantu
bamboo_ManualBuildTriggerReason_userName=Build Robot
bamboo_repository_git_repositoryUrl=https://github.com/phpbb/phpbb.git
bamboo_repository_75956235_git_branch=3.1.x
bamboo_capability_system_builder_ant_Ant=/usr/share/ant
bamboo_repository_75956235_name=phpBB Ascraeus
bamboo_working_directory=/home/bamboo/xml-data/build-dir/PHPBB3-PR-JOB1
bamboo_planKey=PHPBB3-PR
bamboo_planRepository_1_repositoryUrl=https://github.com/phpbb/phpbb.git
bamboo_planRepository_username=bantu
bamboo_capability_local=true
bamboo_capability_system_jdk_JDK_1_6=/usr/lib/jvm/java-6-sun
bamboo_capability_system_jdk_JDK_1_7=/usr/lib/jvm/java-7-openjdk-amd64
bamboo_planRepository_1_branchName=3.1.x
11-Apr-2017 09:10:46 From https://github.com/phpbb/phpbb
11-Apr-2017 09:10:46 * branch            refs/pull/4789/head -> FETCH_HEAD
11-Apr-2017 09:10:46 grep: build/logs/phpunit.xml: No such file or directory
11-Apr-2017 09:10:46 grep: build/logs/phpunit.xml: No such file or directory
11-Apr-2017 09:10:46   % Total    % Received % Xferd  Average Speed   Time    Time     Time  Current
11-Apr-2017 09:10:46                                  Dload  Upload   Total   Spent    Left  Speed
11-Apr-2017 09:10:46
11-Apr-2017 09:10:47   0     0    0     0    0     0      0      0 --:--:-- --:--:-- --:--:--     0
11-Apr-2017 09:10:47   0     0    0     0    0     0      0      0 --:--:-- --:--:-- --:--:--     0
11-Apr-2017 09:10:47 100   273  100    93  100   180    124    240 --:--:-- --:--:-- --:--:--   240
11-Apr-2017 09:10:47 Finished task 'Set result build status' with result: Success
11-Apr-2017 09:10:47 Running post build plugin 'NCover Results Collector'
11-Apr-2017 09:10:47 Running post build plugin 'Artifact Copier'
11-Apr-2017 09:10:47 Running post build plugin 'npm Cache Cleanup'
11-Apr-2017 09:10:47 Running post build plugin 'Clover Results Collector'
11-Apr-2017 09:10:47 Running post build plugin 'Docker Container Cleanup'
11-Apr-2017 09:10:47 Successfully removed working directory at '/home/bamboo/xml-data/build-dir/PHPBB3-PR-JOB1'
11-Apr-2017 09:10:47 Finalising the build...
11-Apr-2017 09:10:47 Stopping timer.
11-Apr-2017 09:10:47 Build PHPBB3-PR-JOB1-6970 completed.
11-Apr-2017 09:10:47 Running on server: post build plugin 'NCover Results Collector'
11-Apr-2017 09:10:47 Running on server: post build plugin 'Build Hanging Detection Configuration'
11-Apr-2017 09:10:47 Running on server: post build plugin 'Clover Delta Calculator'
11-Apr-2017 09:10:47 Running on server: post build plugin 'Maven Dependencies Postprocessor'
11-Apr-2017 09:10:47 All post build plugins have finished
11-Apr-2017 09:10:47 Generating build results summary...
11-Apr-2017 09:10:48 Saving build results to disk...
11-Apr-2017 09:10:48 Logging substituted variables...
11-Apr-2017 09:10:48 Indexing build results...
11-Apr-2017 09:10:48 Finished building PHPBB3-PR-JOB1-6970.
11-Apr-2017 09:10:48
Substituting variable: ${bamboo.PRnumber} with 4789