Tests pending pull requests

Build: #6972 failed

Job: Build and Test Job failed

Stages & jobs

  1. Build and Test

Build log

The build generated 458 lines of output. Download or view full build log

12-Apr-2017 18:17:49 Build phpBB3 - Pull Requests - Build and Test Job #6972 (PHPBB3-PR-JOB1-6972) started building on agent Default Agent
12-Apr-2017 18:17:49
12-Apr-2017 18:17:49 Build working directory is /home/bamboo/xml-data/build-dir/PHPBB3-PR-JOB1
12-Apr-2017 18:17:49 Executing build phpBB3 - Pull Requests - Build and Test Job #6972 (PHPBB3-PR-JOB1-6972)
12-Apr-2017 18:17:49 Starting task 'Checkout develop branch' of type 'com.atlassian.bamboo.plugins.vcs:task.vcs.checkout'
12-Apr-2017 18:17:49 Build always requires a clean checkout
12-Apr-2017 18:17:49 Cleaning build directory '/home/bamboo/xml-data/build-dir/PHPBB3-PR-JOB1'
12-Apr-2017 18:17:49 Updating source code to revision: f9a596c544fb6677d822cd78d16987d8e751b729
12-Apr-2017 18:17:49 Fetching 'refs/heads/3.1.x' from 'https://github.com/phpbb/phpbb.git'.
12-Apr-2017 18:17:49 Checking out revision f9a596c544fb6677d822cd78d16987d8e751b729.
12-Apr-2017 18:17:49 Creating local git repository in '/home/bamboo/xml-data/build-dir/PHPBB3-PR-JOB1/.git'.
12-Apr-2017 18:17:49 Cloning into '/home/bamboo/xml-data/build-dir/PHPBB3-PR-JOB1'...
12-Apr-2017 18:17:49 done.
12-Apr-2017 18:17:51 Branch 3.1.x set up to track remote branch 3.1.x from origin.
12-Apr-2017 18:17:51 Switched to a new branch '3.1.x'
12-Apr-2017 18:17:51 Updated source code to revision: f9a596c544fb6677d822cd78d16987d8e751b729
12-Apr-2017 18:17:51 Finished task 'Checkout develop branch' with result: Success
12-Apr-2017 18:17:51 Running pre-build action: VCS Version Collector
12-Apr-2017 18:17:51
Substituting variable: ${bamboo.PRnumber} with 4789
12-Apr-2017 18:17:51
Substituting variable: ${bamboo.buildResultsUrl} with https://bamboo.phpbb.com/browse/PHPBB3-PR-JOB1-6972
12-Apr-2017 18:17:51 Starting task 'Set pending build status' of type 'com.atlassian.bamboo.plugins.scripttask:task.builder.script'
12-Apr-2017 18:17:51
Beginning to execute external process for build 'phpBB3 - Pull Requests - Build and Test Job #6972 (PHPBB3-PR-JOB1-6972)'
... running command line:
/bin/sh /home/bamboo/temp/PHPBB3-PR-JOB1-6972-ScriptBuildTask-3159731943081773505.sh
... in: /home/bamboo/xml-data/build-dir/PHPBB3-PR-JOB1
... using extra environment variables:
bamboo_planRepository_1_branch=3.1.x
bamboo_planRepository_1_branchDisplayName=3.1.x
bamboo_repository_revision_number=f9a596c544fb6677d822cd78d16987d8e751b729
bamboo_PRref=master
bamboo_resultsUrl=https://bamboo.phpbb.com/browse/PHPBB3-PR-JOB1-6972
bamboo_capability_system_builder_command_Git=/usr/bin/git
bamboo_repository_75956235_git_username=bantu
bamboo_planRepository_1_name=phpBB Ascraeus
bamboo_build_working_directory=/home/bamboo/xml-data/build-dir/PHPBB3-PR-JOB1
bamboo_buildKey=PHPBB3-PR-JOB1
bamboo_capability_phpbb_tests=true
bamboo_shortPlanName=Pull Requests
bamboo_capability_system_builder_command_fop=/usr/bin/fop
bamboo_capability_dbms_sqlite_2=true
bamboo_planRepository_name=phpBB Ascraeus
bamboo_PRnumber=4789
bamboo_buildNumber=6972
bamboo_repository_75956235_git_repositoryUrl=https://github.com/phpbb/phpbb.git
bamboo_capability_system_builder_phpunit_PHPUnit=/usr/bin/phpunit
bamboo_shortJobName=Build and Test Job
bamboo_buildResultsUrl=https://bamboo.phpbb.com/browse/PHPBB3-PR-JOB1-6972
bamboo_repository_75956235_branch_name=3.1.x
bamboo_planRepository_repositoryUrl=https://github.com/phpbb/phpbb.git
bamboo_agentId=131073
bamboo_planName=phpBB3 - Pull Requests
bamboo_shortPlanKey=PR
bamboo_shortJobKey=JOB1
bamboo_capability_dbms_mysql_55=true
bamboo_capability_system_jdk_JDK_1_7_0_65=/usr/lib/jvm/java-7-openjdk-amd64
bamboo_planRepository_revision=f9a596c544fb6677d822cd78d16987d8e751b729
bamboo_repository_previous_revision_number=f9a596c544fb6677d822cd78d16987d8e751b729
bamboo_buildTimeStamp=2017-04-12T18:17:49.462Z
bamboo_planRepository_previousRevision=f9a596c544fb6677d822cd78d16987d8e751b729
bamboo_capability_system_builder_mvn2_Maven_2=/usr/share/maven2
bamboo_capability_system_jdk_JDK_1_6_0_16=/usr/lib/jvm/java-6-sun-1.6.0.16
bamboo_buildResultKey=PHPBB3-PR-JOB1-6972
bamboo_repository_git_branch=3.1.x
bamboo_repository_branch_name=3.1.x
bamboo_buildPlanName=phpBB3 - Pull Requests - Build and Test Job
bamboo_planRepository_1_revision=f9a596c544fb6677d822cd78d16987d8e751b729
bamboo_repository_name=phpBB Ascraeus
bamboo_capability_system_docker_executable=/usr/bin/docker
bamboo_planRepository_branch=3.1.x
bamboo_agentWorkingDirectory=/home/bamboo/xml-data/build-dir
bamboo_capability_system_git_executable=/usr/bin/git
bamboo_planRepository_1_previousRevision=f9a596c544fb6677d822cd78d16987d8e751b729
bamboo_capability_system_builder_phpunit_PHPUnit_3_4=/usr/bin/phpunit
bamboo_repository_git_username=bantu
bamboo_repository_75956235_revision_number=f9a596c544fb6677d822cd78d16987d8e751b729
bamboo_planRepository_branchDisplayName=3.1.x
bamboo_planRepository_1_type=gitv2
bamboo_planRepository_branchName=3.1.x
bamboo_repository_75956235_previous_revision_number=f9a596c544fb6677d822cd78d16987d8e751b729
bamboo_capability_system_jdk_JDK=/usr/lib/jvm/java-6-sun
bamboo_plan_storageTag=PHPBB3-PR
bamboo_planRepository_type=gitv2
bamboo_planRepository_1_username=bantu
bamboo_ManualBuildTriggerReason_userName=Build Robot
bamboo_repository_git_repositoryUrl=https://github.com/phpbb/phpbb.git
bamboo_repository_75956235_git_branch=3.1.x
bamboo_capability_system_builder_ant_Ant=/usr/share/ant
bamboo_repository_75956235_name=phpBB Ascraeus
bamboo_working_directory=/home/bamboo/xml-data/build-dir/PHPBB3-PR-JOB1
bamboo_planKey=PHPBB3-PR
bamboo_planRepository_1_repositoryUrl=https://github.com/phpbb/phpbb.git
bamboo_planRepository_username=bantu
bamboo_capability_local=true
bamboo_capability_system_jdk_JDK_1_6=/usr/lib/jvm/java-6-sun
bamboo_capability_system_jdk_JDK_1_7=/usr/lib/jvm/java-7-openjdk-amd64
bamboo_planRepository_1_branchName=3.1.x
12-Apr-2017 18:17:52 From https://github.com/phpbb/phpbb
12-Apr-2017 18:17:52 * branch            refs/pull/4789/head -> FETCH_HEAD
12-Apr-2017 18:17:52   % Total    % Received % Xferd  Average Speed   Time    Time     Time  Current
12-Apr-2017 18:17:52                                  Dload  Upload   Total   Spent    Left  Speed
12-Apr-2017 18:17:52
12-Apr-2017 18:17:53   0     0    0     0    0     0      0      0 --:--:-- --:--:-- --:--:--     0
12-Apr-2017 18:17:53   0     0    0     0    0     0      0      0 --:--:-- --:--:-- --:--:--     0
12-Apr-2017 18:17:53 100   275  100    93  100   182    127    249 --:--:-- --:--:-- --:--:--   248
12-Apr-2017 18:17:53 Finished task 'Set pending build status' with result: Success
12-Apr-2017 18:17:53
Substituting variable: ${bamboo.PRnumber} with 4789
12-Apr-2017 18:17:53 Starting task 'Fetch PR' of type 'com.atlassian.bamboo.plugins.scripttask:task.builder.script'
12-Apr-2017 18:17:53
Beginning to execute external process for build 'phpBB3 - Pull Requests - Build and Test Job #6972 (PHPBB3-PR-JOB1-6972)'
... running command line:
/bin/sh /home/bamboo/temp/PHPBB3-PR-JOB1-6972-ScriptBuildTask-2972159734984263098.sh
... in: /home/bamboo/xml-data/build-dir/PHPBB3-PR-JOB1
... using extra environment variables:
bamboo_planRepository_1_branch=3.1.x
bamboo_planRepository_1_branchDisplayName=3.1.x
bamboo_repository_revision_number=f9a596c544fb6677d822cd78d16987d8e751b729
bamboo_PRref=master
bamboo_resultsUrl=https://bamboo.phpbb.com/browse/PHPBB3-PR-JOB1-6972
bamboo_capability_system_builder_command_Git=/usr/bin/git
bamboo_repository_75956235_git_username=bantu
bamboo_planRepository_1_name=phpBB Ascraeus
bamboo_build_working_directory=/home/bamboo/xml-data/build-dir/PHPBB3-PR-JOB1
bamboo_buildKey=PHPBB3-PR-JOB1
bamboo_capability_phpbb_tests=true
bamboo_shortPlanName=Pull Requests
bamboo_capability_system_builder_command_fop=/usr/bin/fop
bamboo_capability_dbms_sqlite_2=true
bamboo_planRepository_name=phpBB Ascraeus
bamboo_PRnumber=4789
bamboo_buildNumber=6972
bamboo_repository_75956235_git_repositoryUrl=https://github.com/phpbb/phpbb.git
bamboo_capability_system_builder_phpunit_PHPUnit=/usr/bin/phpunit
bamboo_shortJobName=Build and Test Job
bamboo_buildResultsUrl=https://bamboo.phpbb.com/browse/PHPBB3-PR-JOB1-6972
bamboo_repository_75956235_branch_name=3.1.x
bamboo_planRepository_repositoryUrl=https://github.com/phpbb/phpbb.git
bamboo_agentId=131073
bamboo_planName=phpBB3 - Pull Requests
bamboo_build_commandline_com_atlassian_bamboo_plugins_scripttask_task_builder_script_7=/bin/sh /home/bamboo/temp/PHPBB3-PR-JOB1-6972-ScriptBuildTask-3159731943081773505.sh
bamboo_shortPlanKey=PR
bamboo_shortJobKey=JOB1
bamboo_capability_dbms_mysql_55=true
bamboo_capability_system_jdk_JDK_1_7_0_65=/usr/lib/jvm/java-7-openjdk-amd64
bamboo_planRepository_revision=f9a596c544fb6677d822cd78d16987d8e751b729
bamboo_repository_previous_revision_number=f9a596c544fb6677d822cd78d16987d8e751b729
bamboo_buildTimeStamp=2017-04-12T18:17:49.462Z
bamboo_planRepository_previousRevision=f9a596c544fb6677d822cd78d16987d8e751b729
bamboo_capability_system_builder_mvn2_Maven_2=/usr/share/maven2
bamboo_capability_system_jdk_JDK_1_6_0_16=/usr/lib/jvm/java-6-sun-1.6.0.16
bamboo_buildResultKey=PHPBB3-PR-JOB1-6972
bamboo_repository_git_branch=3.1.x
bamboo_repository_branch_name=3.1.x
bamboo_buildPlanName=phpBB3 - Pull Requests - Build and Test Job
bamboo_planRepository_1_revision=f9a596c544fb6677d822cd78d16987d8e751b729
bamboo_repository_name=phpBB Ascraeus
bamboo_capability_system_docker_executable=/usr/bin/docker
bamboo_planRepository_branch=3.1.x
bamboo_agentWorkingDirectory=/home/bamboo/xml-data/build-dir
bamboo_capability_system_git_executable=/usr/bin/git
bamboo_planRepository_1_previousRevision=f9a596c544fb6677d822cd78d16987d8e751b729
bamboo_capability_system_builder_phpunit_PHPUnit_3_4=/usr/bin/phpunit
bamboo_repository_git_username=bantu
bamboo_repository_75956235_revision_number=f9a596c544fb6677d822cd78d16987d8e751b729
bamboo_planRepository_branchDisplayName=3.1.x
bamboo_planRepository_1_type=gitv2
bamboo_planRepository_branchName=3.1.x
bamboo_repository_75956235_previous_revision_number=f9a596c544fb6677d822cd78d16987d8e751b729
bamboo_capability_system_jdk_JDK=/usr/lib/jvm/java-6-sun
bamboo_plan_storageTag=PHPBB3-PR
bamboo_planRepository_type=gitv2
bamboo_planRepository_1_username=bantu
bamboo_ManualBuildTriggerReason_userName=Build Robot
bamboo_repository_git_repositoryUrl=https://github.com/phpbb/phpbb.git
bamboo_repository_75956235_git_branch=3.1.x
bamboo_capability_system_builder_ant_Ant=/usr/share/ant
bamboo_repository_75956235_name=phpBB Ascraeus
bamboo_working_directory=/home/bamboo/xml-data/build-dir/PHPBB3-PR-JOB1
bamboo_planKey=PHPBB3-PR
bamboo_planRepository_1_repositoryUrl=https://github.com/phpbb/phpbb.git
bamboo_planRepository_username=bantu
bamboo_capability_local=true
bamboo_capability_system_jdk_JDK_1_6=/usr/lib/jvm/java-6-sun
bamboo_capability_system_jdk_JDK_1_7=/usr/lib/jvm/java-7-openjdk-amd64
bamboo_planRepository_1_branchName=3.1.x
12-Apr-2017 18:17:54 From https://github.com/phpbb/phpbb
12-Apr-2017 18:17:54 * branch            refs/pull/4789/merge -> FETCH_HEAD
12-Apr-2017 18:17:54 Note: checking out 'FETCH_HEAD'.
12-Apr-2017 18:17:54
12-Apr-2017 18:17:54 You are in 'detached HEAD' state. You can look around, make experimental
12-Apr-2017 18:17:54 changes and commit them, and you can discard any commits you make in this
12-Apr-2017 18:17:54 state without impacting any branches by performing another checkout.
12-Apr-2017 18:17:54
12-Apr-2017 18:17:54 If you want to create a new branch to retain commits you create, you may
12-Apr-2017 18:17:54 do so (now or later) by using -b with the checkout command again. Example:
12-Apr-2017 18:17:54
12-Apr-2017 18:17:54   git checkout -b new_branch_name
12-Apr-2017 18:17:54
12-Apr-2017 18:17:54 HEAD is now at 4e3e716... Merge 5e8703f6d6ae16bafebe6be6b0d6f72636027a43 into fba85954212019dd5f2e4ccbf884de87fbe3c19b
12-Apr-2017 18:17:54 Finished task 'Fetch PR' with result: Success
12-Apr-2017 18:17:54 Skipping execution of task 'Prepare directory' as it is disabled
12-Apr-2017 18:17:54
Substituting variable: ${bamboo.working.directory} with /home/bamboo/xml-data/build-dir/PHPBB3-PR-JOB1
12-Apr-2017 18:17:54 Starting task 'Prepare directory' of type 'com.atlassian.bamboo.plugins.bamboo-docker-plugin:task.docker.cli'
12-Apr-2017 18:17:54 Running image name (phpbb:php-5.6)
12-Apr-2017 18:17:54
Beginning to execute external process for build 'phpBB3 - Pull Requests - Build and Test Job #6972 (PHPBB3-PR-JOB1-6972)'
... running command line:
/usr/bin/docker run --volume /home/bamboo/xml-data/build-dir/PHPBB3-PR-JOB1:/data --workdir /data/phpBB --rm -e HOME=/home/bamboo -u=991 phpbb:php-5.6 /bin/bash -c php ../composer.phar install --dev; cd ../build; ../phpBB/vendor/bin/phing clean prepare
... in: /home/bamboo/xml-data/build-dir/PHPBB3-PR-JOB1
... using extra environment variables:
bamboo_planRepository_1_branch=3.1.x
bamboo_planRepository_1_branchDisplayName=3.1.x
bamboo_repository_revision_number=f9a596c544fb6677d822cd78d16987d8e751b729
bamboo_PRref=master
bamboo_resultsUrl=https://bamboo.phpbb.com/browse/PHPBB3-PR-JOB1-6972
bamboo_capability_system_builder_command_Git=/usr/bin/git
bamboo_repository_75956235_git_username=bantu
bamboo_planRepository_1_name=phpBB Ascraeus
bamboo_build_working_directory=/home/bamboo/xml-data/build-dir/PHPBB3-PR-JOB1
bamboo_buildKey=PHPBB3-PR-JOB1
bamboo_capability_phpbb_tests=true
bamboo_shortPlanName=Pull Requests
bamboo_capability_system_builder_command_fop=/usr/bin/fop
bamboo_capability_dbms_sqlite_2=true
bamboo_planRepository_name=phpBB Ascraeus
bamboo_PRnumber=4789
bamboo_buildNumber=6972
bamboo_repository_75956235_git_repositoryUrl=https://github.com/phpbb/phpbb.git
bamboo_capability_system_builder_phpunit_PHPUnit=/usr/bin/phpunit
bamboo_shortJobName=Build and Test Job
bamboo_buildResultsUrl=https://bamboo.phpbb.com/browse/PHPBB3-PR-JOB1-6972
bamboo_repository_75956235_branch_name=3.1.x
bamboo_planRepository_repositoryUrl=https://github.com/phpbb/phpbb.git
bamboo_agentId=131073
bamboo_planName=phpBB3 - Pull Requests
bamboo_build_commandline_com_atlassian_bamboo_plugins_scripttask_task_builder_script_7=/bin/sh /home/bamboo/temp/PHPBB3-PR-JOB1-6972-ScriptBuildTask-3159731943081773505.sh
bamboo_shortPlanKey=PR
bamboo_shortJobKey=JOB1
bamboo_capability_dbms_mysql_55=true
bamboo_capability_system_jdk_JDK_1_7_0_65=/usr/lib/jvm/java-7-openjdk-amd64
bamboo_planRepository_revision=f9a596c544fb6677d822cd78d16987d8e751b729
bamboo_repository_previous_revision_number=f9a596c544fb6677d822cd78d16987d8e751b729
bamboo_buildTimeStamp=2017-04-12T18:17:49.462Z
bamboo_planRepository_previousRevision=f9a596c544fb6677d822cd78d16987d8e751b729
bamboo_capability_system_builder_mvn2_Maven_2=/usr/share/maven2
bamboo_capability_system_jdk_JDK_1_6_0_16=/usr/lib/jvm/java-6-sun-1.6.0.16
bamboo_build_commandline_com_atlassian_bamboo_plugins_scripttask_task_builder_script_4=/bin/sh /home/bamboo/temp/PHPBB3-PR-JOB1-6972-ScriptBuildTask-2972159734984263098.sh
bamboo_buildResultKey=PHPBB3-PR-JOB1-6972
bamboo_repository_git_branch=3.1.x
bamboo_repository_branch_name=3.1.x
bamboo_buildPlanName=phpBB3 - Pull Requests - Build and Test Job
bamboo_planRepository_1_revision=f9a596c544fb6677d822cd78d16987d8e751b729
bamboo_repository_name=phpBB Ascraeus
bamboo_capability_system_docker_executable=/usr/bin/docker
bamboo_planRepository_branch=3.1.x
bamboo_agentWorkingDirectory=/home/bamboo/xml-data/build-dir
bamboo_capability_system_git_executable=/usr/bin/git
bamboo_planRepository_1_previousRevision=f9a596c544fb6677d822cd78d16987d8e751b729
bamboo_capability_system_builder_phpunit_PHPUnit_3_4=/usr/bin/phpunit
bamboo_repository_git_username=bantu
bamboo_repository_75956235_revision_number=f9a596c544fb6677d822cd78d16987d8e751b729
bamboo_planRepository_branchDisplayName=3.1.x
bamboo_planRepository_1_type=gitv2
bamboo_planRepository_branchName=3.1.x
bamboo_repository_75956235_previous_revision_number=f9a596c544fb6677d822cd78d16987d8e751b729
bamboo_capability_system_jdk_JDK=/usr/lib/jvm/java-6-sun
bamboo_plan_storageTag=PHPBB3-PR
bamboo_planRepository_type=gitv2
bamboo_planRepository_1_username=bantu
bamboo_ManualBuildTriggerReason_userName=Build Robot
bamboo_repository_git_repositoryUrl=https://github.com/phpbb/phpbb.git
bamboo_repository_75956235_git_branch=3.1.x
bamboo_capability_system_builder_ant_Ant=/usr/share/ant
bamboo_repository_75956235_name=phpBB Ascraeus
bamboo_working_directory=/home/bamboo/xml-data/build-dir/PHPBB3-PR-JOB1
bamboo_planKey=PHPBB3-PR
bamboo_planRepository_1_repositoryUrl=https://github.com/phpbb/phpbb.git
bamboo_planRepository_username=bantu
bamboo_capability_local=true
bamboo_capability_system_jdk_JDK_1_6=/usr/lib/jvm/java-6-sun
bamboo_capability_system_jdk_JDK_1_7=/usr/lib/jvm/java-7-openjdk-amd64
bamboo_planRepository_1_branchName=3.1.x
12-Apr-2017 18:17:54 You are running composer with xdebug enabled. This has a major impact on runtime performance. See https://getcomposer.org/xdebug
12-Apr-2017 18:17:54 You are using the deprecated option "dev". Dev packages are installed by default now.
12-Apr-2017 18:17:54 Cannot create cache directory /home/bamboo/.composer/cache/repo/https---packagist.org/, or directory is not writable. Proceeding without cache
12-Apr-2017 18:17:54 Cannot create cache directory /home/bamboo/.composer/cache/files/, or directory is not writable. Proceeding without cache
12-Apr-2017 18:17:54 Loading composer repositories with package information
12-Apr-2017 18:17:54 Installing dependencies (including require-dev) from lock file
12-Apr-2017 18:17:55   - Installing bantu/ini-get-wrapper (v1.0.1)
12-Apr-2017 18:17:57     Downloading: Connecting...    Downloading: 100%         
12-Apr-2017 18:17:57
12-Apr-2017 18:17:57   - Installing google/recaptcha (1.1.2)
12-Apr-2017 18:17:58     Downloading: Connecting...    Downloading: 0%               Downloading: 30%    Downloading: 55%    Downloading: 80%    Downloading: 85%    Downloading: 100%
12-Apr-2017 18:17:58
12-Apr-2017 18:17:58   - Installing guzzlehttp/promises (1.3.0)
12-Apr-2017 18:17:59     Downloading: Connecting...    Downloading: 0%               Downloading: 15%    Downloading: 25%    Downloading: 40%    Downloading: 60%    Downloading: 70%    Downloading: 80%    Downloading: 95%    Downloading: 100%    Downloading: 100%
12-Apr-2017 18:17:59
12-Apr-2017 18:17:59   - Installing psr/http-message (1.0.1)
12-Apr-2017 18:18:00     Downloading: Connecting...    Downloading: 0%               Downloading: 50%    Downloading: 100%
12-Apr-2017 18:18:00
12-Apr-2017 18:18:00   - Installing guzzlehttp/psr7 (1.3.1)
12-Apr-2017 18:18:01     Downloading: Connecting...    Downloading: 0%               Downloading: 5%    Downloading: 15%    Downloading: 20%    Downloading: 30%    Downloading: 35%    Downloading: 45%    Downloading: 50%    Downloading: 65%    Downloading: 70%    Downloading: 85%    Downloading: 90%    Downloading: 100%    Downloading: 100%
12-Apr-2017 18:18:01
12-Apr-2017 18:18:01   - Installing lusitanian/oauth (v0.8.9)
12-Apr-2017 18:18:02     Downloading: Connecting...    Downloading: 0%               Downloading: 5%    Downloading: 10%    Downloading: 15%    Downloading: 20%    Downloading: 25%    Downloading: 30%    Downloading: 35%    Downloading: 40%    Downloading: 45%    Downloading: 50%    Downloading: 55%    Downloading: 60%    Downloading: 65%    Downloading: 70%    Downloading: 75%    Downloading: 80%    Downloading: 85%    Downloading: 90%    Downloading: 95%    Downloading: 100%    Downloading: 100%
12-Apr-2017 18:18:03
12-Apr-2017 18:18:03   - Installing marc1706/fast-image-size (v1.1.2)
12-Apr-2017 18:18:04     Downloading: Connecting...    Downloading: 100%         
12-Apr-2017 18:18:04
12-Apr-2017 18:18:04   - Installing paragonie/random_compat (v1.4.1)
12-Apr-2017 18:18:05     Downloading: Connecting...    Downloading: 0%               Downloading: 20%    Downloading: 30%    Downloading: 50%    Downloading: 65%    Downloading: 85%    Downloading: 100%    Downloading: 100%
12-Apr-2017 18:18:05
12-Apr-2017 18:18:05   - Installing patchwork/utf8 (v1.3.1)
12-Apr-2017 18:18:06     Downloading: Connecting...    Downloading: 0%               Downloading: 5%    Downloading: 10%    Downloading: 15%    Downloading: 20%    Downloading: 25%    Downloading: 30%    Downloading: 35%    Downloading: 40%    Downloading: 45%    Downloading: 50%    Downloading: 55%    Downloading: 60%    Downloading: 65%    Downloading: 70%    Downloading: 75%    Downloading: 80%    Downloading: 85%    Downloading: 90%    Downloading: 95%    Downloading: 100%    Downloading: 100%
12-Apr-2017 18:18:06
12-Apr-2017 18:18:06   - Installing s9e/text-formatter (0.9.1)
12-Apr-2017 18:18:08     Downloading: Connecting...    Downloading: 100%         
12-Apr-2017 18:18:08
12-Apr-2017 18:18:08   - Installing symfony/filesystem (v3.2.0)
12-Apr-2017 18:18:09     Downloading: Connecting...    Downloading: 0%               Downloading: 35%    Downloading: 40%    Downloading: 75%    Downloading: 95%    Downloading: 100%    Downloading: 100%
12-Apr-2017 18:18:09
12-Apr-2017 18:18:09   - Installing symfony/config (v3.2.0)
12-Apr-2017 18:18:10     Downloading: Connecting...    Downloading: 0%               Downloading: 5%    Downloading: 15%    Downloading: 20%    Downloading: 30%    Downloading: 35%    Downloading: 40%    Downloading: 50%    Downloading: 55%    Downloading: 60%    Downloading: 70%    Downloading: 75%    Downloading: 85%    Downloading: 90%    Downloading: 95%    Downloading: 100%
12-Apr-2017 18:18:10
12-Apr-2017 18:18:10   - Installing symfony/finder (v3.2.0)
12-Apr-2017 18:18:11     Downloading: Connecting...    Downloading: 0%               Downloading: 5%    Downloading: 10%    Downloading: 15%    Downloading: 20%    Downloading: 25%    Downloading: 100%
12-Apr-2017 18:18:11
12-Apr-2017 18:18:11   - Installing symfony/polyfill-mbstring (v1.3.0)
12-Apr-2017 18:18:12     Downloading: Connecting...    Downloading: 0%               Downloading: 35%    Downloading: 70%    Downloading: 100%    Downloading: 100%
12-Apr-2017 18:18:12
12-Apr-2017 18:18:12   - Installing symfony/http-foundation (v3.2.0)
12-Apr-2017 18:18:13     Downloading: Connecting...    Downloading: 100%         
12-Apr-2017 18:18:13
12-Apr-2017 18:18:13   - Installing symfony/event-dispatcher (v3.2.0)
12-Apr-2017 18:18:14     Downloading: Connecting...    Downloading: 0%               Downloading: 5%    Downloading: 10%    Downloading: 15%    Downloading: 100%
12-Apr-2017 18:18:14
12-Apr-2017 18:18:14   - Installing psr/log (1.0.2)
12-Apr-2017 18:18:15     Downloading: Connecting...    Downloading: 0%               Downloading: 15%    Downloading: 100%
12-Apr-2017 18:18:15
12-Apr-2017 18:18:15   - Installing symfony/debug (v3.2.0)
12-Apr-2017 18:18:16     Downloading: Connecting...    Downloading: 0%               Downloading: 5%    Downloading: 25%    Downloading: 30%    Downloading: 50%    Downloading: 55%    Downloading: 60%    Downloading: 80%    Downloading: 85%    Downloading: 90%    Downloading: 100%
12-Apr-2017 18:18:16
12-Apr-2017 18:18:16   - Installing symfony/http-kernel (v3.2.0)
12-Apr-2017 18:18:17     Downloading: Connecting...    Downloading: 0%               Downloading: 5%    Downloading: 10%    Downloading: 15%    Downloading: 20%    Downloading: 25%    Downloading: 30%    Downloading: 35%    Downloading: 40%    Downloading: 45%    Downloading: 50%    Downloading: 55%    Downloading: 60%    Downloading: 65%    Downloading: 70%    Downloading: 75%    Downloading: 80%    Downloading: 85%    Downloading: 90%    Downloading: 95%    Downloading: 100%    Downloading: 100%
12-Apr-2017 18:18:18
12-Apr-2017 18:18:18   - Installing symfony/dependency-injection (v3.2.0)
12-Apr-2017 18:18:19     Downloading: Connecting...    Downloading: 100%         
12-Apr-2017 18:18:19
12-Apr-2017 18:18:19   - Installing zendframework/zend-eventmanager (3.0.1)
12-Apr-2017 18:18:20     Downloading: Connecting...    Downloading: 0%               Downloading: 15%    Downloading: 30%    Downloading: 55%    Downloading: 70%    Downloading: 80%    Downloading: 100%
12-Apr-2017 18:18:20
12-Apr-2017 18:18:20   - Installing zendframework/zend-code (2.6.3)
12-Apr-2017 18:18:21     Downloading: Connecting...    Downloading: 0%               Downloading: 5%    Downloading: 10%    Downloading: 15%    Downloading: 20%    Downloading: 25%    Downloading: 30%    Downloading: 35%    Downloading: 40%    Downloading: 45%    Downloading: 50%    Downloading: 55%    Downloading: 60%    Downloading: 65%    Downloading: 70%    Downloading: 75%    Downloading: 80%    Downloading: 85%    Downloading: 90%    Downloading: 95%    Downloading: 100%    Downloading: 100%
12-Apr-2017 18:18:21
12-Apr-2017 18:18:21   - Installing ocramius/proxy-manager (1.0.2)
12-Apr-2017 18:18:22     Downloading: Connecting...    Downloading: 0%               Downloading: 5%    Downloading: 10%    Downloading: 15%    Downloading: 20%    Downloading: 25%    Downloading: 30%    Downloading: 35%    Downloading: 40%    Downloading: 45%    Downloading: 50%    Downloading: 60%    Downloading: 65%    Downloading: 70%    Downloading: 75%    Downloading: 80%    Downloading: 85%    Downloading: 90%    Downloading: 95%    Downloading: 100%    Downloading: 100%
12-Apr-2017 18:18:23
12-Apr-2017 18:18:23   - Installing symfony/proxy-manager-bridge (v3.2.0)
12-Apr-2017 18:18:24     Downloading: Connecting...    Downloading: 100%         
12-Apr-2017 18:18:24
12-Apr-2017 18:18:24   - Installing symfony/routing (v3.2.0)
12-Apr-2017 18:18:25     Downloading: Connecting...    Downloading: 0%               Downloading: 5%    Downloading: 10%    Downloading: 15%    Downloading: 20%    Downloading: 25%    Downloading: 30%    Downloading: 35%    Downloading: 40%    Downloading: 45%    Downloading: 50%    Downloading: 55%    Downloading: 60%    Downloading: 65%    Downloading: 70%    Downloading: 75%    Downloading: 80%    Downloading: 85%    Downloading: 90%    Downloading: 95%    Downloading: 100%
12-Apr-2017 18:18:25
12-Apr-2017 18:18:25   - Installing twig/twig (v1.24.2)
12-Apr-2017 18:18:26     Downloading: Connecting...    Downloading: 0%               Downloading: 5%    Downloading: 10%    Downloading: 15%    Downloading: 20%    Downloading: 25%    Downloading: 30%    Downloading: 35%    Downloading: 40%    Downloading: 45%    Downloading: 50%    Downloading: 55%    Downloading: 60%    Downloading: 65%    Downloading: 70%    Downloading: 75%    Downloading: 80%    Downloading: 85%    Downloading: 90%    Downloading: 95%    Downloading: 100%    Downloading: 100%
12-Apr-2017 18:18:26
12-Apr-2017 18:18:26   - Installing symfony/twig-bridge (v3.1.4)
12-Apr-2017 18:18:28     Downloading: Connecting...    Downloading: 100%         
12-Apr-2017 18:18:28
12-Apr-2017 18:18:28   - Installing symfony/dom-crawler (v3.2.0)
12-Apr-2017 18:18:29     Downloading: Connecting...    Downloading: 100%         
12-Apr-2017 18:18:29
12-Apr-2017 18:18:29   - Installing symfony/css-selector (v3.2.0)
12-Apr-2017 18:18:30     Downloading: Connecting...    Downloading: 0%               Downloading: 5%    Downloading: 10%    Downloading: 15%    Downloading: 20%    Downloading: 65%    Downloading: 70%    Downloading: 75%    Downloading: 80%    Downloading: 85%    Downloading: 90%    Downloading: 95%    Downloading: 100%
12-Apr-2017 18:18:30
12-Apr-2017 18:18:30   - Installing symfony/browser-kit (v3.2.0)
12-Apr-2017 18:18:32     Downloading: Connecting...    Downloading: 0%               Downloading: 50%    Downloading: 100%
12-Apr-2017 18:18:32
12-Apr-2017 18:18:32   - Installing guzzlehttp/guzzle (6.2.2)
12-Apr-2017 18:18:33     Downloading: Connecting...    Downloading: 0%               Downloading: 5%    Downloading: 10%    Downloading: 15%    Downloading: 20%    Downloading: 25%    Downloading: 35%    Downloading: 40%    Downloading: 50%    Downloading: 55%    Downloading: 65%    Downloading: 70%    Downloading: 75%    Downloading: 80%    Downloading: 85%    Downloading: 95%    Downloading: 100%    Downloading: 100%
12-Apr-2017 18:18:33
12-Apr-2017 18:18:33   - Installing fabpot/goutte (v3.2.0)
12-Apr-2017 18:18:34     Downloading: Connecting...    Downloading: 0%               Downloading: 70%    Downloading: 100%    Downloading: 100%
12-Apr-2017 18:18:34
12-Apr-2017 18:18:34   - Installing facebook/webdriver (1.2.0)
12-Apr-2017 18:18:35     Downloading: Connecting...    Downloading: 0%               Downloading: 5%    Downloading: 10%    Downloading: 15%    Downloading: 20%    Downloading: 25%    Downloading: 30%    Downloading: 35%    Downloading: 40%    Downloading: 45%    Downloading: 50%    Downloading: 55%    Downloading: 60%    Downloading: 65%    Downloading: 70%    Downloading: 75%    Downloading: 80%    Downloading: 85%    Downloading: 90%    Downloading: 95%    Downloading: 100%    Downloading: 100%
12-Apr-2017 18:18:35
12-Apr-2017 18:18:35   - Installing symfony/process (v3.2.0)
12-Apr-2017 18:18:36     Downloading: Connecting...    Downloading: 0%               Downloading: 20%    Downloading: 35%    Downloading: 50%    Downloading: 65%    Downloading: 70%    Downloading: 85%    Downloading: 100%    Downloading: 100%
12-Apr-2017 18:18:36
12-Apr-2017 18:18:36   - Installing symfony/console (v3.2.0)
12-Apr-2017 18:18:37     Downloading: Connecting...    Downloading: 100%         
12-Apr-2017 18:18:37
12-Apr-2017 18:18:37   - Installing laravel/homestead (v4.0.5)
12-Apr-2017 18:18:38     Downloading: Connecting...    Downloading: 0%               Downloading: 5%    Downloading: 10%    Downloading: 100%
12-Apr-2017 18:18:38
12-Apr-2017 18:18:38   - Installing phing/phing (2.4.14)
12-Apr-2017 18:18:40     Downloading: Connecting...    Downloading: 0%               Downloading: 5%    Downloading: 10%    Downloading: 15%    Downloading: 20%    Downloading: 25%    Downloading: 30%    Downloading: 35%    Downloading: 40%    Downloading: 45%    Downloading: 50%    Downloading: 55%    Downloading: 60%    Downloading: 65%    Downloading: 70%    Downloading: 75%    Downloading: 80%    Downloading: 85%    Downloading: 90%    Downloading: 95%    Downloading: 100%    Downloading: 100%
12-Apr-2017 18:18:40
12-Apr-2017 18:18:40   - Installing phpdocumentor/reflection-docblock (2.0.4)
12-Apr-2017 18:18:41     Downloading: Connecting...    Downloading: 0%               Downloading: 15%    Downloading: 20%    Downloading: 40%    Downloading: 45%    Downloading: 60%    Downloading: 75%    Downloading: 80%    Downloading: 95%    Downloading: 100%    Downloading: 100%
12-Apr-2017 18:18:41
12-Apr-2017 18:18:41   - Installing phpdocumentor/reflection-common (1.0)
12-Apr-2017 18:18:42     Downloading: Connecting...    Downloading: 0%               Downloading: 65%    Downloading: 100%    Downloading: 100%
12-Apr-2017 18:18:42
12-Apr-2017 18:18:42   - Installing phpdocumentor/type-resolver (0.2.1)
12-Apr-2017 18:18:43     Downloading: Connecting...    Downloading: 0%               Downloading: 20%    Downloading: 35%    Downloading: 80%    Downloading: 100%    Downloading: 100%
12-Apr-2017 18:18:43
12-Apr-2017 18:18:43   - Installing symfony/yaml (v3.2.0)
12-Apr-2017 18:18:44     Downloading: Connecting...    Downloading: 0%               Downloading: 10%    Downloading: 15%    Downloading: 25%    Downloading: 40%    Downloading: 50%    Downloading: 65%    Downloading: 75%    Downloading: 85%    Downloading: 90%    Downloading: 100%
12-Apr-2017 18:18:44
12-Apr-2017 18:18:44   - Installing sebastian/version (1.0.6)
12-Apr-2017 18:18:45     Downloading: Connecting...    Downloading: 0%               Downloading: 100%    Downloading: 100%
12-Apr-2017 18:18:45
12-Apr-2017 18:18:45   - Installing sebastian/global-state (1.1.1)
12-Apr-2017 18:18:46     Downloading: Connecting...    Downloading: 0%               Downloading: 40%    Downloading: 70%    Downloading: 100%    Downloading: 100%
12-Apr-2017 18:18:46
12-Apr-2017 18:18:46   - Installing sebastian/recursion-context (1.0.2)
12-Apr-2017 18:18:47     Downloading: Connecting...    Downloading: 0%               Downloading: 35%    Downloading: 70%    Downloading: 100%    Downloading: 100%
12-Apr-2017 18:18:47
12-Apr-2017 18:18:47   - Installing sebastian/exporter (1.2.2)
12-Apr-2017 18:18:48     Downloading: Connecting...    Downloading: 0%               Downloading: 100%    Downloading: 100%
12-Apr-2017 18:18:48
12-Apr-2017 18:18:48   - Installing sebastian/environment (1.3.8)
12-Apr-2017 18:18:49     Downloading: Connecting...    Downloading: 0%               Downloading: 15%    Downloading: 30%    Downloading: 45%    Downloading: 60%    Downloading: 75%    Downloading: 100%    Downloading: 100%
12-Apr-2017 18:18:49
12-Apr-2017 18:18:49   - Installing sebastian/diff (1.4.1)
12-Apr-2017 18:18:50     Downloading: Connecting...    Downloading: 0%               Downloading: 15%    Downloading: 30%    Downloading: 45%    Downloading: 100%    Downloading: 100%
12-Apr-2017 18:18:50
12-Apr-2017 18:18:50   - Installing sebastian/comparator (1.2.2)
12-Apr-2017 18:18:51     Downloading: Connecting...    Downloading: 0%               Downloading: 10%    Downloading: 20%    Downloading: 30%    Downloading: 40%    Downloading: 45%    Downloading: 55%    Downloading: 65%    Downloading: 70%    Downloading: 80%    Downloading: 90%    Downloading: 100%    Downloading: 100%
12-Apr-2017 18:18:51
12-Apr-2017 18:18:51   - Installing phpunit/php-text-template (1.2.1)
12-Apr-2017 18:18:52     Downloading: Connecting...    Downloading: 0%               Downloading: 35%    Downloading: 100%    Downloading: 100%
12-Apr-2017 18:18:52
12-Apr-2017 18:18:52   - Installing doctrine/instantiator (1.0.5)
12-Apr-2017 18:18:53     Downloading: Connecting...    Downloading: 0%               Downloading: 15%    Downloading: 30%    Downloading: 45%    Downloading: 60%    Downloading: 75%    Downloading: 90%    Downloading: 100%
12-Apr-2017 18:18:53
12-Apr-2017 18:18:53   - Installing phpunit/phpunit-mock-objects (2.3.8)
12-Apr-2017 18:18:54     Downloading: Connecting...    Downloading: 0%               Downloading: 5%    Downloading: 20%    Downloading: 25%    Downloading: 35%    Downloading: 40%    Downloading: 45%    Downloading: 50%    Downloading: 55%    Downloading: 65%    Downloading: 70%    Downloading: 75%    Downloading: 80%    Downloading: 90%    Downloading: 95%    Downloading: 100%    Downloading: 100%
12-Apr-2017 18:18:54
12-Apr-2017 18:18:54   - Installing phpunit/php-timer (1.0.8)
12-Apr-2017 18:18:55     Downloading: Connecting...    Downloading: 0%               Downloading: 100%    Downloading: 100%
12-Apr-2017 18:18:55
12-Apr-2017 18:18:55   - Installing phpunit/php-file-iterator (1.4.2)
12-Apr-2017 18:18:56     Downloading: Connecting...    Downloading: 0%               Downloading: 20%    Downloading: 40%    Downloading: 60%    Downloading: 100%    Downloading: 100%
12-Apr-2017 18:18:56
12-Apr-2017 18:18:56   - Installing phpunit/php-token-stream (1.4.9)
12-Apr-2017 18:18:57     Downloading: Connecting...    Downloading: 0%               Downloading: 5%    Downloading: 10%    Downloading: 15%    Downloading: 20%    Downloading: 65%    Downloading: 70%    Downloading: 75%    Downloading: 80%    Downloading: 85%    Downloading: 90%    Downloading: 95%    Downloading: 100%    Downloading: 100%
12-Apr-2017 18:18:57
12-Apr-2017 18:18:57   - Installing phpunit/php-code-coverage (2.2.4)
12-Apr-2017 18:18:58     Downloading: Connecting...    Downloading: 0%               Downloading: 5%    Downloading: 10%    Downloading: 15%    Downloading: 20%    Downloading: 25%    Downloading: 30%    Downloading: 35%    Downloading: 40%    Downloading: 45%    Downloading: 50%    Downloading: 55%    Downloading: 60%    Downloading: 65%    Downloading: 70%    Downloading: 80%    Downloading: 90%    Downloading: 95%    Downloading: 100%    Downloading: 100%
12-Apr-2017 18:18:58
12-Apr-2017 18:18:58   - Installing phpspec/prophecy (v1.6.2)
12-Apr-2017 18:19:00     Downloading: Connecting...    Downloading: 0%               Downloading: 5%    Downloading: 10%    Downloading: 15%    Downloading: 20%    Downloading: 25%    Downloading: 30%    Downloading: 35%    Downloading: 40%    Downloading: 45%    Downloading: 50%    Downloading: 55%    Downloading: 60%    Downloading: 65%    Downloading: 70%    Downloading: 75%    Downloading: 80%    Downloading: 85%    Downloading: 90%    Downloading: 95%    Downloading: 100%    Downloading: 100%
12-Apr-2017 18:19:00
12-Apr-2017 18:19:00   - Installing phpunit/phpunit (4.8.31)
12-Apr-2017 18:19:01     Downloading: Connecting...    Downloading: 0%               Downloading: 5%    Downloading: 10%    Downloading: 15%    Downloading: 20%    Downloading: 25%    Downloading: 30%    Downloading: 35%    Downloading: 40%    Downloading: 45%    Downloading: 50%    Downloading: 55%    Downloading: 60%    Downloading: 65%    Downloading: 75%    Downloading: 85%    Downloading: 90%    Downloading: 95%    Downloading: 100%    Downloading: 100%
12-Apr-2017 18:19:01
12-Apr-2017 18:19:01   - Installing phpunit/dbunit (2.0.3)
12-Apr-2017 18:19:03     Downloading: Connecting...    Downloading: 0%               Downloading: 5%    Downloading: 10%    Downloading: 15%    Downloading: 20%    Downloading: 25%    Downloading: 30%    Downloading: 35%    Downloading: 40%    Downloading: 45%    Downloading: 50%    Downloading: 55%    Downloading: 60%    Downloading: 65%    Downloading: 70%    Downloading: 75%    Downloading: 80%    Downloading: 85%    Downloading: 90%    Downloading: 95%    Downloading: 100%    Downloading: 100%
12-Apr-2017 18:19:03
12-Apr-2017 18:19:03   - Installing squizlabs/php_codesniffer (2.7.1)
12-Apr-2017 18:19:04     Downloading: Connecting...    Downloading: 0%               Downloading: 5%    Downloading: 10%    Downloading: 15%    Downloading: 20%    Downloading: 25%    Downloading: 30%    Downloading: 35%    Downloading: 40%    Downloading: 55%    Downloading: 60%    Downloading: 65%    Downloading: 70%    Downloading: 75%    Downloading: 80%    Downloading: 85%    Downloading: 95%    Downloading: 100%    Downloading: 100%
12-Apr-2017 18:19:04
12-Apr-2017 18:19:04   - Installing webmozart/assert (1.2.0)
12-Apr-2017 18:19:05     Downloading: Connecting...    Downloading: 0%               Downloading: 55%    Downloading: 75%    Downloading: 95%    Downloading: 100%
12-Apr-2017 18:19:05
12-Apr-2017 18:19:07 lusitanian/oauth suggests installing predis/predis (Allows using the Redis storage backend.)
12-Apr-2017 18:19:07 paragonie/random_compat suggests installing ext-libsodium (Provides a modern crypto API that can be used to generate random bytes.)
12-Apr-2017 18:19:07 patchwork/utf8 suggests installing ext-intl (Use Intl for best performance)
12-Apr-2017 18:19:07 patchwork/utf8 suggests installing ext-wfio (Use WFIO for UTF-8 filesystem access on Windows)
12-Apr-2017 18:19:07 s9e/text-formatter suggests installing ext-intl (Allows international URLs to be accepted by the URL filter)
12-Apr-2017 18:19:07 s9e/text-formatter suggests installing ext-xsl (Enables the XSLT renderer)
12-Apr-2017 18:19:07 symfony/http-kernel suggests installing symfony/class-loader ()
12-Apr-2017 18:19:07 symfony/http-kernel suggests installing symfony/var-dumper ()
12-Apr-2017 18:19:07 symfony/dependency-injection suggests installing symfony/expression-language (For using expressions in service container configuration)
12-Apr-2017 18:19:07 zendframework/zend-eventmanager suggests installing container-interop/container-interop (^1.1.0, to use the lazy listeners feature)
12-Apr-2017 18:19:07 zendframework/zend-eventmanager suggests installing zendframework/zend-stdlib (^2.7.3 || ^3.0, to use the FilterChain feature)
12-Apr-2017 18:19:07 zendframework/zend-code suggests installing doctrine/annotations (Doctrine\Common\Annotations >=1.0 for annotation features)
12-Apr-2017 18:19:07 zendframework/zend-code suggests installing zendframework/zend-stdlib (Zend\Stdlib component)
12-Apr-2017 18:19:07 ocramius/proxy-manager suggests installing ocramius/generated-hydrator (To have very fast object to array to object conversion for ghost objects)
12-Apr-2017 18:19:07 ocramius/proxy-manager suggests installing zendframework/zend-json (To have the JsonRpc adapter (Remote Object feature))
12-Apr-2017 18:19:07 ocramius/proxy-manager suggests installing zendframework/zend-soap (To have the Soap adapter (Remote Object feature))
12-Apr-2017 18:19:07 ocramius/proxy-manager suggests installing zendframework/zend-stdlib (To use the hydrator proxy)
12-Apr-2017 18:19:07 ocramius/proxy-manager suggests installing zendframework/zend-xmlrpc (To have the XmlRpc adapter (Remote Object feature))
12-Apr-2017 18:19:07 symfony/routing suggests installing doctrine/annotations (For using the annotation loader)
12-Apr-2017 18:19:07 symfony/routing suggests installing symfony/expression-language (For using expression matching)
12-Apr-2017 18:19:07 symfony/twig-bridge suggests installing symfony/asset (For using the AssetExtension)
12-Apr-2017 18:19:07 symfony/twig-bridge suggests installing symfony/expression-language (For using the ExpressionExtension)
12-Apr-2017 18:19:07 symfony/twig-bridge suggests installing symfony/form (For using the FormExtension)
12-Apr-2017 18:19:07 symfony/twig-bridge suggests installing symfony/security (For using the SecurityExtension)
12-Apr-2017 18:19:07 symfony/twig-bridge suggests installing symfony/stopwatch (For using the StopwatchExtension)
12-Apr-2017 18:19:07 symfony/twig-bridge suggests installing symfony/templating (For using the TwigEngine)
12-Apr-2017 18:19:07 symfony/twig-bridge suggests installing symfony/translation (For using the TranslationExtension)
12-Apr-2017 18:19:07 symfony/twig-bridge suggests installing symfony/var-dumper (For using the DumpExtension)
12-Apr-2017 18:19:07 facebook/webdriver suggests installing phpdocumentor/phpdocumentor (2.*)
12-Apr-2017 18:19:07 phpdocumentor/reflection-docblock suggests installing dflydev/markdown (~1.0)
12-Apr-2017 18:19:07 phpdocumentor/reflection-docblock suggests installing erusev/parsedown (~1.0)
12-Apr-2017 18:19:07 sebastian/global-state suggests installing ext-uopz (*)
12-Apr-2017 18:19:07 phpunit/phpunit-mock-objects suggests installing ext-soap (*)
12-Apr-2017 18:19:07 phpunit/phpunit suggests installing phpunit/php-invoker (~1.1)
12-Apr-2017 18:19:07 Generating autoload files
12-Apr-2017 18:19:08 Buildfile: /data/build/build.xml
12-Apr-2017 18:19:08
12-Apr-2017 18:19:08 phpBB > clean:
12-Apr-2017 18:19:08
12-Apr-2017 18:19:08    [delete] Directory /data/build/logs does not exist or is not a directory.
12-Apr-2017 18:19:08    [delete] Directory /data/build/api does not exist or is not a directory.
12-Apr-2017 18:19:08    [delete] Directory /data/build/codebrowser does not exist or is not a directory.
12-Apr-2017 18:19:08    [delete] Directory /data/build/coverage does not exist or is not a directory.
12-Apr-2017 18:19:08    [delete] Directory /data/build/cpd does not exist or is not a directory.
12-Apr-2017 18:19:08    [delete] Directory /data/build/dependencies does not exist or is not a directory.
12-Apr-2017 18:19:08    [delete] Directory /data/build/new_version does not exist or is not a directory.
12-Apr-2017 18:19:08    [delete] Directory /data/build/old_versions does not exist or is not a directory.
12-Apr-2017 18:19:08    [delete] Directory /data/build/save does not exist or is not a directory.
12-Apr-2017 18:19:08
12-Apr-2017 18:19:08 phpBB > prepare:
12-Apr-2017 18:19:08
12-Apr-2017 18:19:08     [mkdir] Created dir: /data/build/logs
12-Apr-2017 18:19:08     [mkdir] Created dir: /data/build/api
12-Apr-2017 18:19:08     [mkdir] Created dir: /data/build/codebrowser
12-Apr-2017 18:19:08     [mkdir] Created dir: /data/build/coverage
12-Apr-2017 18:19:08     [mkdir] Created dir: /data/build/cpd
12-Apr-2017 18:19:08     [mkdir] Created dir: /data/build/dependencies
12-Apr-2017 18:19:08     [mkdir] Created dir: /data/build/new_version
12-Apr-2017 18:19:08     [mkdir] Created dir: /data/build/new_version/files
12-Apr-2017 18:19:08     [mkdir] Created dir: /data/build/new_version/patches
12-Apr-2017 18:19:08     [mkdir] Created dir: /data/build/new_version/release_files
12-Apr-2017 18:19:08     [mkdir] Created dir: /data/build/new_version/update
12-Apr-2017 18:19:08     [mkdir] Created dir: /data/build/old_versions
12-Apr-2017 18:19:08     [mkdir] Created dir: /data/build/save
12-Apr-2017 18:19:08
12-Apr-2017 18:19:08 BUILD FINISHED
12-Apr-2017 18:19:08
12-Apr-2017 18:19:08 Total time: 0.1126 seconds
12-Apr-2017 18:19:08
12-Apr-2017 18:19:08 Finished task 'Prepare directory' with result: Success
12-Apr-2017 18:19:08 Skipping execution of task 'Run sniffs' as it is disabled
12-Apr-2017 18:19:08
Substituting variable: ${bamboo.working.directory} with /home/bamboo/xml-data/build-dir/PHPBB3-PR-JOB1
12-Apr-2017 18:19:08 Starting task 'Run sniffs' of type 'com.atlassian.bamboo.plugins.bamboo-docker-plugin:task.docker.cli'
12-Apr-2017 18:19:08 Running image name (phpbb:php-5.6)
12-Apr-2017 18:19:08
Beginning to execute external process for build 'phpBB3 - Pull Requests - Build and Test Job #6972 (PHPBB3-PR-JOB1-6972)'
... running command line:
/usr/bin/docker run --volume /home/bamboo/xml-data/build-dir/PHPBB3-PR-JOB1:/data --workdir /data/build --rm -u=991 phpbb:php-5.6 ../phpBB/vendor/bin/phing sniff
... in: /home/bamboo/xml-data/build-dir/PHPBB3-PR-JOB1
... using extra environment variables:
bamboo_planRepository_1_branch=3.1.x
bamboo_planRepository_1_branchDisplayName=3.1.x
bamboo_repository_revision_number=f9a596c544fb6677d822cd78d16987d8e751b729
bamboo_PRref=master
bamboo_resultsUrl=https://bamboo.phpbb.com/browse/PHPBB3-PR-JOB1-6972
bamboo_capability_system_builder_command_Git=/usr/bin/git
bamboo_repository_75956235_git_username=bantu
bamboo_planRepository_1_name=phpBB Ascraeus
bamboo_build_working_directory=/home/bamboo/xml-data/build-dir/PHPBB3-PR-JOB1
bamboo_buildKey=PHPBB3-PR-JOB1
bamboo_capability_phpbb_tests=true
bamboo_shortPlanName=Pull Requests
bamboo_capability_system_builder_command_fop=/usr/bin/fop
bamboo_capability_dbms_sqlite_2=true
bamboo_planRepository_name=phpBB Ascraeus
bamboo_PRnumber=4789
bamboo_buildNumber=6972
bamboo_repository_75956235_git_repositoryUrl=https://github.com/phpbb/phpbb.git
bamboo_capability_system_builder_phpunit_PHPUnit=/usr/bin/phpunit
bamboo_shortJobName=Build and Test Job
bamboo_buildResultsUrl=https://bamboo.phpbb.com/browse/PHPBB3-PR-JOB1-6972
bamboo_repository_75956235_branch_name=3.1.x
bamboo_planRepository_repositoryUrl=https://github.com/phpbb/phpbb.git
bamboo_agentId=131073
bamboo_planName=phpBB3 - Pull Requests
bamboo_build_commandline_com_atlassian_bamboo_plugins_scripttask_task_builder_script_7=/bin/sh /home/bamboo/temp/PHPBB3-PR-JOB1-6972-ScriptBuildTask-3159731943081773505.sh
bamboo_shortPlanKey=PR
bamboo_shortJobKey=JOB1
bamboo_capability_dbms_mysql_55=true
bamboo_capability_system_jdk_JDK_1_7_0_65=/usr/lib/jvm/java-7-openjdk-amd64
bamboo_planRepository_revision=f9a596c544fb6677d822cd78d16987d8e751b729
bamboo_repository_previous_revision_number=f9a596c544fb6677d822cd78d16987d8e751b729
bamboo_buildTimeStamp=2017-04-12T18:17:49.462Z
bamboo_planRepository_previousRevision=f9a596c544fb6677d822cd78d16987d8e751b729
bamboo_capability_system_builder_mvn2_Maven_2=/usr/share/maven2
bamboo_capability_system_jdk_JDK_1_6_0_16=/usr/lib/jvm/java-6-sun-1.6.0.16
bamboo_build_commandline_com_atlassian_bamboo_plugins_scripttask_task_builder_script_4=/bin/sh /home/bamboo/temp/PHPBB3-PR-JOB1-6972-ScriptBuildTask-2972159734984263098.sh
bamboo_buildResultKey=PHPBB3-PR-JOB1-6972
bamboo_repository_git_branch=3.1.x
bamboo_repository_branch_name=3.1.x
bamboo_buildPlanName=phpBB3 - Pull Requests - Build and Test Job
bamboo_planRepository_1_revision=f9a596c544fb6677d822cd78d16987d8e751b729
bamboo_repository_name=phpBB Ascraeus
bamboo_capability_system_docker_executable=/usr/bin/docker
bamboo_build_commandline_com_atlassian_bamboo_plugins_bamboo_docker_plugin_task_docker_cli_12=/usr/bin/docker run --volume /home/bamboo/xml-data/build-dir/PHPBB3-PR-JOB1:/data --workdir /data/phpBB --rm -e HOME=/home/bamboo -u=991 phpbb:php-5.6 /bin/bash -c php ../composer.phar install --dev; cd ../build; ../phpBB/vendor/bin/phing clean prepare
bamboo_planRepository_branch=3.1.x
bamboo_agentWorkingDirectory=/home/bamboo/xml-data/build-dir
bamboo_capability_system_git_executable=/usr/bin/git
bamboo_planRepository_1_previousRevision=f9a596c544fb6677d822cd78d16987d8e751b729
bamboo_capability_system_builder_phpunit_PHPUnit_3_4=/usr/bin/phpunit
bamboo_repository_git_username=bantu
bamboo_repository_75956235_revision_number=f9a596c544fb6677d822cd78d16987d8e751b729
bamboo_planRepository_branchDisplayName=3.1.x
bamboo_planRepository_1_type=gitv2
bamboo_planRepository_branchName=3.1.x
bamboo_repository_75956235_previous_revision_number=f9a596c544fb6677d822cd78d16987d8e751b729
bamboo_capability_system_jdk_JDK=/usr/lib/jvm/java-6-sun
bamboo_plan_storageTag=PHPBB3-PR
bamboo_planRepository_type=gitv2
bamboo_planRepository_1_username=bantu
bamboo_ManualBuildTriggerReason_userName=Build Robot
bamboo_repository_git_repositoryUrl=https://github.com/phpbb/phpbb.git
bamboo_repository_75956235_git_branch=3.1.x
bamboo_capability_system_builder_ant_Ant=/usr/share/ant
bamboo_repository_75956235_name=phpBB Ascraeus
bamboo_working_directory=/home/bamboo/xml-data/build-dir/PHPBB3-PR-JOB1
bamboo_planKey=PHPBB3-PR
bamboo_planRepository_1_repositoryUrl=https://github.com/phpbb/phpbb.git
bamboo_planRepository_username=bantu
bamboo_capability_local=true
bamboo_capability_system_jdk_JDK_1_6=/usr/lib/jvm/java-6-sun
bamboo_capability_system_jdk_JDK_1_7=/usr/lib/jvm/java-7-openjdk-amd64
bamboo_planRepository_1_branchName=3.1.x
12-Apr-2017 18:19:08 Buildfile: /data/build/build.xml
12-Apr-2017 18:19:08
12-Apr-2017 18:19:08 phpBB > sniff:
12-Apr-2017 18:19:08
12-Apr-2017 18:19:16 ............................................................  60 / 682 (9%)
12-Apr-2017 18:19:18 ............................................................ 120 / 682 (18%)
12-Apr-2017 18:19:19 ............................................................ 180 / 682 (26%)
12-Apr-2017 18:19:20 ............................................................ 240 / 682 (35%)
12-Apr-2017 18:19:26 ............................................................ 300 / 682 (44%)
12-Apr-2017 18:19:30 ............................................................ 360 / 682 (53%)
12-Apr-2017 18:19:35 ............................................................ 420 / 682 (62%)
12-Apr-2017 18:19:39 ............................................................ 480 / 682 (70%)
12-Apr-2017 18:19:43 ............................................................ 540 / 682 (79%)
12-Apr-2017 18:19:48 ............................................................ 600 / 682 (88%)
12-Apr-2017 18:19:50 ....................................................E....... 660 / 682 (97%)
12-Apr-2017 18:19:51 ......................
12-Apr-2017 18:19:51
12-Apr-2017 18:19:51
12-Apr-2017 18:19:51 FILE: /data/phpBB/phpbb/style/manager.php
12-Apr-2017 18:19:51 ----------------------------------------------------------------------
12-Apr-2017 18:19:51 FOUND 6 ERRORS AFFECTING 6 LINES
12-Apr-2017 18:19:51 ----------------------------------------------------------------------
12-Apr-2017 18:19:51   45 | ERROR | Arguments with default values must be at the end of the
12-Apr-2017 18:19:51      |       | argument list (PEAR.Functions.ValidDefaultValue.NotAtEnd)
12-Apr-2017 18:19:51 116 | ERROR | There should be exactly one space between the keyword and
12-Apr-2017 18:19:51      |       | opening parenthesis
12-Apr-2017 18:19:51      |       | (phpbb.ControlStructures.OpeningParenthesis.NoSpaceBeforeOpeningParenthesis)
12-Apr-2017 18:19:51 130 | ERROR | There should be exactly one space between the keyword and
12-Apr-2017 18:19:51      |       | opening parenthesis
12-Apr-2017 18:19:51      |       | (phpbb.ControlStructures.OpeningParenthesis.NoSpaceBeforeOpeningParenthesis)
12-Apr-2017 18:19:51 148 | ERROR | There should be exactly one space between the keyword and
12-Apr-2017 18:19:51      |       | opening parenthesis
12-Apr-2017 18:19:51      |       | (phpbb.ControlStructures.OpeningParenthesis.NoSpaceBeforeOpeningParenthesis)
12-Apr-2017 18:19:51 157 | ERROR | There should be exactly one space between the keyword and
12-Apr-2017 18:19:51      |       | opening parenthesis
12-Apr-2017 18:19:51      |       | (phpbb.ControlStructures.OpeningParenthesis.NoSpaceBeforeOpeningParenthesis)
12-Apr-2017 18:19:51 208 | ERROR | There should be exactly one space between the keyword and
12-Apr-2017 18:19:51      |       | opening parenthesis
12-Apr-2017 18:19:51      |       | (phpbb.ControlStructures.OpeningParenthesis.NoSpaceBeforeOpeningParenthesis)
12-Apr-2017 18:19:51 ----------------------------------------------------------------------
12-Apr-2017 18:19:51
12-Apr-2017 18:19:51 Time: 42.27 secs; Memory: 77.5Mb
12-Apr-2017 18:19:51
12-Apr-2017 18:19:59 ............................................................  60 / 206 (29%)
12-Apr-2017 18:20:18 ............................................................ 120 / 206 (58%)
12-Apr-2017 18:20:34 ................................E........................... 180 / 206 (87%)
12-Apr-2017 18:20:41 ..........................
12-Apr-2017 18:20:41
12-Apr-2017 18:20:41
12-Apr-2017 18:20:41 FILE: /data/phpBB/includes/acp/acp_styles.php
12-Apr-2017 18:20:41 ----------------------------------------------------------------------
12-Apr-2017 18:20:41 FOUND 2 ERRORS AFFECTING 2 LINES
12-Apr-2017 18:20:41 ----------------------------------------------------------------------
12-Apr-2017 18:20:41 291 | ERROR | There should be exactly one space between the keyword and
12-Apr-2017 18:20:41      |       | opening parenthesis
12-Apr-2017 18:20:41      |       | (phpbb.ControlStructures.OpeningParenthesis.NoSpaceBeforeOpeningParenthesis)
12-Apr-2017 18:20:41 298 | ERROR | There should be exactly one space between the keyword and
12-Apr-2017 18:20:41      |       | opening parenthesis
12-Apr-2017 18:20:41      |       | (phpbb.ControlStructures.OpeningParenthesis.NoSpaceBeforeOpeningParenthesis)
12-Apr-2017 18:20:41 ----------------------------------------------------------------------
12-Apr-2017 18:20:41
12-Apr-2017 18:20:41 Time: 49.95 secs; Memory: 60.25Mb
12-Apr-2017 18:20:41
12-Apr-2017 18:20:41
12-Apr-2017 18:20:41
12-Apr-2017 18:20:41 Time: 17ms; Memory: 3.75Mb
12-Apr-2017 18:20:41
12-Apr-2017 18:20:41        [if] Error in IfTask
12-Apr-2017 18:20:41 Execution of target "sniff" failed for the following reason: /data/build/build.xml:108:6: /data/build/build.xml:114:9: PHP Code Sniffer failed.
12-Apr-2017 18:20:41
12-Apr-2017 18:20:41 BUILD FAILED
12-Apr-2017 18:20:41 /data/build/build.xml:108:6: /data/build/build.xml:114:9: PHP Code Sniffer failed.
12-Apr-2017 18:20:41 Total time: 2 minutes  32.62 seconds
12-Apr-2017 18:20:41
12-Apr-2017 18:20:41 Failing task since return code of [/usr/bin/docker run --volume /home/bamboo/xml-data/build-dir/PHPBB3-PR-JOB1:/data --workdir /data/build --rm -u=991 phpbb:php-5.6 ../phpBB/vendor/bin/phing sniff] was 1 while expected 0
12-Apr-2017 18:20:41 Error occurred while running Task 'Run sniffs(11)' of type com.atlassian.bamboo.plugins.bamboo-docker-plugin:task.docker.cli.
12-Apr-2017 18:20:41 com.atlassian.bamboo.task.TaskException: Failed to execute task
12-Apr-2017 18:20:41         at com.atlassian.bamboo.plugins.docker.service.RunService.execute(RunService.java:71)
12-Apr-2017 18:20:41         at com.atlassian.bamboo.plugins.docker.tasks.cli.DockerCliTask.execute(DockerCliTask.java:60)
12-Apr-2017 18:20:41         at com.atlassian.bamboo.task.TaskExecutorImpl.lambda$executeTasks$3(TaskExecutorImpl.java:317)
12-Apr-2017 18:20:41         at com.atlassian.bamboo.task.TaskExecutorImpl.executeTaskWithPrePostActions(TaskExecutorImpl.java:246)
12-Apr-2017 18:20:41         at com.atlassian.bamboo.task.TaskExecutorImpl.executeTasks(TaskExecutorImpl.java:317)
12-Apr-2017 18:20:41         at com.atlassian.bamboo.task.TaskExecutorImpl.execute(TaskExecutorImpl.java:118)
12-Apr-2017 18:20:41         at com.atlassian.bamboo.build.pipeline.tasks.ExecuteBuildTask.call(ExecuteBuildTask.java:74)
12-Apr-2017 18:20:41         at com.atlassian.bamboo.v2.build.agent.DefaultBuildAgent.build(DefaultBuildAgent.java:216)
12-Apr-2017 18:20:41         at com.atlassian.bamboo.v2.build.agent.BuildAgentControllerImpl$1.call(BuildAgentControllerImpl.java:139)
12-Apr-2017 18:20:41         at com.atlassian.bamboo.v2.build.agent.BuildAgentControllerImpl$1.call(BuildAgentControllerImpl.java:130)
12-Apr-2017 18:20:41         at com.atlassian.bamboo.variable.CustomVariableContextImpl.withVariableSubstitutor(CustomVariableContextImpl.java:221)
12-Apr-2017 18:20:41         at com.atlassian.bamboo.v2.build.agent.BuildAgentControllerImpl.waitAndPerformBuild(BuildAgentControllerImpl.java:129)
12-Apr-2017 18:20:41         at com.atlassian.bamboo.v2.build.agent.DefaultBuildAgent$1.run(DefaultBuildAgent.java:138)
12-Apr-2017 18:20:41         at com.atlassian.bamboo.utils.BambooRunnables$1.run(BambooRunnables.java:51)
12-Apr-2017 18:20:41         at com.atlassian.bamboo.security.ImpersonationHelper.runWith(ImpersonationHelper.java:31)
12-Apr-2017 18:20:41         at com.atlassian.bamboo.security.ImpersonationHelper.runWithSystemAuthority(ImpersonationHelper.java:20)
12-Apr-2017 18:20:41         at com.atlassian.bamboo.security.ImpersonationHelper$1.run(ImpersonationHelper.java:52)
12-Apr-2017 18:20:41         at java.lang.Thread.run(Thread.java:745)
12-Apr-2017 18:20:41 Caused by: com.atlassian.bamboo.plugins.docker.client.DockerException: Error running Docker run command
12-Apr-2017 18:20:41         at com.atlassian.bamboo.plugins.docker.client.DockerCmd.run(DockerCmd.java:103)
12-Apr-2017 18:20:41         at com.atlassian.bamboo.plugins.docker.service.RunService.execute(RunService.java:60)
12-Apr-2017 18:20:41         ... 17 more
12-Apr-2017 18:20:41 Caused by: com.atlassian.utils.process.ProcessException: Error executing /usr/bin/docker run --volume /home/bamboo/xml-data/build-dir/PHPBB3-PR-JOB1:/data --workdir /data/build --rm -u=991 phpbb:php-5.6 ../phpBB/vendor/bin/phing sniff
12-Apr-2017 18:20:41         at com.atlassian.bamboo.plugins.docker.process.DockerTaskProcessService.execute(DockerTaskProcessService.java:60)
12-Apr-2017 18:20:41         at com.atlassian.bamboo.plugins.docker.client.DockerCmd.run(DockerCmd.java:99)
12-Apr-2017 18:20:41         ... 18 more
12-Apr-2017 18:20:41 Starting task 'Parsing test results produced by script' of type 'com.atlassian.bamboo.plugins.testresultparser:task.testresultparser.junit'
12-Apr-2017 18:20:41 Parsing test results under /home/bamboo/xml-data/build-dir/PHPBB3-PR-JOB1...
12-Apr-2017 18:20:41 Failing task since test cases were expected but none were found.
12-Apr-2017 18:20:41 Finished task 'Parsing test results produced by script' with result: Failed
12-Apr-2017 18:20:41
Substituting variable: ${bamboo.PRnumber} with 4789
12-Apr-2017 18:20:41
Substituting variable: ${bamboo.buildResultsUrl} with https://bamboo.phpbb.com/browse/PHPBB3-PR-JOB1-6972
12-Apr-2017 18:20:41
Substituting variable: ${bamboo.buildResultsUrl} with https://bamboo.phpbb.com/browse/PHPBB3-PR-JOB1-6972
12-Apr-2017 18:20:41 Starting task 'Set result build status' of type 'com.atlassian.bamboo.plugins.scripttask:task.builder.script'
12-Apr-2017 18:20:41
Beginning to execute external process for build 'phpBB3 - Pull Requests - Build and Test Job #6972 (PHPBB3-PR-JOB1-6972)'
... running command line:
/bin/sh /home/bamboo/temp/PHPBB3-PR-JOB1-6972-ScriptBuildTask-2561937043304791775.sh
... in: /home/bamboo/xml-data/build-dir/PHPBB3-PR-JOB1
... using extra environment variables:
bamboo_planRepository_1_branch=3.1.x
bamboo_planRepository_1_branchDisplayName=3.1.x
bamboo_repository_revision_number=f9a596c544fb6677d822cd78d16987d8e751b729
bamboo_PRref=master
bamboo_resultsUrl=https://bamboo.phpbb.com/browse/PHPBB3-PR-JOB1-6972
bamboo_capability_system_builder_command_Git=/usr/bin/git
bamboo_repository_75956235_git_username=bantu
bamboo_planRepository_1_name=phpBB Ascraeus
bamboo_build_working_directory=/home/bamboo/xml-data/build-dir/PHPBB3-PR-JOB1
bamboo_buildKey=PHPBB3-PR-JOB1
bamboo_capability_phpbb_tests=true
bamboo_shortPlanName=Pull Requests
bamboo_capability_system_builder_command_fop=/usr/bin/fop
bamboo_capability_dbms_sqlite_2=true
bamboo_planRepository_name=phpBB Ascraeus
bamboo_PRnumber=4789
bamboo_buildNumber=6972
bamboo_repository_75956235_git_repositoryUrl=https://github.com/phpbb/phpbb.git
bamboo_capability_system_builder_phpunit_PHPUnit=/usr/bin/phpunit
bamboo_shortJobName=Build and Test Job
bamboo_buildResultsUrl=https://bamboo.phpbb.com/browse/PHPBB3-PR-JOB1-6972
bamboo_repository_75956235_branch_name=3.1.x
bamboo_planRepository_repositoryUrl=https://github.com/phpbb/phpbb.git
bamboo_agentId=131073
bamboo_planName=phpBB3 - Pull Requests
bamboo_build_commandline_com_atlassian_bamboo_plugins_scripttask_task_builder_script_7=/bin/sh /home/bamboo/temp/PHPBB3-PR-JOB1-6972-ScriptBuildTask-3159731943081773505.sh
bamboo_shortPlanKey=PR
bamboo_shortJobKey=JOB1
bamboo_capability_dbms_mysql_55=true
bamboo_capability_system_jdk_JDK_1_7_0_65=/usr/lib/jvm/java-7-openjdk-amd64
bamboo_planRepository_revision=f9a596c544fb6677d822cd78d16987d8e751b729
bamboo_repository_previous_revision_number=f9a596c544fb6677d822cd78d16987d8e751b729
bamboo_buildTimeStamp=2017-04-12T18:17:49.462Z
bamboo_planRepository_previousRevision=f9a596c544fb6677d822cd78d16987d8e751b729
bamboo_capability_system_builder_mvn2_Maven_2=/usr/share/maven2
bamboo_capability_system_jdk_JDK_1_6_0_16=/usr/lib/jvm/java-6-sun-1.6.0.16
bamboo_build_commandline_com_atlassian_bamboo_plugins_scripttask_task_builder_script_4=/bin/sh /home/bamboo/temp/PHPBB3-PR-JOB1-6972-ScriptBuildTask-2972159734984263098.sh
bamboo_buildResultKey=PHPBB3-PR-JOB1-6972
bamboo_repository_git_branch=3.1.x
bamboo_repository_branch_name=3.1.x
bamboo_buildPlanName=phpBB3 - Pull Requests - Build and Test Job
bamboo_planRepository_1_revision=f9a596c544fb6677d822cd78d16987d8e751b729
bamboo_repository_name=phpBB Ascraeus
bamboo_capability_system_docker_executable=/usr/bin/docker
bamboo_build_commandline_com_atlassian_bamboo_plugins_bamboo_docker_plugin_task_docker_cli_11=/usr/bin/docker run --volume /home/bamboo/xml-data/build-dir/PHPBB3-PR-JOB1:/data --workdir /data/build --rm -u=991 phpbb:php-5.6 ../phpBB/vendor/bin/phing sniff
bamboo_build_commandline_com_atlassian_bamboo_plugins_bamboo_docker_plugin_task_docker_cli_12=/usr/bin/docker run --volume /home/bamboo/xml-data/build-dir/PHPBB3-PR-JOB1:/data --workdir /data/phpBB --rm -e HOME=/home/bamboo -u=991 phpbb:php-5.6 /bin/bash -c php ../composer.phar install --dev; cd ../build; ../phpBB/vendor/bin/phing clean prepare
bamboo_planRepository_branch=3.1.x
bamboo_agentWorkingDirectory=/home/bamboo/xml-data/build-dir
bamboo_capability_system_git_executable=/usr/bin/git
bamboo_planRepository_1_previousRevision=f9a596c544fb6677d822cd78d16987d8e751b729
bamboo_capability_system_builder_phpunit_PHPUnit_3_4=/usr/bin/phpunit
bamboo_repository_git_username=bantu
bamboo_repository_75956235_revision_number=f9a596c544fb6677d822cd78d16987d8e751b729
bamboo_planRepository_branchDisplayName=3.1.x
bamboo_planRepository_1_type=gitv2
bamboo_planRepository_branchName=3.1.x
bamboo_repository_75956235_previous_revision_number=f9a596c544fb6677d822cd78d16987d8e751b729
bamboo_capability_system_jdk_JDK=/usr/lib/jvm/java-6-sun
bamboo_plan_storageTag=PHPBB3-PR
bamboo_planRepository_type=gitv2
bamboo_planRepository_1_username=bantu
bamboo_ManualBuildTriggerReason_userName=Build Robot
bamboo_repository_git_repositoryUrl=https://github.com/phpbb/phpbb.git
bamboo_repository_75956235_git_branch=3.1.x
bamboo_capability_system_builder_ant_Ant=/usr/share/ant
bamboo_repository_75956235_name=phpBB Ascraeus
bamboo_working_directory=/home/bamboo/xml-data/build-dir/PHPBB3-PR-JOB1
bamboo_planKey=PHPBB3-PR
bamboo_planRepository_1_repositoryUrl=https://github.com/phpbb/phpbb.git
bamboo_planRepository_username=bantu
bamboo_capability_local=true
bamboo_capability_system_jdk_JDK_1_6=/usr/lib/jvm/java-6-sun
bamboo_capability_system_jdk_JDK_1_7=/usr/lib/jvm/java-7-openjdk-amd64
bamboo_planRepository_1_branchName=3.1.x
12-Apr-2017 18:20:42 From https://github.com/phpbb/phpbb
12-Apr-2017 18:20:42 * branch            refs/pull/4789/head -> FETCH_HEAD
12-Apr-2017 18:20:42 grep: build/logs/phpunit.xml: No such file or directory
12-Apr-2017 18:20:42 grep: build/logs/phpunit.xml: No such file or directory
12-Apr-2017 18:20:42   % Total    % Received % Xferd  Average Speed   Time    Time     Time  Current
12-Apr-2017 18:20:42                                  Dload  Upload   Total   Spent    Left  Speed
12-Apr-2017 18:20:42
12-Apr-2017 18:20:42   0     0    0     0    0     0      0      0 --:--:-- --:--:-- --:--:--     0
12-Apr-2017 18:20:42   0     0    0     0    0     0      0      0 --:--:-- --:--:-- --:--:--     0
12-Apr-2017 18:20:42 100   273  100    93  100   180    126    245 --:--:-- --:--:-- --:--:--   245
12-Apr-2017 18:20:42 Finished task 'Set result build status' with result: Success
12-Apr-2017 18:20:42 Running post build plugin 'NCover Results Collector'
12-Apr-2017 18:20:42 Running post build plugin 'Artifact Copier'
12-Apr-2017 18:20:42 Running post build plugin 'npm Cache Cleanup'
12-Apr-2017 18:20:42 Running post build plugin 'Clover Results Collector'
12-Apr-2017 18:20:42 Running post build plugin 'Docker Container Cleanup'
12-Apr-2017 18:20:43 Successfully removed working directory at '/home/bamboo/xml-data/build-dir/PHPBB3-PR-JOB1'
12-Apr-2017 18:20:43 Finalising the build...
12-Apr-2017 18:20:43 Stopping timer.
12-Apr-2017 18:20:43 Build PHPBB3-PR-JOB1-6972 completed.
12-Apr-2017 18:20:43 Running on server: post build plugin 'NCover Results Collector'
12-Apr-2017 18:20:43 Running on server: post build plugin 'Build Hanging Detection Configuration'
12-Apr-2017 18:20:43 Running on server: post build plugin 'Clover Delta Calculator'
12-Apr-2017 18:20:43 Running on server: post build plugin 'Maven Dependencies Postprocessor'
12-Apr-2017 18:20:43 All post build plugins have finished
12-Apr-2017 18:20:43 Generating build results summary...
12-Apr-2017 18:20:43 Saving build results to disk...
12-Apr-2017 18:20:43 Logging substituted variables...
12-Apr-2017 18:20:43 Indexing build results...
12-Apr-2017 18:20:43 Finished building PHPBB3-PR-JOB1-6972.
12-Apr-2017 18:20:43
Substituting variable: ${bamboo.PRnumber} with 4789