Tests pending pull requests

Build: #6973 failed

Job: Build and Test Job failed

Stages & jobs

  1. Build and Test

Build log

The build generated 468 lines of output. Download or view full build log

12-Apr-2017 22:15:41 Build phpBB3 - Pull Requests - Build and Test Job #6973 (PHPBB3-PR-JOB1-6973) started building on agent Default Agent
12-Apr-2017 22:15:41
12-Apr-2017 22:15:41 Build working directory is /home/bamboo/xml-data/build-dir/PHPBB3-PR-JOB1
12-Apr-2017 22:15:41 Executing build phpBB3 - Pull Requests - Build and Test Job #6973 (PHPBB3-PR-JOB1-6973)
12-Apr-2017 22:15:41 Starting task 'Checkout develop branch' of type 'com.atlassian.bamboo.plugins.vcs:task.vcs.checkout'
12-Apr-2017 22:15:41 Build always requires a clean checkout
12-Apr-2017 22:15:41 Cleaning build directory '/home/bamboo/xml-data/build-dir/PHPBB3-PR-JOB1'
12-Apr-2017 22:15:41 Updating source code to revision: f9a596c544fb6677d822cd78d16987d8e751b729
12-Apr-2017 22:15:41 Fetching 'refs/heads/3.1.x' from 'https://github.com/phpbb/phpbb.git'.
12-Apr-2017 22:15:42 Checking out revision f9a596c544fb6677d822cd78d16987d8e751b729.
12-Apr-2017 22:15:42 Creating local git repository in '/home/bamboo/xml-data/build-dir/PHPBB3-PR-JOB1/.git'.
12-Apr-2017 22:15:42 Cloning into '/home/bamboo/xml-data/build-dir/PHPBB3-PR-JOB1'...
12-Apr-2017 22:15:42 done.
12-Apr-2017 22:15:43 Branch 3.1.x set up to track remote branch 3.1.x from origin.
12-Apr-2017 22:15:43 Switched to a new branch '3.1.x'
12-Apr-2017 22:15:43 Updated source code to revision: f9a596c544fb6677d822cd78d16987d8e751b729
12-Apr-2017 22:15:43 Finished task 'Checkout develop branch' with result: Success
12-Apr-2017 22:15:43 Running pre-build action: VCS Version Collector
12-Apr-2017 22:15:43
Substituting variable: ${bamboo.PRnumber} with 4789
12-Apr-2017 22:15:43
Substituting variable: ${bamboo.buildResultsUrl} with https://bamboo.phpbb.com/browse/PHPBB3-PR-JOB1-6973
12-Apr-2017 22:15:43 Starting task 'Set pending build status' of type 'com.atlassian.bamboo.plugins.scripttask:task.builder.script'
12-Apr-2017 22:15:43
Beginning to execute external process for build 'phpBB3 - Pull Requests - Build and Test Job #6973 (PHPBB3-PR-JOB1-6973)'
... running command line:
/bin/sh /home/bamboo/temp/PHPBB3-PR-JOB1-6973-ScriptBuildTask-1510935183880845682.sh
... in: /home/bamboo/xml-data/build-dir/PHPBB3-PR-JOB1
... using extra environment variables:
bamboo_planRepository_1_branch=3.1.x
bamboo_planRepository_1_branchDisplayName=3.1.x
bamboo_repository_revision_number=f9a596c544fb6677d822cd78d16987d8e751b729
bamboo_PRref=master
bamboo_resultsUrl=https://bamboo.phpbb.com/browse/PHPBB3-PR-JOB1-6973
bamboo_capability_system_builder_command_Git=/usr/bin/git
bamboo_repository_75956235_git_username=bantu
bamboo_planRepository_1_name=phpBB Ascraeus
bamboo_build_working_directory=/home/bamboo/xml-data/build-dir/PHPBB3-PR-JOB1
bamboo_buildKey=PHPBB3-PR-JOB1
bamboo_capability_phpbb_tests=true
bamboo_shortPlanName=Pull Requests
bamboo_capability_system_builder_command_fop=/usr/bin/fop
bamboo_capability_dbms_sqlite_2=true
bamboo_planRepository_name=phpBB Ascraeus
bamboo_PRnumber=4789
bamboo_buildNumber=6973
bamboo_repository_75956235_git_repositoryUrl=https://github.com/phpbb/phpbb.git
bamboo_capability_system_builder_phpunit_PHPUnit=/usr/bin/phpunit
bamboo_shortJobName=Build and Test Job
bamboo_buildResultsUrl=https://bamboo.phpbb.com/browse/PHPBB3-PR-JOB1-6973
bamboo_repository_75956235_branch_name=3.1.x
bamboo_planRepository_repositoryUrl=https://github.com/phpbb/phpbb.git
bamboo_agentId=131073
bamboo_planName=phpBB3 - Pull Requests
bamboo_shortPlanKey=PR
bamboo_shortJobKey=JOB1
bamboo_capability_dbms_mysql_55=true
bamboo_capability_system_jdk_JDK_1_7_0_65=/usr/lib/jvm/java-7-openjdk-amd64
bamboo_planRepository_revision=f9a596c544fb6677d822cd78d16987d8e751b729
bamboo_repository_previous_revision_number=f9a596c544fb6677d822cd78d16987d8e751b729
bamboo_buildTimeStamp=2017-04-12T22:15:41.853Z
bamboo_planRepository_previousRevision=f9a596c544fb6677d822cd78d16987d8e751b729
bamboo_capability_system_builder_mvn2_Maven_2=/usr/share/maven2
bamboo_capability_system_jdk_JDK_1_6_0_16=/usr/lib/jvm/java-6-sun-1.6.0.16
bamboo_buildResultKey=PHPBB3-PR-JOB1-6973
bamboo_repository_git_branch=3.1.x
bamboo_repository_branch_name=3.1.x
bamboo_buildPlanName=phpBB3 - Pull Requests - Build and Test Job
bamboo_planRepository_1_revision=f9a596c544fb6677d822cd78d16987d8e751b729
bamboo_repository_name=phpBB Ascraeus
bamboo_capability_system_docker_executable=/usr/bin/docker
bamboo_planRepository_branch=3.1.x
bamboo_agentWorkingDirectory=/home/bamboo/xml-data/build-dir
bamboo_capability_system_git_executable=/usr/bin/git
bamboo_planRepository_1_previousRevision=f9a596c544fb6677d822cd78d16987d8e751b729
bamboo_capability_system_builder_phpunit_PHPUnit_3_4=/usr/bin/phpunit
bamboo_repository_git_username=bantu
bamboo_repository_75956235_revision_number=f9a596c544fb6677d822cd78d16987d8e751b729
bamboo_planRepository_branchDisplayName=3.1.x
bamboo_planRepository_1_type=gitv2
bamboo_planRepository_branchName=3.1.x
bamboo_repository_75956235_previous_revision_number=f9a596c544fb6677d822cd78d16987d8e751b729
bamboo_capability_system_jdk_JDK=/usr/lib/jvm/java-6-sun
bamboo_plan_storageTag=PHPBB3-PR
bamboo_planRepository_type=gitv2
bamboo_planRepository_1_username=bantu
bamboo_ManualBuildTriggerReason_userName=Build Robot
bamboo_repository_git_repositoryUrl=https://github.com/phpbb/phpbb.git
bamboo_repository_75956235_git_branch=3.1.x
bamboo_capability_system_builder_ant_Ant=/usr/share/ant
bamboo_repository_75956235_name=phpBB Ascraeus
bamboo_working_directory=/home/bamboo/xml-data/build-dir/PHPBB3-PR-JOB1
bamboo_planKey=PHPBB3-PR
bamboo_planRepository_1_repositoryUrl=https://github.com/phpbb/phpbb.git
bamboo_planRepository_username=bantu
bamboo_capability_local=true
bamboo_capability_system_jdk_JDK_1_6=/usr/lib/jvm/java-6-sun
bamboo_capability_system_jdk_JDK_1_7=/usr/lib/jvm/java-7-openjdk-amd64
bamboo_planRepository_1_branchName=3.1.x
12-Apr-2017 22:15:44 From https://github.com/phpbb/phpbb
12-Apr-2017 22:15:44 * branch            refs/pull/4789/head -> FETCH_HEAD
12-Apr-2017 22:15:44   % Total    % Received % Xferd  Average Speed   Time    Time     Time  Current
12-Apr-2017 22:15:44                                  Dload  Upload   Total   Spent    Left  Speed
12-Apr-2017 22:15:44
12-Apr-2017 22:15:45   0     0    0     0    0     0      0      0 --:--:-- --:--:-- --:--:--     0
12-Apr-2017 22:15:45   0     0    0     0    0     0      0      0 --:--:-- --:--:-- --:--:--     0
12-Apr-2017 22:15:45 100   275  100    93  100   182    125    245 --:--:-- --:--:-- --:--:--   245
12-Apr-2017 22:15:45 Finished task 'Set pending build status' with result: Success
12-Apr-2017 22:15:45
Substituting variable: ${bamboo.PRnumber} with 4789
12-Apr-2017 22:15:45 Starting task 'Fetch PR' of type 'com.atlassian.bamboo.plugins.scripttask:task.builder.script'
12-Apr-2017 22:15:45
Beginning to execute external process for build 'phpBB3 - Pull Requests - Build and Test Job #6973 (PHPBB3-PR-JOB1-6973)'
... running command line:
/bin/sh /home/bamboo/temp/PHPBB3-PR-JOB1-6973-ScriptBuildTask-7614642100847184652.sh
... in: /home/bamboo/xml-data/build-dir/PHPBB3-PR-JOB1
... using extra environment variables:
bamboo_planRepository_1_branch=3.1.x
bamboo_planRepository_1_branchDisplayName=3.1.x
bamboo_repository_revision_number=f9a596c544fb6677d822cd78d16987d8e751b729
bamboo_PRref=master
bamboo_resultsUrl=https://bamboo.phpbb.com/browse/PHPBB3-PR-JOB1-6973
bamboo_capability_system_builder_command_Git=/usr/bin/git
bamboo_repository_75956235_git_username=bantu
bamboo_planRepository_1_name=phpBB Ascraeus
bamboo_build_working_directory=/home/bamboo/xml-data/build-dir/PHPBB3-PR-JOB1
bamboo_buildKey=PHPBB3-PR-JOB1
bamboo_capability_phpbb_tests=true
bamboo_shortPlanName=Pull Requests
bamboo_capability_system_builder_command_fop=/usr/bin/fop
bamboo_capability_dbms_sqlite_2=true
bamboo_planRepository_name=phpBB Ascraeus
bamboo_PRnumber=4789
bamboo_buildNumber=6973
bamboo_repository_75956235_git_repositoryUrl=https://github.com/phpbb/phpbb.git
bamboo_capability_system_builder_phpunit_PHPUnit=/usr/bin/phpunit
bamboo_shortJobName=Build and Test Job
bamboo_buildResultsUrl=https://bamboo.phpbb.com/browse/PHPBB3-PR-JOB1-6973
bamboo_repository_75956235_branch_name=3.1.x
bamboo_planRepository_repositoryUrl=https://github.com/phpbb/phpbb.git
bamboo_agentId=131073
bamboo_planName=phpBB3 - Pull Requests
bamboo_build_commandline_com_atlassian_bamboo_plugins_scripttask_task_builder_script_7=/bin/sh /home/bamboo/temp/PHPBB3-PR-JOB1-6973-ScriptBuildTask-1510935183880845682.sh
bamboo_shortPlanKey=PR
bamboo_shortJobKey=JOB1
bamboo_capability_dbms_mysql_55=true
bamboo_capability_system_jdk_JDK_1_7_0_65=/usr/lib/jvm/java-7-openjdk-amd64
bamboo_planRepository_revision=f9a596c544fb6677d822cd78d16987d8e751b729
bamboo_repository_previous_revision_number=f9a596c544fb6677d822cd78d16987d8e751b729
bamboo_buildTimeStamp=2017-04-12T22:15:41.853Z
bamboo_planRepository_previousRevision=f9a596c544fb6677d822cd78d16987d8e751b729
bamboo_capability_system_builder_mvn2_Maven_2=/usr/share/maven2
bamboo_capability_system_jdk_JDK_1_6_0_16=/usr/lib/jvm/java-6-sun-1.6.0.16
bamboo_buildResultKey=PHPBB3-PR-JOB1-6973
bamboo_repository_git_branch=3.1.x
bamboo_repository_branch_name=3.1.x
bamboo_buildPlanName=phpBB3 - Pull Requests - Build and Test Job
bamboo_planRepository_1_revision=f9a596c544fb6677d822cd78d16987d8e751b729
bamboo_repository_name=phpBB Ascraeus
bamboo_capability_system_docker_executable=/usr/bin/docker
bamboo_planRepository_branch=3.1.x
bamboo_agentWorkingDirectory=/home/bamboo/xml-data/build-dir
bamboo_capability_system_git_executable=/usr/bin/git
bamboo_planRepository_1_previousRevision=f9a596c544fb6677d822cd78d16987d8e751b729
bamboo_capability_system_builder_phpunit_PHPUnit_3_4=/usr/bin/phpunit
bamboo_repository_git_username=bantu
bamboo_repository_75956235_revision_number=f9a596c544fb6677d822cd78d16987d8e751b729
bamboo_planRepository_branchDisplayName=3.1.x
bamboo_planRepository_1_type=gitv2
bamboo_planRepository_branchName=3.1.x
bamboo_repository_75956235_previous_revision_number=f9a596c544fb6677d822cd78d16987d8e751b729
bamboo_capability_system_jdk_JDK=/usr/lib/jvm/java-6-sun
bamboo_plan_storageTag=PHPBB3-PR
bamboo_planRepository_type=gitv2
bamboo_planRepository_1_username=bantu
bamboo_ManualBuildTriggerReason_userName=Build Robot
bamboo_repository_git_repositoryUrl=https://github.com/phpbb/phpbb.git
bamboo_repository_75956235_git_branch=3.1.x
bamboo_capability_system_builder_ant_Ant=/usr/share/ant
bamboo_repository_75956235_name=phpBB Ascraeus
bamboo_working_directory=/home/bamboo/xml-data/build-dir/PHPBB3-PR-JOB1
bamboo_planKey=PHPBB3-PR
bamboo_planRepository_1_repositoryUrl=https://github.com/phpbb/phpbb.git
bamboo_planRepository_username=bantu
bamboo_capability_local=true
bamboo_capability_system_jdk_JDK_1_6=/usr/lib/jvm/java-6-sun
bamboo_capability_system_jdk_JDK_1_7=/usr/lib/jvm/java-7-openjdk-amd64
bamboo_planRepository_1_branchName=3.1.x
12-Apr-2017 22:15:46 From https://github.com/phpbb/phpbb
12-Apr-2017 22:15:46 * branch            refs/pull/4789/merge -> FETCH_HEAD
12-Apr-2017 22:15:46 Note: checking out 'FETCH_HEAD'.
12-Apr-2017 22:15:46
12-Apr-2017 22:15:46 You are in 'detached HEAD' state. You can look around, make experimental
12-Apr-2017 22:15:46 changes and commit them, and you can discard any commits you make in this
12-Apr-2017 22:15:46 state without impacting any branches by performing another checkout.
12-Apr-2017 22:15:46
12-Apr-2017 22:15:46 If you want to create a new branch to retain commits you create, you may
12-Apr-2017 22:15:46 do so (now or later) by using -b with the checkout command again. Example:
12-Apr-2017 22:15:46
12-Apr-2017 22:15:46   git checkout -b new_branch_name
12-Apr-2017 22:15:46
12-Apr-2017 22:15:46 HEAD is now at fbf6b5b... Merge d9eae8bee69bb4dfbff8f45fb979c67ecb102668 into fba85954212019dd5f2e4ccbf884de87fbe3c19b
12-Apr-2017 22:15:46 Finished task 'Fetch PR' with result: Success
12-Apr-2017 22:15:46 Skipping execution of task 'Prepare directory' as it is disabled
12-Apr-2017 22:15:46
Substituting variable: ${bamboo.working.directory} with /home/bamboo/xml-data/build-dir/PHPBB3-PR-JOB1
12-Apr-2017 22:15:46 Starting task 'Prepare directory' of type 'com.atlassian.bamboo.plugins.bamboo-docker-plugin:task.docker.cli'
12-Apr-2017 22:15:46 Running image name (phpbb:php-5.6)
12-Apr-2017 22:15:46
Beginning to execute external process for build 'phpBB3 - Pull Requests - Build and Test Job #6973 (PHPBB3-PR-JOB1-6973)'
... running command line:
/usr/bin/docker run --volume /home/bamboo/xml-data/build-dir/PHPBB3-PR-JOB1:/data --workdir /data/phpBB --rm -e HOME=/home/bamboo -u=991 phpbb:php-5.6 /bin/bash -c php ../composer.phar install --dev; cd ../build; ../phpBB/vendor/bin/phing clean prepare
... in: /home/bamboo/xml-data/build-dir/PHPBB3-PR-JOB1
... using extra environment variables:
bamboo_planRepository_1_branch=3.1.x
bamboo_planRepository_1_branchDisplayName=3.1.x
bamboo_repository_revision_number=f9a596c544fb6677d822cd78d16987d8e751b729
bamboo_PRref=master
bamboo_resultsUrl=https://bamboo.phpbb.com/browse/PHPBB3-PR-JOB1-6973
bamboo_capability_system_builder_command_Git=/usr/bin/git
bamboo_repository_75956235_git_username=bantu
bamboo_planRepository_1_name=phpBB Ascraeus
bamboo_build_working_directory=/home/bamboo/xml-data/build-dir/PHPBB3-PR-JOB1
bamboo_buildKey=PHPBB3-PR-JOB1
bamboo_capability_phpbb_tests=true
bamboo_shortPlanName=Pull Requests
bamboo_capability_system_builder_command_fop=/usr/bin/fop
bamboo_capability_dbms_sqlite_2=true
bamboo_planRepository_name=phpBB Ascraeus
bamboo_PRnumber=4789
bamboo_buildNumber=6973
bamboo_repository_75956235_git_repositoryUrl=https://github.com/phpbb/phpbb.git
bamboo_capability_system_builder_phpunit_PHPUnit=/usr/bin/phpunit
bamboo_shortJobName=Build and Test Job
bamboo_buildResultsUrl=https://bamboo.phpbb.com/browse/PHPBB3-PR-JOB1-6973
bamboo_repository_75956235_branch_name=3.1.x
bamboo_planRepository_repositoryUrl=https://github.com/phpbb/phpbb.git
bamboo_agentId=131073
bamboo_planName=phpBB3 - Pull Requests
bamboo_build_commandline_com_atlassian_bamboo_plugins_scripttask_task_builder_script_7=/bin/sh /home/bamboo/temp/PHPBB3-PR-JOB1-6973-ScriptBuildTask-1510935183880845682.sh
bamboo_shortPlanKey=PR
bamboo_shortJobKey=JOB1
bamboo_capability_dbms_mysql_55=true
bamboo_capability_system_jdk_JDK_1_7_0_65=/usr/lib/jvm/java-7-openjdk-amd64
bamboo_planRepository_revision=f9a596c544fb6677d822cd78d16987d8e751b729
bamboo_repository_previous_revision_number=f9a596c544fb6677d822cd78d16987d8e751b729
bamboo_buildTimeStamp=2017-04-12T22:15:41.853Z
bamboo_planRepository_previousRevision=f9a596c544fb6677d822cd78d16987d8e751b729
bamboo_capability_system_builder_mvn2_Maven_2=/usr/share/maven2
bamboo_capability_system_jdk_JDK_1_6_0_16=/usr/lib/jvm/java-6-sun-1.6.0.16
bamboo_build_commandline_com_atlassian_bamboo_plugins_scripttask_task_builder_script_4=/bin/sh /home/bamboo/temp/PHPBB3-PR-JOB1-6973-ScriptBuildTask-7614642100847184652.sh
bamboo_buildResultKey=PHPBB3-PR-JOB1-6973
bamboo_repository_git_branch=3.1.x
bamboo_repository_branch_name=3.1.x
bamboo_buildPlanName=phpBB3 - Pull Requests - Build and Test Job
bamboo_planRepository_1_revision=f9a596c544fb6677d822cd78d16987d8e751b729
bamboo_repository_name=phpBB Ascraeus
bamboo_capability_system_docker_executable=/usr/bin/docker
bamboo_planRepository_branch=3.1.x
bamboo_agentWorkingDirectory=/home/bamboo/xml-data/build-dir
bamboo_capability_system_git_executable=/usr/bin/git
bamboo_planRepository_1_previousRevision=f9a596c544fb6677d822cd78d16987d8e751b729
bamboo_capability_system_builder_phpunit_PHPUnit_3_4=/usr/bin/phpunit
bamboo_repository_git_username=bantu
bamboo_repository_75956235_revision_number=f9a596c544fb6677d822cd78d16987d8e751b729
bamboo_planRepository_branchDisplayName=3.1.x
bamboo_planRepository_1_type=gitv2
bamboo_planRepository_branchName=3.1.x
bamboo_repository_75956235_previous_revision_number=f9a596c544fb6677d822cd78d16987d8e751b729
bamboo_capability_system_jdk_JDK=/usr/lib/jvm/java-6-sun
bamboo_plan_storageTag=PHPBB3-PR
bamboo_planRepository_type=gitv2
bamboo_planRepository_1_username=bantu
bamboo_ManualBuildTriggerReason_userName=Build Robot
bamboo_repository_git_repositoryUrl=https://github.com/phpbb/phpbb.git
bamboo_repository_75956235_git_branch=3.1.x
bamboo_capability_system_builder_ant_Ant=/usr/share/ant
bamboo_repository_75956235_name=phpBB Ascraeus
bamboo_working_directory=/home/bamboo/xml-data/build-dir/PHPBB3-PR-JOB1
bamboo_planKey=PHPBB3-PR
bamboo_planRepository_1_repositoryUrl=https://github.com/phpbb/phpbb.git
bamboo_planRepository_username=bantu
bamboo_capability_local=true
bamboo_capability_system_jdk_JDK_1_6=/usr/lib/jvm/java-6-sun
bamboo_capability_system_jdk_JDK_1_7=/usr/lib/jvm/java-7-openjdk-amd64
bamboo_planRepository_1_branchName=3.1.x
12-Apr-2017 22:15:47 You are running composer with xdebug enabled. This has a major impact on runtime performance. See https://getcomposer.org/xdebug
12-Apr-2017 22:15:47 You are using the deprecated option "dev". Dev packages are installed by default now.
12-Apr-2017 22:15:47 Cannot create cache directory /home/bamboo/.composer/cache/repo/https---packagist.org/, or directory is not writable. Proceeding without cache
12-Apr-2017 22:15:47 Cannot create cache directory /home/bamboo/.composer/cache/files/, or directory is not writable. Proceeding without cache
12-Apr-2017 22:15:47 Loading composer repositories with package information
12-Apr-2017 22:15:47 Installing dependencies (including require-dev) from lock file
12-Apr-2017 22:15:47   - Installing bantu/ini-get-wrapper (v1.0.1)
12-Apr-2017 22:15:49     Downloading: Connecting...    Downloading: 100%         
12-Apr-2017 22:15:49
12-Apr-2017 22:15:49   - Installing google/recaptcha (1.1.2)
12-Apr-2017 22:15:50     Downloading: Connecting...    Downloading: 0%               Downloading: 30%    Downloading: 55%    Downloading: 65%    Downloading: 70%    Downloading: 85%    Downloading: 90%    Downloading: 100%    Downloading: 100%
12-Apr-2017 22:15:50
12-Apr-2017 22:15:50   - Installing guzzlehttp/promises (1.3.0)
12-Apr-2017 22:15:52     Downloading: Connecting...    Downloading: 0%               Downloading: 15%    Downloading: 25%    Downloading: 40%    Downloading: 60%    Downloading: 70%    Downloading: 85%    Downloading: 100%    Downloading: 100%
12-Apr-2017 22:15:52
12-Apr-2017 22:15:52   - Installing psr/http-message (1.0.1)
12-Apr-2017 22:15:53     Downloading: Connecting...    Downloading: 0%               Downloading: 95%    Downloading: 100%    Downloading: 100%
12-Apr-2017 22:15:53
12-Apr-2017 22:15:53   - Installing guzzlehttp/psr7 (1.3.1)
12-Apr-2017 22:15:54     Downloading: Connecting...    Downloading: 0%               Downloading: 5%    Downloading: 15%    Downloading: 20%    Downloading: 30%    Downloading: 35%    Downloading: 45%    Downloading: 50%    Downloading: 65%    Downloading: 70%    Downloading: 85%    Downloading: 90%    Downloading: 100%    Downloading: 100%
12-Apr-2017 22:15:54
12-Apr-2017 22:15:54   - Installing lusitanian/oauth (v0.8.9)
12-Apr-2017 22:15:55     Downloading: Connecting...    Downloading: 100%         
12-Apr-2017 22:15:55
12-Apr-2017 22:15:55   - Installing marc1706/fast-image-size (v1.1.2)
12-Apr-2017 22:15:56     Downloading: Connecting...    Downloading: 100%         
12-Apr-2017 22:15:56
12-Apr-2017 22:15:56   - Installing paragonie/random_compat (v1.4.1)
12-Apr-2017 22:15:57     Downloading: Connecting...    Downloading: 0%               Downloading: 20%    Downloading: 35%    Downloading: 55%    Downloading: 90%    Downloading: 100%
12-Apr-2017 22:15:57
12-Apr-2017 22:15:57   - Installing patchwork/utf8 (v1.3.1)
12-Apr-2017 22:15:58     Downloading: Connecting...    Downloading: 0%               Downloading: 5%    Downloading: 10%    Downloading: 15%    Downloading: 20%    Downloading: 25%    Downloading: 30%    Downloading: 35%    Downloading: 40%    Downloading: 45%    Downloading: 50%    Downloading: 55%    Downloading: 60%    Downloading: 65%    Downloading: 70%    Downloading: 75%    Downloading: 80%    Downloading: 85%    Downloading: 90%    Downloading: 95%    Downloading: 100%    Downloading: 100%
12-Apr-2017 22:15:58
12-Apr-2017 22:15:58   - Installing s9e/text-formatter (0.9.1)
12-Apr-2017 22:16:00     Downloading: Connecting...    Downloading: 100%         
12-Apr-2017 22:16:00
12-Apr-2017 22:16:00   - Installing symfony/filesystem (v3.2.0)
12-Apr-2017 22:16:01     Downloading: Connecting...    Downloading: 0%               Downloading: 35%    Downloading: 40%    Downloading: 75%    Downloading: 95%    Downloading: 100%    Downloading: 100%
12-Apr-2017 22:16:01
12-Apr-2017 22:16:01   - Installing symfony/config (v3.2.0)
12-Apr-2017 22:16:02     Downloading: Connecting...    Downloading: 100%         
12-Apr-2017 22:16:02
12-Apr-2017 22:16:02   - Installing symfony/finder (v3.2.0)
12-Apr-2017 22:16:03     Downloading: Connecting...    Downloading: 100%         
12-Apr-2017 22:16:03
12-Apr-2017 22:16:03   - Installing symfony/polyfill-mbstring (v1.3.0)
12-Apr-2017 22:16:04     Downloading: Connecting...    Downloading: 0%               Downloading: 35%    Downloading: 70%    Downloading: 90%    Downloading: 100%
12-Apr-2017 22:16:04
12-Apr-2017 22:16:04   - Installing symfony/http-foundation (v3.2.0)
12-Apr-2017 22:16:05     Downloading: Connecting...    Downloading: 100%         
12-Apr-2017 22:16:05
12-Apr-2017 22:16:05   - Installing symfony/event-dispatcher (v3.2.0)
12-Apr-2017 22:16:06     Downloading: Connecting...    Downloading: 0%               Downloading: 5%    Downloading: 10%    Downloading: 15%    Downloading: 100%
12-Apr-2017 22:16:06
12-Apr-2017 22:16:06   - Installing psr/log (1.0.2)
12-Apr-2017 22:16:07     Downloading: Connecting...    Downloading: 0%               Downloading: 15%    Downloading: 100%    Downloading: 100%
12-Apr-2017 22:16:07
12-Apr-2017 22:16:07   - Installing symfony/debug (v3.2.0)
12-Apr-2017 22:16:08     Downloading: Connecting...    Downloading: 0%               Downloading: 5%    Downloading: 15%    Downloading: 20%    Downloading: 25%    Downloading: 35%    Downloading: 40%    Downloading: 45%    Downloading: 70%    Downloading: 75%    Downloading: 95%    Downloading: 100%    Downloading: 100%
12-Apr-2017 22:16:08
12-Apr-2017 22:16:08   - Installing symfony/http-kernel (v3.2.0)
12-Apr-2017 22:16:10     Downloading: Connecting...    Downloading: 100%         
12-Apr-2017 22:16:10
12-Apr-2017 22:16:10   - Installing symfony/dependency-injection (v3.2.0)
12-Apr-2017 22:16:11     Downloading: Connecting...    Downloading: 100%         
12-Apr-2017 22:16:11
12-Apr-2017 22:16:11   - Installing zendframework/zend-eventmanager (3.0.1)
12-Apr-2017 22:16:12     Downloading: Connecting...    Downloading: 0%               Downloading: 15%    Downloading: 30%    Downloading: 55%    Downloading: 70%    Downloading: 85%    Downloading: 100%
12-Apr-2017 22:16:12
12-Apr-2017 22:16:12   - Installing zendframework/zend-code (2.6.3)
12-Apr-2017 22:16:13     Downloading: Connecting...    Downloading: 0%               Downloading: 5%    Downloading: 10%    Downloading: 15%    Downloading: 20%    Downloading: 25%    Downloading: 30%    Downloading: 35%    Downloading: 40%    Downloading: 45%    Downloading: 50%    Downloading: 55%    Downloading: 60%    Downloading: 65%    Downloading: 70%    Downloading: 75%    Downloading: 80%    Downloading: 85%    Downloading: 90%    Downloading: 95%    Downloading: 100%    Downloading: 100%
12-Apr-2017 22:16:13
12-Apr-2017 22:16:13   - Installing ocramius/proxy-manager (1.0.2)
12-Apr-2017 22:16:15     Downloading: Connecting...    Downloading: 0%               Downloading: 5%    Downloading: 10%    Downloading: 15%    Downloading: 20%    Downloading: 25%    Downloading: 30%    Downloading: 35%    Downloading: 40%    Downloading: 45%    Downloading: 50%    Downloading: 55%    Downloading: 65%    Downloading: 70%    Downloading: 75%    Downloading: 80%    Downloading: 85%    Downloading: 90%    Downloading: 95%    Downloading: 100%    Downloading: 100%
12-Apr-2017 22:16:15
12-Apr-2017 22:16:15   - Installing symfony/proxy-manager-bridge (v3.2.0)
12-Apr-2017 22:16:16     Downloading: Connecting...    Downloading: 100%         
12-Apr-2017 22:16:16
12-Apr-2017 22:16:16   - Installing symfony/routing (v3.2.0)
12-Apr-2017 22:16:17     Downloading: Connecting...    Downloading: 100%         
12-Apr-2017 22:16:17
12-Apr-2017 22:16:17   - Installing twig/twig (v1.24.2)
12-Apr-2017 22:16:19     Downloading: Connecting...    Downloading: 0%               Downloading: 5%    Downloading: 10%    Downloading: 15%    Downloading: 20%    Downloading: 25%    Downloading: 30%    Downloading: 35%    Downloading: 40%    Downloading: 45%    Downloading: 50%    Downloading: 55%    Downloading: 60%    Downloading: 65%    Downloading: 70%    Downloading: 75%    Downloading: 80%    Downloading: 85%    Downloading: 90%    Downloading: 95%    Downloading: 100%    Downloading: 100%
12-Apr-2017 22:16:19
12-Apr-2017 22:16:19   - Installing symfony/twig-bridge (v3.1.4)
12-Apr-2017 22:16:21     Downloading: Connecting...    Downloading: 100%         
12-Apr-2017 22:16:21
12-Apr-2017 22:16:21   - Installing symfony/dom-crawler (v3.2.0)
12-Apr-2017 22:16:23     Downloading: Connecting...    Downloading: 100%         
12-Apr-2017 22:16:23
12-Apr-2017 22:16:23   - Installing symfony/css-selector (v3.2.0)
12-Apr-2017 22:16:25     Downloading: Connecting...    Downloading: 0%               Downloading: 5%    Downloading: 10%    Downloading: 15%    Downloading: 20%    Downloading: 65%    Downloading: 70%    Downloading: 75%    Downloading: 80%    Downloading: 85%    Downloading: 90%    Downloading: 95%    Downloading: 100%
12-Apr-2017 22:16:25
12-Apr-2017 22:16:25   - Installing symfony/browser-kit (v3.2.0)
12-Apr-2017 22:16:26     Downloading: Connecting...    Downloading: 0%               Downloading: 50%    Downloading: 80%    Downloading: 85%    Downloading: 100%    Downloading: 100%
12-Apr-2017 22:16:26
12-Apr-2017 22:16:26   - Installing guzzlehttp/guzzle (6.2.2)
12-Apr-2017 22:16:27     Downloading: Connecting...    Downloading: 0%               Downloading: 5%    Downloading: 10%    Downloading: 15%    Downloading: 25%    Downloading: 30%    Downloading: 40%    Downloading: 45%    Downloading: 50%    Downloading: 55%    Downloading: 65%    Downloading: 70%    Downloading: 75%    Downloading: 85%    Downloading: 90%    Downloading: 95%    Downloading: 100%
12-Apr-2017 22:16:27
12-Apr-2017 22:16:27   - Installing fabpot/goutte (v3.2.0)
12-Apr-2017 22:16:28     Downloading: Connecting...    Downloading: 0%               Downloading: 70%    Downloading: 100%    Downloading: 100%
12-Apr-2017 22:16:28
12-Apr-2017 22:16:28   - Installing facebook/webdriver (1.2.0)
12-Apr-2017 22:16:30     Downloading: Connecting...    Downloading: 0%               Downloading: 5%    Downloading: 10%    Downloading: 15%    Downloading: 20%    Downloading: 25%    Downloading: 30%    Downloading: 35%    Downloading: 40%    Downloading: 45%    Downloading: 50%    Downloading: 55%    Downloading: 60%    Downloading: 65%    Downloading: 70%    Downloading: 75%    Downloading: 80%    Downloading: 85%    Downloading: 90%    Downloading: 95%    Downloading: 100%    Downloading: 100%
12-Apr-2017 22:16:30
12-Apr-2017 22:16:30   - Installing symfony/process (v3.2.0)
12-Apr-2017 22:16:31     Downloading: Connecting...    Downloading: 100%         
12-Apr-2017 22:16:31
12-Apr-2017 22:16:31   - Installing symfony/console (v3.2.0)
12-Apr-2017 22:16:33     Downloading: Connecting...    Downloading: 100%         
12-Apr-2017 22:16:33
12-Apr-2017 22:16:33   - Installing laravel/homestead (v4.0.5)
12-Apr-2017 22:16:34     Downloading: Connecting...    Downloading: 100%         
12-Apr-2017 22:16:34
12-Apr-2017 22:16:34   - Installing phing/phing (2.4.14)
12-Apr-2017 22:16:35     Downloading: Connecting...    Downloading: 100%         
12-Apr-2017 22:16:36
12-Apr-2017 22:16:36   - Installing phpdocumentor/reflection-docblock (2.0.4)
12-Apr-2017 22:16:37     Downloading: Connecting...    Downloading: 0%               Downloading: 15%    Downloading: 40%    Downloading: 45%    Downloading: 65%    Downloading: 70%    Downloading: 85%    Downloading: 90%    Downloading: 95%    Downloading: 100%    Downloading: 100%
12-Apr-2017 22:16:37
12-Apr-2017 22:16:37   - Installing phpdocumentor/reflection-common (1.0)
12-Apr-2017 22:16:37     Downloading: Connecting...    Downloading: 0%               Downloading: 65%    Downloading: 100%    Downloading: 100%
12-Apr-2017 22:16:38
12-Apr-2017 22:16:38   - Installing phpdocumentor/type-resolver (0.2.1)
12-Apr-2017 22:16:39     Downloading: Connecting...    Downloading: 0%               Downloading: 20%    Downloading: 35%    Downloading: 80%    Downloading: 100%    Downloading: 100%
12-Apr-2017 22:16:39
12-Apr-2017 22:16:39   - Installing symfony/yaml (v3.2.0)
12-Apr-2017 22:16:40     Downloading: Connecting...    Downloading: 0%               Downloading: 10%    Downloading: 15%    Downloading: 25%    Downloading: 40%    Downloading: 50%    Downloading: 65%    Downloading: 75%    Downloading: 85%    Downloading: 90%    Downloading: 100%
12-Apr-2017 22:16:40
12-Apr-2017 22:16:40   - Installing sebastian/version (1.0.6)
12-Apr-2017 22:16:41     Downloading: Connecting...    Downloading: 0%               Downloading: 100%    Downloading: 100%
12-Apr-2017 22:16:41
12-Apr-2017 22:16:41   - Installing sebastian/global-state (1.1.1)
12-Apr-2017 22:16:42     Downloading: Connecting...    Downloading: 0%               Downloading: 40%    Downloading: 70%    Downloading: 100%    Downloading: 100%
12-Apr-2017 22:16:42
12-Apr-2017 22:16:42   - Installing sebastian/recursion-context (1.0.2)
12-Apr-2017 22:16:42     Downloading: Connecting...    Downloading: 0%               Downloading: 35%    Downloading: 70%    Downloading: 100%    Downloading: 100%
12-Apr-2017 22:16:42
12-Apr-2017 22:16:42   - Installing sebastian/exporter (1.2.2)
12-Apr-2017 22:16:43     Downloading: Connecting...    Downloading: 0%               Downloading: 100%
12-Apr-2017 22:16:43
12-Apr-2017 22:16:43   - Installing sebastian/environment (1.3.8)
12-Apr-2017 22:16:44     Downloading: Connecting...    Downloading: 0%               Downloading: 15%    Downloading: 30%    Downloading: 45%    Downloading: 60%    Downloading: 75%    Downloading: 100%    Downloading: 100%
12-Apr-2017 22:16:44
12-Apr-2017 22:16:44   - Installing sebastian/diff (1.4.1)
12-Apr-2017 22:16:45     Downloading: Connecting...    Downloading: 0%               Downloading: 15%    Downloading: 30%    Downloading: 45%    Downloading: 100%    Downloading: 100%
12-Apr-2017 22:16:45
12-Apr-2017 22:16:45   - Installing sebastian/comparator (1.2.2)
12-Apr-2017 22:16:46     Downloading: Connecting...    Downloading: 0%               Downloading: 10%    Downloading: 20%    Downloading: 30%    Downloading: 40%    Downloading: 45%    Downloading: 55%    Downloading: 65%    Downloading: 75%    Downloading: 85%    Downloading: 95%    Downloading: 100%    Downloading: 100%
12-Apr-2017 22:16:46
12-Apr-2017 22:16:46   - Installing phpunit/php-text-template (1.2.1)
12-Apr-2017 22:16:47     Downloading: Connecting...    Downloading: 0%               Downloading: 35%    Downloading: 100%    Downloading: 100%
12-Apr-2017 22:16:47
12-Apr-2017 22:16:47   - Installing doctrine/instantiator (1.0.5)
12-Apr-2017 22:16:48     Downloading: Connecting...    Downloading: 0%               Downloading: 15%    Downloading: 30%    Downloading: 45%    Downloading: 50%    Downloading: 65%    Downloading: 80%    Downloading: 95%    Downloading: 100%    Downloading: 100%
12-Apr-2017 22:16:48
12-Apr-2017 22:16:48   - Installing phpunit/phpunit-mock-objects (2.3.8)
12-Apr-2017 22:16:49     Downloading: Connecting...    Downloading: 0%               Downloading: 5%    Downloading: 20%    Downloading: 25%    Downloading: 35%    Downloading: 40%    Downloading: 45%    Downloading: 50%    Downloading: 60%    Downloading: 65%    Downloading: 70%    Downloading: 75%    Downloading: 90%    Downloading: 95%    Downloading: 100%    Downloading: 100%
12-Apr-2017 22:16:50
12-Apr-2017 22:16:50   - Installing phpunit/php-timer (1.0.8)
12-Apr-2017 22:16:50     Downloading: Connecting...    Downloading: 0%               Downloading: 100%    Downloading: 100%
12-Apr-2017 22:16:50
12-Apr-2017 22:16:50   - Installing phpunit/php-file-iterator (1.4.2)
12-Apr-2017 22:16:51     Downloading: Connecting...    Downloading: 0%               Downloading: 20%    Downloading: 40%    Downloading: 60%    Downloading: 100%    Downloading: 100%
12-Apr-2017 22:16:51
12-Apr-2017 22:16:51   - Installing phpunit/php-token-stream (1.4.9)
12-Apr-2017 22:16:52     Downloading: Connecting...    Downloading: 0%               Downloading: 5%    Downloading: 10%    Downloading: 15%    Downloading: 20%    Downloading: 65%    Downloading: 70%    Downloading: 75%    Downloading: 80%    Downloading: 85%    Downloading: 90%    Downloading: 95%    Downloading: 100%    Downloading: 100%
12-Apr-2017 22:16:52
12-Apr-2017 22:16:52   - Installing phpunit/php-code-coverage (2.2.4)
12-Apr-2017 22:16:54     Downloading: Connecting...    Downloading: 0%               Downloading: 5%    Downloading: 10%    Downloading: 15%    Downloading: 20%    Downloading: 25%    Downloading: 30%    Downloading: 35%    Downloading: 40%    Downloading: 45%    Downloading: 50%    Downloading: 55%    Downloading: 60%    Downloading: 65%    Downloading: 70%    Downloading: 80%    Downloading: 90%    Downloading: 95%    Downloading: 100%    Downloading: 100%
12-Apr-2017 22:16:54
12-Apr-2017 22:16:54   - Installing phpspec/prophecy (v1.6.2)
12-Apr-2017 22:16:55     Downloading: Connecting...    Downloading: 0%               Downloading: 5%    Downloading: 10%    Downloading: 15%    Downloading: 20%    Downloading: 25%    Downloading: 30%    Downloading: 35%    Downloading: 40%    Downloading: 45%    Downloading: 50%    Downloading: 55%    Downloading: 60%    Downloading: 65%    Downloading: 70%    Downloading: 75%    Downloading: 80%    Downloading: 85%    Downloading: 90%    Downloading: 95%    Downloading: 100%    Downloading: 100%
12-Apr-2017 22:16:55
12-Apr-2017 22:16:55   - Installing phpunit/phpunit (4.8.31)
12-Apr-2017 22:16:56     Downloading: Connecting...    Downloading: 0%               Downloading: 5%    Downloading: 10%    Downloading: 15%    Downloading: 20%    Downloading: 25%    Downloading: 30%    Downloading: 35%    Downloading: 40%    Downloading: 45%    Downloading: 50%    Downloading: 55%    Downloading: 60%    Downloading: 65%    Downloading: 70%    Downloading: 80%    Downloading: 90%    Downloading: 100%    Downloading: 100%
12-Apr-2017 22:16:56
12-Apr-2017 22:16:56   - Installing phpunit/dbunit (2.0.3)
12-Apr-2017 22:16:58     Downloading: Connecting...    Downloading: 0%               Downloading: 5%    Downloading: 10%    Downloading: 15%    Downloading: 20%    Downloading: 25%    Downloading: 30%    Downloading: 35%    Downloading: 40%    Downloading: 45%    Downloading: 50%    Downloading: 55%    Downloading: 60%    Downloading: 65%    Downloading: 70%    Downloading: 75%    Downloading: 80%    Downloading: 85%    Downloading: 90%    Downloading: 95%    Downloading: 100%    Downloading: 100%
12-Apr-2017 22:16:58
12-Apr-2017 22:16:58   - Installing squizlabs/php_codesniffer (2.7.1)
12-Apr-2017 22:16:59     Downloading: Connecting...    Downloading: 0%               Downloading: 5%    Downloading: 10%    Downloading: 15%    Downloading: 20%    Downloading: 25%    Downloading: 30%    Downloading: 35%    Downloading: 40%    Downloading: 45%    Downloading: 50%    Downloading: 55%    Downloading: 60%    Downloading: 65%    Downloading: 70%    Downloading: 75%    Downloading: 80%    Downloading: 85%    Downloading: 90%    Downloading: 95%    Downloading: 100%    Downloading: 100%
12-Apr-2017 22:16:59
12-Apr-2017 22:16:59   - Installing webmozart/assert (1.2.0)
12-Apr-2017 22:17:01     Downloading: Connecting...    Downloading: 0%               Downloading: 55%    Downloading: 80%    Downloading: 100%    Downloading: 100%
12-Apr-2017 22:17:01
12-Apr-2017 22:17:02 lusitanian/oauth suggests installing predis/predis (Allows using the Redis storage backend.)
12-Apr-2017 22:17:02 paragonie/random_compat suggests installing ext-libsodium (Provides a modern crypto API that can be used to generate random bytes.)
12-Apr-2017 22:17:02 patchwork/utf8 suggests installing ext-intl (Use Intl for best performance)
12-Apr-2017 22:17:02 patchwork/utf8 suggests installing ext-wfio (Use WFIO for UTF-8 filesystem access on Windows)
12-Apr-2017 22:17:02 s9e/text-formatter suggests installing ext-intl (Allows international URLs to be accepted by the URL filter)
12-Apr-2017 22:17:02 s9e/text-formatter suggests installing ext-xsl (Enables the XSLT renderer)
12-Apr-2017 22:17:02 symfony/http-kernel suggests installing symfony/class-loader ()
12-Apr-2017 22:17:02 symfony/http-kernel suggests installing symfony/var-dumper ()
12-Apr-2017 22:17:02 symfony/dependency-injection suggests installing symfony/expression-language (For using expressions in service container configuration)
12-Apr-2017 22:17:02 zendframework/zend-eventmanager suggests installing container-interop/container-interop (^1.1.0, to use the lazy listeners feature)
12-Apr-2017 22:17:02 zendframework/zend-eventmanager suggests installing zendframework/zend-stdlib (^2.7.3 || ^3.0, to use the FilterChain feature)
12-Apr-2017 22:17:02 zendframework/zend-code suggests installing doctrine/annotations (Doctrine\Common\Annotations >=1.0 for annotation features)
12-Apr-2017 22:17:02 zendframework/zend-code suggests installing zendframework/zend-stdlib (Zend\Stdlib component)
12-Apr-2017 22:17:02 ocramius/proxy-manager suggests installing ocramius/generated-hydrator (To have very fast object to array to object conversion for ghost objects)
12-Apr-2017 22:17:02 ocramius/proxy-manager suggests installing zendframework/zend-json (To have the JsonRpc adapter (Remote Object feature))
12-Apr-2017 22:17:02 ocramius/proxy-manager suggests installing zendframework/zend-soap (To have the Soap adapter (Remote Object feature))
12-Apr-2017 22:17:02 ocramius/proxy-manager suggests installing zendframework/zend-stdlib (To use the hydrator proxy)
12-Apr-2017 22:17:02 ocramius/proxy-manager suggests installing zendframework/zend-xmlrpc (To have the XmlRpc adapter (Remote Object feature))
12-Apr-2017 22:17:02 symfony/routing suggests installing doctrine/annotations (For using the annotation loader)
12-Apr-2017 22:17:02 symfony/routing suggests installing symfony/expression-language (For using expression matching)
12-Apr-2017 22:17:02 symfony/twig-bridge suggests installing symfony/asset (For using the AssetExtension)
12-Apr-2017 22:17:02 symfony/twig-bridge suggests installing symfony/expression-language (For using the ExpressionExtension)
12-Apr-2017 22:17:02 symfony/twig-bridge suggests installing symfony/form (For using the FormExtension)
12-Apr-2017 22:17:02 symfony/twig-bridge suggests installing symfony/security (For using the SecurityExtension)
12-Apr-2017 22:17:02 symfony/twig-bridge suggests installing symfony/stopwatch (For using the StopwatchExtension)
12-Apr-2017 22:17:02 symfony/twig-bridge suggests installing symfony/templating (For using the TwigEngine)
12-Apr-2017 22:17:02 symfony/twig-bridge suggests installing symfony/translation (For using the TranslationExtension)
12-Apr-2017 22:17:02 symfony/twig-bridge suggests installing symfony/var-dumper (For using the DumpExtension)
12-Apr-2017 22:17:02 facebook/webdriver suggests installing phpdocumentor/phpdocumentor (2.*)
12-Apr-2017 22:17:02 phpdocumentor/reflection-docblock suggests installing dflydev/markdown (~1.0)
12-Apr-2017 22:17:02 phpdocumentor/reflection-docblock suggests installing erusev/parsedown (~1.0)
12-Apr-2017 22:17:02 sebastian/global-state suggests installing ext-uopz (*)
12-Apr-2017 22:17:02 phpunit/phpunit-mock-objects suggests installing ext-soap (*)
12-Apr-2017 22:17:02 phpunit/phpunit suggests installing phpunit/php-invoker (~1.1)
12-Apr-2017 22:17:02 Generating autoload files
12-Apr-2017 22:17:03 Buildfile: /data/build/build.xml
12-Apr-2017 22:17:03
12-Apr-2017 22:17:03 phpBB > clean:
12-Apr-2017 22:17:03
12-Apr-2017 22:17:03    [delete] Directory /data/build/logs does not exist or is not a directory.
12-Apr-2017 22:17:03    [delete] Directory /data/build/api does not exist or is not a directory.
12-Apr-2017 22:17:03    [delete] Directory /data/build/codebrowser does not exist or is not a directory.
12-Apr-2017 22:17:03    [delete] Directory /data/build/coverage does not exist or is not a directory.
12-Apr-2017 22:17:03    [delete] Directory /data/build/cpd does not exist or is not a directory.
12-Apr-2017 22:17:03    [delete] Directory /data/build/dependencies does not exist or is not a directory.
12-Apr-2017 22:17:03    [delete] Directory /data/build/new_version does not exist or is not a directory.
12-Apr-2017 22:17:03    [delete] Directory /data/build/old_versions does not exist or is not a directory.
12-Apr-2017 22:17:03    [delete] Directory /data/build/save does not exist or is not a directory.
12-Apr-2017 22:17:03
12-Apr-2017 22:17:03 phpBB > prepare:
12-Apr-2017 22:17:03
12-Apr-2017 22:17:03     [mkdir] Created dir: /data/build/logs
12-Apr-2017 22:17:03     [mkdir] Created dir: /data/build/api
12-Apr-2017 22:17:03     [mkdir] Created dir: /data/build/codebrowser
12-Apr-2017 22:17:03     [mkdir] Created dir: /data/build/coverage
12-Apr-2017 22:17:03     [mkdir] Created dir: /data/build/cpd
12-Apr-2017 22:17:03     [mkdir] Created dir: /data/build/dependencies
12-Apr-2017 22:17:03     [mkdir] Created dir: /data/build/new_version
12-Apr-2017 22:17:03     [mkdir] Created dir: /data/build/new_version/files
12-Apr-2017 22:17:03     [mkdir] Created dir: /data/build/new_version/patches
12-Apr-2017 22:17:03     [mkdir] Created dir: /data/build/new_version/release_files
12-Apr-2017 22:17:03     [mkdir] Created dir: /data/build/new_version/update
12-Apr-2017 22:17:03     [mkdir] Created dir: /data/build/old_versions
12-Apr-2017 22:17:03     [mkdir] Created dir: /data/build/save
12-Apr-2017 22:17:03
12-Apr-2017 22:17:03 BUILD FINISHED
12-Apr-2017 22:17:03
12-Apr-2017 22:17:03 Total time: 0.1134 seconds
12-Apr-2017 22:17:03
12-Apr-2017 22:17:03 Finished task 'Prepare directory' with result: Success
12-Apr-2017 22:17:03 Skipping execution of task 'Run sniffs' as it is disabled
12-Apr-2017 22:17:03
Substituting variable: ${bamboo.working.directory} with /home/bamboo/xml-data/build-dir/PHPBB3-PR-JOB1
12-Apr-2017 22:17:03 Starting task 'Run sniffs' of type 'com.atlassian.bamboo.plugins.bamboo-docker-plugin:task.docker.cli'
12-Apr-2017 22:17:03 Running image name (phpbb:php-5.6)
12-Apr-2017 22:17:03
Beginning to execute external process for build 'phpBB3 - Pull Requests - Build and Test Job #6973 (PHPBB3-PR-JOB1-6973)'
... running command line:
/usr/bin/docker run --volume /home/bamboo/xml-data/build-dir/PHPBB3-PR-JOB1:/data --workdir /data/build --rm -u=991 phpbb:php-5.6 ../phpBB/vendor/bin/phing sniff
... in: /home/bamboo/xml-data/build-dir/PHPBB3-PR-JOB1
... using extra environment variables:
bamboo_planRepository_1_branch=3.1.x
bamboo_planRepository_1_branchDisplayName=3.1.x
bamboo_repository_revision_number=f9a596c544fb6677d822cd78d16987d8e751b729
bamboo_PRref=master
bamboo_resultsUrl=https://bamboo.phpbb.com/browse/PHPBB3-PR-JOB1-6973
bamboo_capability_system_builder_command_Git=/usr/bin/git
bamboo_repository_75956235_git_username=bantu
bamboo_planRepository_1_name=phpBB Ascraeus
bamboo_build_working_directory=/home/bamboo/xml-data/build-dir/PHPBB3-PR-JOB1
bamboo_buildKey=PHPBB3-PR-JOB1
bamboo_capability_phpbb_tests=true
bamboo_shortPlanName=Pull Requests
bamboo_capability_system_builder_command_fop=/usr/bin/fop
bamboo_capability_dbms_sqlite_2=true
bamboo_planRepository_name=phpBB Ascraeus
bamboo_PRnumber=4789
bamboo_buildNumber=6973
bamboo_repository_75956235_git_repositoryUrl=https://github.com/phpbb/phpbb.git
bamboo_capability_system_builder_phpunit_PHPUnit=/usr/bin/phpunit
bamboo_shortJobName=Build and Test Job
bamboo_buildResultsUrl=https://bamboo.phpbb.com/browse/PHPBB3-PR-JOB1-6973
bamboo_repository_75956235_branch_name=3.1.x
bamboo_planRepository_repositoryUrl=https://github.com/phpbb/phpbb.git
bamboo_agentId=131073
bamboo_planName=phpBB3 - Pull Requests
bamboo_build_commandline_com_atlassian_bamboo_plugins_scripttask_task_builder_script_7=/bin/sh /home/bamboo/temp/PHPBB3-PR-JOB1-6973-ScriptBuildTask-1510935183880845682.sh
bamboo_shortPlanKey=PR
bamboo_shortJobKey=JOB1
bamboo_capability_dbms_mysql_55=true
bamboo_capability_system_jdk_JDK_1_7_0_65=/usr/lib/jvm/java-7-openjdk-amd64
bamboo_planRepository_revision=f9a596c544fb6677d822cd78d16987d8e751b729
bamboo_repository_previous_revision_number=f9a596c544fb6677d822cd78d16987d8e751b729
bamboo_buildTimeStamp=2017-04-12T22:15:41.853Z
bamboo_planRepository_previousRevision=f9a596c544fb6677d822cd78d16987d8e751b729
bamboo_capability_system_builder_mvn2_Maven_2=/usr/share/maven2
bamboo_capability_system_jdk_JDK_1_6_0_16=/usr/lib/jvm/java-6-sun-1.6.0.16
bamboo_build_commandline_com_atlassian_bamboo_plugins_scripttask_task_builder_script_4=/bin/sh /home/bamboo/temp/PHPBB3-PR-JOB1-6973-ScriptBuildTask-7614642100847184652.sh
bamboo_buildResultKey=PHPBB3-PR-JOB1-6973
bamboo_repository_git_branch=3.1.x
bamboo_repository_branch_name=3.1.x
bamboo_buildPlanName=phpBB3 - Pull Requests - Build and Test Job
bamboo_planRepository_1_revision=f9a596c544fb6677d822cd78d16987d8e751b729
bamboo_repository_name=phpBB Ascraeus
bamboo_capability_system_docker_executable=/usr/bin/docker
bamboo_build_commandline_com_atlassian_bamboo_plugins_bamboo_docker_plugin_task_docker_cli_12=/usr/bin/docker run --volume /home/bamboo/xml-data/build-dir/PHPBB3-PR-JOB1:/data --workdir /data/phpBB --rm -e HOME=/home/bamboo -u=991 phpbb:php-5.6 /bin/bash -c php ../composer.phar install --dev; cd ../build; ../phpBB/vendor/bin/phing clean prepare
bamboo_planRepository_branch=3.1.x
bamboo_agentWorkingDirectory=/home/bamboo/xml-data/build-dir
bamboo_capability_system_git_executable=/usr/bin/git
bamboo_planRepository_1_previousRevision=f9a596c544fb6677d822cd78d16987d8e751b729
bamboo_capability_system_builder_phpunit_PHPUnit_3_4=/usr/bin/phpunit
bamboo_repository_git_username=bantu
bamboo_repository_75956235_revision_number=f9a596c544fb6677d822cd78d16987d8e751b729
bamboo_planRepository_branchDisplayName=3.1.x
bamboo_planRepository_1_type=gitv2
bamboo_planRepository_branchName=3.1.x
bamboo_repository_75956235_previous_revision_number=f9a596c544fb6677d822cd78d16987d8e751b729
bamboo_capability_system_jdk_JDK=/usr/lib/jvm/java-6-sun
bamboo_plan_storageTag=PHPBB3-PR
bamboo_planRepository_type=gitv2
bamboo_planRepository_1_username=bantu
bamboo_ManualBuildTriggerReason_userName=Build Robot
bamboo_repository_git_repositoryUrl=https://github.com/phpbb/phpbb.git
bamboo_repository_75956235_git_branch=3.1.x
bamboo_capability_system_builder_ant_Ant=/usr/share/ant
bamboo_repository_75956235_name=phpBB Ascraeus
bamboo_working_directory=/home/bamboo/xml-data/build-dir/PHPBB3-PR-JOB1
bamboo_planKey=PHPBB3-PR
bamboo_planRepository_1_repositoryUrl=https://github.com/phpbb/phpbb.git
bamboo_planRepository_username=bantu
bamboo_capability_local=true
bamboo_capability_system_jdk_JDK_1_6=/usr/lib/jvm/java-6-sun
bamboo_capability_system_jdk_JDK_1_7=/usr/lib/jvm/java-7-openjdk-amd64
bamboo_planRepository_1_branchName=3.1.x
12-Apr-2017 22:17:03 Buildfile: /data/build/build.xml
12-Apr-2017 22:17:03
12-Apr-2017 22:17:03 phpBB > sniff:
12-Apr-2017 22:17:03
12-Apr-2017 22:17:11 ............................................................  60 / 682 (9%)
12-Apr-2017 22:17:13 ............................................................ 120 / 682 (18%)
12-Apr-2017 22:17:14 ............................................................ 180 / 682 (26%)
12-Apr-2017 22:17:15 ............................................................ 240 / 682 (35%)
12-Apr-2017 22:17:21 ............................................................ 300 / 682 (44%)
12-Apr-2017 22:17:26 ............................................................ 360 / 682 (53%)
12-Apr-2017 22:17:31 ............................................................ 420 / 682 (62%)
12-Apr-2017 22:17:35 ............................................................ 480 / 682 (70%)
12-Apr-2017 22:17:39 ............................................................ 540 / 682 (79%)
12-Apr-2017 22:17:43 ............................................................ 600 / 682 (88%)
12-Apr-2017 22:17:46 ....................................................E....... 660 / 682 (97%)
12-Apr-2017 22:17:47 ......................
12-Apr-2017 22:17:47
12-Apr-2017 22:17:47
12-Apr-2017 22:17:47 FILE: /data/phpBB/phpbb/style/manager.php
12-Apr-2017 22:17:47 ----------------------------------------------------------------------
12-Apr-2017 22:17:47 FOUND 8 ERRORS AFFECTING 8 LINES
12-Apr-2017 22:17:47 ----------------------------------------------------------------------
12-Apr-2017 22:17:47   86 | ERROR | There should be exactly one space between the keyword and
12-Apr-2017 22:17:47      |       | opening parenthesis
12-Apr-2017 22:17:47      |       | (phpbb.ControlStructures.OpeningParenthesis.NoSpaceBeforeOpeningParenthesis)
12-Apr-2017 22:17:47   89 | ERROR | There should be exactly one space between the keyword and
12-Apr-2017 22:17:47      |       | opening parenthesis
12-Apr-2017 22:17:47      |       | (phpbb.ControlStructures.OpeningParenthesis.NoSpaceBeforeOpeningParenthesis)
12-Apr-2017 22:17:47   99 | ERROR | There should be exactly one space between the keyword and
12-Apr-2017 22:17:47      |       | opening parenthesis
12-Apr-2017 22:17:47      |       | (phpbb.ControlStructures.OpeningParenthesis.NoSpaceBeforeOpeningParenthesis)
12-Apr-2017 22:17:47 111 | ERROR | There should be exactly one space between the keyword and
12-Apr-2017 22:17:47      |       | opening parenthesis
12-Apr-2017 22:17:47      |       | (phpbb.ControlStructures.OpeningParenthesis.NoSpaceBeforeOpeningParenthesis)
12-Apr-2017 22:17:47 125 | ERROR | There should be exactly one space between the keyword and
12-Apr-2017 22:17:47      |       | opening parenthesis
12-Apr-2017 22:17:47      |       | (phpbb.ControlStructures.OpeningParenthesis.NoSpaceBeforeOpeningParenthesis)
12-Apr-2017 22:17:47 143 | ERROR | There should be exactly one space between the keyword and
12-Apr-2017 22:17:47      |       | opening parenthesis
12-Apr-2017 22:17:47      |       | (phpbb.ControlStructures.OpeningParenthesis.NoSpaceBeforeOpeningParenthesis)
12-Apr-2017 22:17:47 152 | ERROR | There should be exactly one space between the keyword and
12-Apr-2017 22:17:47      |       | opening parenthesis
12-Apr-2017 22:17:47      |       | (phpbb.ControlStructures.OpeningParenthesis.NoSpaceBeforeOpeningParenthesis)
12-Apr-2017 22:17:47 246 | ERROR | There should be exactly one space between the keyword and
12-Apr-2017 22:17:47      |       | opening parenthesis
12-Apr-2017 22:17:47      |       | (phpbb.ControlStructures.OpeningParenthesis.NoSpaceBeforeOpeningParenthesis)
12-Apr-2017 22:17:47 ----------------------------------------------------------------------
12-Apr-2017 22:17:47
12-Apr-2017 22:17:47 Time: 43.25 secs; Memory: 77.5Mb
12-Apr-2017 22:17:47
12-Apr-2017 22:17:55 ............................................................  60 / 206 (29%)
12-Apr-2017 22:18:14 ............................................................ 120 / 206 (58%)
12-Apr-2017 22:18:29 ................................E........................... 180 / 206 (87%)
12-Apr-2017 22:18:36 ..........................
12-Apr-2017 22:18:36
12-Apr-2017 22:18:36
12-Apr-2017 22:18:36 FILE: /data/phpBB/includes/acp/acp_styles.php
12-Apr-2017 22:18:36 ----------------------------------------------------------------------
12-Apr-2017 22:18:36 FOUND 3 ERRORS AFFECTING 3 LINES
12-Apr-2017 22:18:36 ----------------------------------------------------------------------
12-Apr-2017 22:18:36 202 | ERROR | There should be exactly one space between the keyword and
12-Apr-2017 22:18:36      |       | opening parenthesis
12-Apr-2017 22:18:36      |       | (phpbb.ControlStructures.OpeningParenthesis.NoSpaceBeforeOpeningParenthesis)
12-Apr-2017 22:18:36 303 | ERROR | There should be exactly one space between the keyword and
12-Apr-2017 22:18:36      |       | opening parenthesis
12-Apr-2017 22:18:36      |       | (phpbb.ControlStructures.OpeningParenthesis.NoSpaceBeforeOpeningParenthesis)
12-Apr-2017 22:18:36 310 | ERROR | There should be exactly one space between the keyword and
12-Apr-2017 22:18:36      |       | opening parenthesis
12-Apr-2017 22:18:36      |       | (phpbb.ControlStructures.OpeningParenthesis.NoSpaceBeforeOpeningParenthesis)
12-Apr-2017 22:18:36 ----------------------------------------------------------------------
12-Apr-2017 22:18:36
12-Apr-2017 22:18:36 Time: 48.76 secs; Memory: 60.25Mb
12-Apr-2017 22:18:36
12-Apr-2017 22:18:36
12-Apr-2017 22:18:36
12-Apr-2017 22:18:36 Time: 17ms; Memory: 3.75Mb
12-Apr-2017 22:18:36
12-Apr-2017 22:18:36        [if] Error in IfTask
12-Apr-2017 22:18:36 Execution of target "sniff" failed for the following reason: /data/build/build.xml:108:6: /data/build/build.xml:114:9: PHP Code Sniffer failed.
12-Apr-2017 22:18:36
12-Apr-2017 22:18:36 BUILD FAILED
12-Apr-2017 22:18:36 /data/build/build.xml:108:6: /data/build/build.xml:114:9: PHP Code Sniffer failed.
12-Apr-2017 22:18:36 Total time: 2 minutes  32.40 seconds
12-Apr-2017 22:18:36
12-Apr-2017 22:18:36 Failing task since return code of [/usr/bin/docker run --volume /home/bamboo/xml-data/build-dir/PHPBB3-PR-JOB1:/data --workdir /data/build --rm -u=991 phpbb:php-5.6 ../phpBB/vendor/bin/phing sniff] was 1 while expected 0
12-Apr-2017 22:18:36 Error occurred while running Task 'Run sniffs(11)' of type com.atlassian.bamboo.plugins.bamboo-docker-plugin:task.docker.cli.
12-Apr-2017 22:18:36 com.atlassian.bamboo.task.TaskException: Failed to execute task
12-Apr-2017 22:18:36         at com.atlassian.bamboo.plugins.docker.service.RunService.execute(RunService.java:71)
12-Apr-2017 22:18:36         at com.atlassian.bamboo.plugins.docker.tasks.cli.DockerCliTask.execute(DockerCliTask.java:60)
12-Apr-2017 22:18:36         at com.atlassian.bamboo.task.TaskExecutorImpl.lambda$executeTasks$3(TaskExecutorImpl.java:317)
12-Apr-2017 22:18:36         at com.atlassian.bamboo.task.TaskExecutorImpl.executeTaskWithPrePostActions(TaskExecutorImpl.java:246)
12-Apr-2017 22:18:36         at com.atlassian.bamboo.task.TaskExecutorImpl.executeTasks(TaskExecutorImpl.java:317)
12-Apr-2017 22:18:36         at com.atlassian.bamboo.task.TaskExecutorImpl.execute(TaskExecutorImpl.java:118)
12-Apr-2017 22:18:36         at com.atlassian.bamboo.build.pipeline.tasks.ExecuteBuildTask.call(ExecuteBuildTask.java:74)
12-Apr-2017 22:18:36         at com.atlassian.bamboo.v2.build.agent.DefaultBuildAgent.build(DefaultBuildAgent.java:216)
12-Apr-2017 22:18:36         at com.atlassian.bamboo.v2.build.agent.BuildAgentControllerImpl$1.call(BuildAgentControllerImpl.java:139)
12-Apr-2017 22:18:36         at com.atlassian.bamboo.v2.build.agent.BuildAgentControllerImpl$1.call(BuildAgentControllerImpl.java:130)
12-Apr-2017 22:18:36         at com.atlassian.bamboo.variable.CustomVariableContextImpl.withVariableSubstitutor(CustomVariableContextImpl.java:221)
12-Apr-2017 22:18:36         at com.atlassian.bamboo.v2.build.agent.BuildAgentControllerImpl.waitAndPerformBuild(BuildAgentControllerImpl.java:129)
12-Apr-2017 22:18:36         at com.atlassian.bamboo.v2.build.agent.DefaultBuildAgent$1.run(DefaultBuildAgent.java:138)
12-Apr-2017 22:18:36         at com.atlassian.bamboo.utils.BambooRunnables$1.run(BambooRunnables.java:51)
12-Apr-2017 22:18:36         at com.atlassian.bamboo.security.ImpersonationHelper.runWith(ImpersonationHelper.java:31)
12-Apr-2017 22:18:36         at com.atlassian.bamboo.security.ImpersonationHelper.runWithSystemAuthority(ImpersonationHelper.java:20)
12-Apr-2017 22:18:36         at com.atlassian.bamboo.security.ImpersonationHelper$1.run(ImpersonationHelper.java:52)
12-Apr-2017 22:18:36         at java.lang.Thread.run(Thread.java:745)
12-Apr-2017 22:18:36 Caused by: com.atlassian.bamboo.plugins.docker.client.DockerException: Error running Docker run command
12-Apr-2017 22:18:36         at com.atlassian.bamboo.plugins.docker.client.DockerCmd.run(DockerCmd.java:103)
12-Apr-2017 22:18:36         at com.atlassian.bamboo.plugins.docker.service.RunService.execute(RunService.java:60)
12-Apr-2017 22:18:36         ... 17 more
12-Apr-2017 22:18:36 Caused by: com.atlassian.utils.process.ProcessException: Error executing /usr/bin/docker run --volume /home/bamboo/xml-data/build-dir/PHPBB3-PR-JOB1:/data --workdir /data/build --rm -u=991 phpbb:php-5.6 ../phpBB/vendor/bin/phing sniff
12-Apr-2017 22:18:36         at com.atlassian.bamboo.plugins.docker.process.DockerTaskProcessService.execute(DockerTaskProcessService.java:60)
12-Apr-2017 22:18:36         at com.atlassian.bamboo.plugins.docker.client.DockerCmd.run(DockerCmd.java:99)
12-Apr-2017 22:18:36         ... 18 more
12-Apr-2017 22:18:36 Starting task 'Parsing test results produced by script' of type 'com.atlassian.bamboo.plugins.testresultparser:task.testresultparser.junit'
12-Apr-2017 22:18:36 Parsing test results under /home/bamboo/xml-data/build-dir/PHPBB3-PR-JOB1...
12-Apr-2017 22:18:36 Failing task since test cases were expected but none were found.
12-Apr-2017 22:18:36 Finished task 'Parsing test results produced by script' with result: Failed
12-Apr-2017 22:18:36
Substituting variable: ${bamboo.PRnumber} with 4789
12-Apr-2017 22:18:36
Substituting variable: ${bamboo.buildResultsUrl} with https://bamboo.phpbb.com/browse/PHPBB3-PR-JOB1-6973
12-Apr-2017 22:18:36
Substituting variable: ${bamboo.buildResultsUrl} with https://bamboo.phpbb.com/browse/PHPBB3-PR-JOB1-6973
12-Apr-2017 22:18:36 Starting task 'Set result build status' of type 'com.atlassian.bamboo.plugins.scripttask:task.builder.script'
12-Apr-2017 22:18:36
Beginning to execute external process for build 'phpBB3 - Pull Requests - Build and Test Job #6973 (PHPBB3-PR-JOB1-6973)'
... running command line:
/bin/sh /home/bamboo/temp/PHPBB3-PR-JOB1-6973-ScriptBuildTask-3413367084285135545.sh
... in: /home/bamboo/xml-data/build-dir/PHPBB3-PR-JOB1
... using extra environment variables:
bamboo_planRepository_1_branch=3.1.x
bamboo_planRepository_1_branchDisplayName=3.1.x
bamboo_repository_revision_number=f9a596c544fb6677d822cd78d16987d8e751b729
bamboo_PRref=master
bamboo_resultsUrl=https://bamboo.phpbb.com/browse/PHPBB3-PR-JOB1-6973
bamboo_capability_system_builder_command_Git=/usr/bin/git
bamboo_repository_75956235_git_username=bantu
bamboo_planRepository_1_name=phpBB Ascraeus
bamboo_build_working_directory=/home/bamboo/xml-data/build-dir/PHPBB3-PR-JOB1
bamboo_buildKey=PHPBB3-PR-JOB1
bamboo_capability_phpbb_tests=true
bamboo_shortPlanName=Pull Requests
bamboo_capability_system_builder_command_fop=/usr/bin/fop
bamboo_capability_dbms_sqlite_2=true
bamboo_planRepository_name=phpBB Ascraeus
bamboo_PRnumber=4789
bamboo_buildNumber=6973
bamboo_repository_75956235_git_repositoryUrl=https://github.com/phpbb/phpbb.git
bamboo_capability_system_builder_phpunit_PHPUnit=/usr/bin/phpunit
bamboo_shortJobName=Build and Test Job
bamboo_buildResultsUrl=https://bamboo.phpbb.com/browse/PHPBB3-PR-JOB1-6973
bamboo_repository_75956235_branch_name=3.1.x
bamboo_planRepository_repositoryUrl=https://github.com/phpbb/phpbb.git
bamboo_agentId=131073
bamboo_planName=phpBB3 - Pull Requests
bamboo_build_commandline_com_atlassian_bamboo_plugins_scripttask_task_builder_script_7=/bin/sh /home/bamboo/temp/PHPBB3-PR-JOB1-6973-ScriptBuildTask-1510935183880845682.sh
bamboo_shortPlanKey=PR
bamboo_shortJobKey=JOB1
bamboo_capability_dbms_mysql_55=true
bamboo_capability_system_jdk_JDK_1_7_0_65=/usr/lib/jvm/java-7-openjdk-amd64
bamboo_planRepository_revision=f9a596c544fb6677d822cd78d16987d8e751b729
bamboo_repository_previous_revision_number=f9a596c544fb6677d822cd78d16987d8e751b729
bamboo_buildTimeStamp=2017-04-12T22:15:41.853Z
bamboo_planRepository_previousRevision=f9a596c544fb6677d822cd78d16987d8e751b729
bamboo_capability_system_builder_mvn2_Maven_2=/usr/share/maven2
bamboo_capability_system_jdk_JDK_1_6_0_16=/usr/lib/jvm/java-6-sun-1.6.0.16
bamboo_build_commandline_com_atlassian_bamboo_plugins_scripttask_task_builder_script_4=/bin/sh /home/bamboo/temp/PHPBB3-PR-JOB1-6973-ScriptBuildTask-7614642100847184652.sh
bamboo_buildResultKey=PHPBB3-PR-JOB1-6973
bamboo_repository_git_branch=3.1.x
bamboo_repository_branch_name=3.1.x
bamboo_buildPlanName=phpBB3 - Pull Requests - Build and Test Job
bamboo_planRepository_1_revision=f9a596c544fb6677d822cd78d16987d8e751b729
bamboo_repository_name=phpBB Ascraeus
bamboo_capability_system_docker_executable=/usr/bin/docker
bamboo_build_commandline_com_atlassian_bamboo_plugins_bamboo_docker_plugin_task_docker_cli_11=/usr/bin/docker run --volume /home/bamboo/xml-data/build-dir/PHPBB3-PR-JOB1:/data --workdir /data/build --rm -u=991 phpbb:php-5.6 ../phpBB/vendor/bin/phing sniff
bamboo_build_commandline_com_atlassian_bamboo_plugins_bamboo_docker_plugin_task_docker_cli_12=/usr/bin/docker run --volume /home/bamboo/xml-data/build-dir/PHPBB3-PR-JOB1:/data --workdir /data/phpBB --rm -e HOME=/home/bamboo -u=991 phpbb:php-5.6 /bin/bash -c php ../composer.phar install --dev; cd ../build; ../phpBB/vendor/bin/phing clean prepare
bamboo_planRepository_branch=3.1.x
bamboo_agentWorkingDirectory=/home/bamboo/xml-data/build-dir
bamboo_capability_system_git_executable=/usr/bin/git
bamboo_planRepository_1_previousRevision=f9a596c544fb6677d822cd78d16987d8e751b729
bamboo_capability_system_builder_phpunit_PHPUnit_3_4=/usr/bin/phpunit
bamboo_repository_git_username=bantu
bamboo_repository_75956235_revision_number=f9a596c544fb6677d822cd78d16987d8e751b729
bamboo_planRepository_branchDisplayName=3.1.x
bamboo_planRepository_1_type=gitv2
bamboo_planRepository_branchName=3.1.x
bamboo_repository_75956235_previous_revision_number=f9a596c544fb6677d822cd78d16987d8e751b729
bamboo_capability_system_jdk_JDK=/usr/lib/jvm/java-6-sun
bamboo_plan_storageTag=PHPBB3-PR
bamboo_planRepository_type=gitv2
bamboo_planRepository_1_username=bantu
bamboo_ManualBuildTriggerReason_userName=Build Robot
bamboo_repository_git_repositoryUrl=https://github.com/phpbb/phpbb.git
bamboo_repository_75956235_git_branch=3.1.x
bamboo_capability_system_builder_ant_Ant=/usr/share/ant
bamboo_repository_75956235_name=phpBB Ascraeus
bamboo_working_directory=/home/bamboo/xml-data/build-dir/PHPBB3-PR-JOB1
bamboo_planKey=PHPBB3-PR
bamboo_planRepository_1_repositoryUrl=https://github.com/phpbb/phpbb.git
bamboo_planRepository_username=bantu
bamboo_capability_local=true
bamboo_capability_system_jdk_JDK_1_6=/usr/lib/jvm/java-6-sun
bamboo_capability_system_jdk_JDK_1_7=/usr/lib/jvm/java-7-openjdk-amd64
bamboo_planRepository_1_branchName=3.1.x
12-Apr-2017 22:18:36 From https://github.com/phpbb/phpbb
12-Apr-2017 22:18:36 * branch            refs/pull/4789/head -> FETCH_HEAD
12-Apr-2017 22:18:36 grep: build/logs/phpunit.xml: No such file or directory
12-Apr-2017 22:18:36 grep: build/logs/phpunit.xml: No such file or directory
12-Apr-2017 22:18:36   % Total    % Received % Xferd  Average Speed   Time    Time     Time  Current
12-Apr-2017 22:18:36                                  Dload  Upload   Total   Spent    Left  Speed
12-Apr-2017 22:18:36
12-Apr-2017 22:18:37   0     0    0     0    0     0      0      0 --:--:-- --:--:-- --:--:--     0
12-Apr-2017 22:18:37   0     0    0     0    0     0      0      0 --:--:-- --:--:-- --:--:--     0
12-Apr-2017 22:18:37 100   273  100    93  100   180    154    298 --:--:-- --:--:-- --:--:--   298
12-Apr-2017 22:18:37 Finished task 'Set result build status' with result: Success
12-Apr-2017 22:18:37 Running post build plugin 'NCover Results Collector'
12-Apr-2017 22:18:37 Running post build plugin 'Artifact Copier'
12-Apr-2017 22:18:37 Running post build plugin 'npm Cache Cleanup'
12-Apr-2017 22:18:37 Running post build plugin 'Clover Results Collector'
12-Apr-2017 22:18:37 Running post build plugin 'Docker Container Cleanup'
12-Apr-2017 22:18:37 Successfully removed working directory at '/home/bamboo/xml-data/build-dir/PHPBB3-PR-JOB1'
12-Apr-2017 22:18:37 Finalising the build...
12-Apr-2017 22:18:37 Stopping timer.
12-Apr-2017 22:18:37 Build PHPBB3-PR-JOB1-6973 completed.
12-Apr-2017 22:18:37 Running on server: post build plugin 'NCover Results Collector'
12-Apr-2017 22:18:37 Running on server: post build plugin 'Build Hanging Detection Configuration'
12-Apr-2017 22:18:37 Running on server: post build plugin 'Clover Delta Calculator'
12-Apr-2017 22:18:37 Running on server: post build plugin 'Maven Dependencies Postprocessor'
12-Apr-2017 22:18:37 All post build plugins have finished
12-Apr-2017 22:18:37 Generating build results summary...
12-Apr-2017 22:18:37 Saving build results to disk...
12-Apr-2017 22:18:37 Logging substituted variables...
12-Apr-2017 22:18:37 Indexing build results...
12-Apr-2017 22:18:37 Finished building PHPBB3-PR-JOB1-6973.
12-Apr-2017 22:18:37
Substituting variable: ${bamboo.PRnumber} with 4789