Tests pending pull requests

Build: #6975 failed

Job: Build and Test Job failed

Stages & jobs

  1. Build and Test

Build log

The build generated 482 lines of output. Download or view full build log

13-Apr-2017 13:34:55 Build phpBB3 - Pull Requests - Build and Test Job #6975 (PHPBB3-PR-JOB1-6975) started building on agent Default Agent
13-Apr-2017 13:34:55
13-Apr-2017 13:34:55 Build working directory is /home/bamboo/xml-data/build-dir/PHPBB3-PR-JOB1
13-Apr-2017 13:34:55 Executing build phpBB3 - Pull Requests - Build and Test Job #6975 (PHPBB3-PR-JOB1-6975)
13-Apr-2017 13:34:55 Starting task 'Checkout develop branch' of type 'com.atlassian.bamboo.plugins.vcs:task.vcs.checkout'
13-Apr-2017 13:34:55 Build always requires a clean checkout
13-Apr-2017 13:34:55 Cleaning build directory '/home/bamboo/xml-data/build-dir/PHPBB3-PR-JOB1'
13-Apr-2017 13:34:55 Updating source code to revision: f9a596c544fb6677d822cd78d16987d8e751b729
13-Apr-2017 13:34:55 Fetching 'refs/heads/3.1.x' from 'https://github.com/phpbb/phpbb.git'.
13-Apr-2017 13:34:55 Checking out revision f9a596c544fb6677d822cd78d16987d8e751b729.
13-Apr-2017 13:34:55 Creating local git repository in '/home/bamboo/xml-data/build-dir/PHPBB3-PR-JOB1/.git'.
13-Apr-2017 13:34:55 Cloning into '/home/bamboo/xml-data/build-dir/PHPBB3-PR-JOB1'...
13-Apr-2017 13:34:55 done.
13-Apr-2017 13:34:57 Branch 3.1.x set up to track remote branch 3.1.x from origin.
13-Apr-2017 13:34:57 Switched to a new branch '3.1.x'
13-Apr-2017 13:34:57 Updated source code to revision: f9a596c544fb6677d822cd78d16987d8e751b729
13-Apr-2017 13:34:57 Finished task 'Checkout develop branch' with result: Success
13-Apr-2017 13:34:57 Running pre-build action: VCS Version Collector
13-Apr-2017 13:34:57
Substituting variable: ${bamboo.PRnumber} with 4789
13-Apr-2017 13:34:57
Substituting variable: ${bamboo.buildResultsUrl} with https://bamboo.phpbb.com/browse/PHPBB3-PR-JOB1-6975
13-Apr-2017 13:34:57 Starting task 'Set pending build status' of type 'com.atlassian.bamboo.plugins.scripttask:task.builder.script'
13-Apr-2017 13:34:57
Beginning to execute external process for build 'phpBB3 - Pull Requests - Build and Test Job #6975 (PHPBB3-PR-JOB1-6975)'
... running command line:
/bin/sh /home/bamboo/temp/PHPBB3-PR-JOB1-6975-ScriptBuildTask-719199374796854473.sh
... in: /home/bamboo/xml-data/build-dir/PHPBB3-PR-JOB1
... using extra environment variables:
bamboo_planRepository_1_branch=3.1.x
bamboo_planRepository_1_branchDisplayName=3.1.x
bamboo_repository_revision_number=f9a596c544fb6677d822cd78d16987d8e751b729
bamboo_PRref=master
bamboo_resultsUrl=https://bamboo.phpbb.com/browse/PHPBB3-PR-JOB1-6975
bamboo_capability_system_builder_command_Git=/usr/bin/git
bamboo_repository_75956235_git_username=bantu
bamboo_planRepository_1_name=phpBB Ascraeus
bamboo_build_working_directory=/home/bamboo/xml-data/build-dir/PHPBB3-PR-JOB1
bamboo_buildKey=PHPBB3-PR-JOB1
bamboo_capability_phpbb_tests=true
bamboo_shortPlanName=Pull Requests
bamboo_capability_system_builder_command_fop=/usr/bin/fop
bamboo_capability_dbms_sqlite_2=true
bamboo_planRepository_name=phpBB Ascraeus
bamboo_PRnumber=4789
bamboo_buildNumber=6975
bamboo_repository_75956235_git_repositoryUrl=https://github.com/phpbb/phpbb.git
bamboo_capability_system_builder_phpunit_PHPUnit=/usr/bin/phpunit
bamboo_shortJobName=Build and Test Job
bamboo_buildResultsUrl=https://bamboo.phpbb.com/browse/PHPBB3-PR-JOB1-6975
bamboo_repository_75956235_branch_name=3.1.x
bamboo_planRepository_repositoryUrl=https://github.com/phpbb/phpbb.git
bamboo_agentId=131073
bamboo_planName=phpBB3 - Pull Requests
bamboo_shortPlanKey=PR
bamboo_shortJobKey=JOB1
bamboo_capability_dbms_mysql_55=true
bamboo_capability_system_jdk_JDK_1_7_0_65=/usr/lib/jvm/java-7-openjdk-amd64
bamboo_planRepository_revision=f9a596c544fb6677d822cd78d16987d8e751b729
bamboo_repository_previous_revision_number=f9a596c544fb6677d822cd78d16987d8e751b729
bamboo_buildTimeStamp=2017-04-13T13:34:55.250Z
bamboo_planRepository_previousRevision=f9a596c544fb6677d822cd78d16987d8e751b729
bamboo_capability_system_builder_mvn2_Maven_2=/usr/share/maven2
bamboo_capability_system_jdk_JDK_1_6_0_16=/usr/lib/jvm/java-6-sun-1.6.0.16
bamboo_buildResultKey=PHPBB3-PR-JOB1-6975
bamboo_repository_git_branch=3.1.x
bamboo_repository_branch_name=3.1.x
bamboo_buildPlanName=phpBB3 - Pull Requests - Build and Test Job
bamboo_planRepository_1_revision=f9a596c544fb6677d822cd78d16987d8e751b729
bamboo_repository_name=phpBB Ascraeus
bamboo_capability_system_docker_executable=/usr/bin/docker
bamboo_planRepository_branch=3.1.x
bamboo_agentWorkingDirectory=/home/bamboo/xml-data/build-dir
bamboo_capability_system_git_executable=/usr/bin/git
bamboo_planRepository_1_previousRevision=f9a596c544fb6677d822cd78d16987d8e751b729
bamboo_capability_system_builder_phpunit_PHPUnit_3_4=/usr/bin/phpunit
bamboo_repository_git_username=bantu
bamboo_repository_75956235_revision_number=f9a596c544fb6677d822cd78d16987d8e751b729
bamboo_planRepository_branchDisplayName=3.1.x
bamboo_planRepository_1_type=gitv2
bamboo_planRepository_branchName=3.1.x
bamboo_repository_75956235_previous_revision_number=f9a596c544fb6677d822cd78d16987d8e751b729
bamboo_capability_system_jdk_JDK=/usr/lib/jvm/java-6-sun
bamboo_plan_storageTag=PHPBB3-PR
bamboo_planRepository_type=gitv2
bamboo_planRepository_1_username=bantu
bamboo_ManualBuildTriggerReason_userName=Build Robot
bamboo_repository_git_repositoryUrl=https://github.com/phpbb/phpbb.git
bamboo_repository_75956235_git_branch=3.1.x
bamboo_capability_system_builder_ant_Ant=/usr/share/ant
bamboo_repository_75956235_name=phpBB Ascraeus
bamboo_working_directory=/home/bamboo/xml-data/build-dir/PHPBB3-PR-JOB1
bamboo_planKey=PHPBB3-PR
bamboo_planRepository_1_repositoryUrl=https://github.com/phpbb/phpbb.git
bamboo_planRepository_username=bantu
bamboo_capability_local=true
bamboo_capability_system_jdk_JDK_1_6=/usr/lib/jvm/java-6-sun
bamboo_capability_system_jdk_JDK_1_7=/usr/lib/jvm/java-7-openjdk-amd64
bamboo_planRepository_1_branchName=3.1.x
13-Apr-2017 13:34:58 From https://github.com/phpbb/phpbb
13-Apr-2017 13:34:58 * branch            refs/pull/4789/head -> FETCH_HEAD
13-Apr-2017 13:34:58   % Total    % Received % Xferd  Average Speed   Time    Time     Time  Current
13-Apr-2017 13:34:58                                  Dload  Upload   Total   Spent    Left  Speed
13-Apr-2017 13:34:58
13-Apr-2017 13:34:59   0     0    0     0    0     0      0      0 --:--:-- --:--:-- --:--:--     0
13-Apr-2017 13:34:59 100   275  100    93  100   182    124    244 --:--:-- --:--:-- --:--:--   244
13-Apr-2017 13:34:59 Finished task 'Set pending build status' with result: Success
13-Apr-2017 13:34:59
Substituting variable: ${bamboo.PRnumber} with 4789
13-Apr-2017 13:34:59 Starting task 'Fetch PR' of type 'com.atlassian.bamboo.plugins.scripttask:task.builder.script'
13-Apr-2017 13:34:59
Beginning to execute external process for build 'phpBB3 - Pull Requests - Build and Test Job #6975 (PHPBB3-PR-JOB1-6975)'
... running command line:
/bin/sh /home/bamboo/temp/PHPBB3-PR-JOB1-6975-ScriptBuildTask-4662042880874320813.sh
... in: /home/bamboo/xml-data/build-dir/PHPBB3-PR-JOB1
... using extra environment variables:
bamboo_planRepository_1_branch=3.1.x
bamboo_planRepository_1_branchDisplayName=3.1.x
bamboo_repository_revision_number=f9a596c544fb6677d822cd78d16987d8e751b729
bamboo_PRref=master
bamboo_resultsUrl=https://bamboo.phpbb.com/browse/PHPBB3-PR-JOB1-6975
bamboo_capability_system_builder_command_Git=/usr/bin/git
bamboo_repository_75956235_git_username=bantu
bamboo_planRepository_1_name=phpBB Ascraeus
bamboo_build_working_directory=/home/bamboo/xml-data/build-dir/PHPBB3-PR-JOB1
bamboo_buildKey=PHPBB3-PR-JOB1
bamboo_capability_phpbb_tests=true
bamboo_shortPlanName=Pull Requests
bamboo_capability_system_builder_command_fop=/usr/bin/fop
bamboo_capability_dbms_sqlite_2=true
bamboo_planRepository_name=phpBB Ascraeus
bamboo_PRnumber=4789
bamboo_buildNumber=6975
bamboo_repository_75956235_git_repositoryUrl=https://github.com/phpbb/phpbb.git
bamboo_capability_system_builder_phpunit_PHPUnit=/usr/bin/phpunit
bamboo_shortJobName=Build and Test Job
bamboo_buildResultsUrl=https://bamboo.phpbb.com/browse/PHPBB3-PR-JOB1-6975
bamboo_repository_75956235_branch_name=3.1.x
bamboo_planRepository_repositoryUrl=https://github.com/phpbb/phpbb.git
bamboo_agentId=131073
bamboo_planName=phpBB3 - Pull Requests
bamboo_build_commandline_com_atlassian_bamboo_plugins_scripttask_task_builder_script_7=/bin/sh /home/bamboo/temp/PHPBB3-PR-JOB1-6975-ScriptBuildTask-719199374796854473.sh
bamboo_shortPlanKey=PR
bamboo_shortJobKey=JOB1
bamboo_capability_dbms_mysql_55=true
bamboo_capability_system_jdk_JDK_1_7_0_65=/usr/lib/jvm/java-7-openjdk-amd64
bamboo_planRepository_revision=f9a596c544fb6677d822cd78d16987d8e751b729
bamboo_repository_previous_revision_number=f9a596c544fb6677d822cd78d16987d8e751b729
bamboo_buildTimeStamp=2017-04-13T13:34:55.250Z
bamboo_planRepository_previousRevision=f9a596c544fb6677d822cd78d16987d8e751b729
bamboo_capability_system_builder_mvn2_Maven_2=/usr/share/maven2
bamboo_capability_system_jdk_JDK_1_6_0_16=/usr/lib/jvm/java-6-sun-1.6.0.16
bamboo_buildResultKey=PHPBB3-PR-JOB1-6975
bamboo_repository_git_branch=3.1.x
bamboo_repository_branch_name=3.1.x
bamboo_buildPlanName=phpBB3 - Pull Requests - Build and Test Job
bamboo_planRepository_1_revision=f9a596c544fb6677d822cd78d16987d8e751b729
bamboo_repository_name=phpBB Ascraeus
bamboo_capability_system_docker_executable=/usr/bin/docker
bamboo_planRepository_branch=3.1.x
bamboo_agentWorkingDirectory=/home/bamboo/xml-data/build-dir
bamboo_capability_system_git_executable=/usr/bin/git
bamboo_planRepository_1_previousRevision=f9a596c544fb6677d822cd78d16987d8e751b729
bamboo_capability_system_builder_phpunit_PHPUnit_3_4=/usr/bin/phpunit
bamboo_repository_git_username=bantu
bamboo_repository_75956235_revision_number=f9a596c544fb6677d822cd78d16987d8e751b729
bamboo_planRepository_branchDisplayName=3.1.x
bamboo_planRepository_1_type=gitv2
bamboo_planRepository_branchName=3.1.x
bamboo_repository_75956235_previous_revision_number=f9a596c544fb6677d822cd78d16987d8e751b729
bamboo_capability_system_jdk_JDK=/usr/lib/jvm/java-6-sun
bamboo_plan_storageTag=PHPBB3-PR
bamboo_planRepository_type=gitv2
bamboo_planRepository_1_username=bantu
bamboo_ManualBuildTriggerReason_userName=Build Robot
bamboo_repository_git_repositoryUrl=https://github.com/phpbb/phpbb.git
bamboo_repository_75956235_git_branch=3.1.x
bamboo_capability_system_builder_ant_Ant=/usr/share/ant
bamboo_repository_75956235_name=phpBB Ascraeus
bamboo_working_directory=/home/bamboo/xml-data/build-dir/PHPBB3-PR-JOB1
bamboo_planKey=PHPBB3-PR
bamboo_planRepository_1_repositoryUrl=https://github.com/phpbb/phpbb.git
bamboo_planRepository_username=bantu
bamboo_capability_local=true
bamboo_capability_system_jdk_JDK_1_6=/usr/lib/jvm/java-6-sun
bamboo_capability_system_jdk_JDK_1_7=/usr/lib/jvm/java-7-openjdk-amd64
bamboo_planRepository_1_branchName=3.1.x
13-Apr-2017 13:35:00 From https://github.com/phpbb/phpbb
13-Apr-2017 13:35:00 * branch            refs/pull/4789/merge -> FETCH_HEAD
13-Apr-2017 13:35:00 Note: checking out 'FETCH_HEAD'.
13-Apr-2017 13:35:00
13-Apr-2017 13:35:00 You are in 'detached HEAD' state. You can look around, make experimental
13-Apr-2017 13:35:00 changes and commit them, and you can discard any commits you make in this
13-Apr-2017 13:35:00 state without impacting any branches by performing another checkout.
13-Apr-2017 13:35:00
13-Apr-2017 13:35:00 If you want to create a new branch to retain commits you create, you may
13-Apr-2017 13:35:00 do so (now or later) by using -b with the checkout command again. Example:
13-Apr-2017 13:35:00
13-Apr-2017 13:35:00   git checkout -b new_branch_name
13-Apr-2017 13:35:00
13-Apr-2017 13:35:00 HEAD is now at 77cd7ea... Merge cb5a161f82a45702f4515a6527de8c27972dca79 into fba85954212019dd5f2e4ccbf884de87fbe3c19b
13-Apr-2017 13:35:00 Finished task 'Fetch PR' with result: Success
13-Apr-2017 13:35:00 Skipping execution of task 'Prepare directory' as it is disabled
13-Apr-2017 13:35:00
Substituting variable: ${bamboo.working.directory} with /home/bamboo/xml-data/build-dir/PHPBB3-PR-JOB1
13-Apr-2017 13:35:00 Starting task 'Prepare directory' of type 'com.atlassian.bamboo.plugins.bamboo-docker-plugin:task.docker.cli'
13-Apr-2017 13:35:00 Running image name (phpbb:php-5.6)
13-Apr-2017 13:35:00
Beginning to execute external process for build 'phpBB3 - Pull Requests - Build and Test Job #6975 (PHPBB3-PR-JOB1-6975)'
... running command line:
/usr/bin/docker run --volume /home/bamboo/xml-data/build-dir/PHPBB3-PR-JOB1:/data --workdir /data/phpBB --rm -e HOME=/home/bamboo -u=991 phpbb:php-5.6 /bin/bash -c php ../composer.phar install --dev; cd ../build; ../phpBB/vendor/bin/phing clean prepare
... in: /home/bamboo/xml-data/build-dir/PHPBB3-PR-JOB1
... using extra environment variables:
bamboo_planRepository_1_branch=3.1.x
bamboo_planRepository_1_branchDisplayName=3.1.x
bamboo_repository_revision_number=f9a596c544fb6677d822cd78d16987d8e751b729
bamboo_PRref=master
bamboo_resultsUrl=https://bamboo.phpbb.com/browse/PHPBB3-PR-JOB1-6975
bamboo_capability_system_builder_command_Git=/usr/bin/git
bamboo_repository_75956235_git_username=bantu
bamboo_planRepository_1_name=phpBB Ascraeus
bamboo_build_working_directory=/home/bamboo/xml-data/build-dir/PHPBB3-PR-JOB1
bamboo_buildKey=PHPBB3-PR-JOB1
bamboo_capability_phpbb_tests=true
bamboo_shortPlanName=Pull Requests
bamboo_capability_system_builder_command_fop=/usr/bin/fop
bamboo_capability_dbms_sqlite_2=true
bamboo_planRepository_name=phpBB Ascraeus
bamboo_PRnumber=4789
bamboo_buildNumber=6975
bamboo_repository_75956235_git_repositoryUrl=https://github.com/phpbb/phpbb.git
bamboo_capability_system_builder_phpunit_PHPUnit=/usr/bin/phpunit
bamboo_shortJobName=Build and Test Job
bamboo_buildResultsUrl=https://bamboo.phpbb.com/browse/PHPBB3-PR-JOB1-6975
bamboo_repository_75956235_branch_name=3.1.x
bamboo_planRepository_repositoryUrl=https://github.com/phpbb/phpbb.git
bamboo_agentId=131073
bamboo_planName=phpBB3 - Pull Requests
bamboo_build_commandline_com_atlassian_bamboo_plugins_scripttask_task_builder_script_7=/bin/sh /home/bamboo/temp/PHPBB3-PR-JOB1-6975-ScriptBuildTask-719199374796854473.sh
bamboo_shortPlanKey=PR
bamboo_shortJobKey=JOB1
bamboo_capability_dbms_mysql_55=true
bamboo_capability_system_jdk_JDK_1_7_0_65=/usr/lib/jvm/java-7-openjdk-amd64
bamboo_planRepository_revision=f9a596c544fb6677d822cd78d16987d8e751b729
bamboo_repository_previous_revision_number=f9a596c544fb6677d822cd78d16987d8e751b729
bamboo_buildTimeStamp=2017-04-13T13:34:55.250Z
bamboo_planRepository_previousRevision=f9a596c544fb6677d822cd78d16987d8e751b729
bamboo_capability_system_builder_mvn2_Maven_2=/usr/share/maven2
bamboo_capability_system_jdk_JDK_1_6_0_16=/usr/lib/jvm/java-6-sun-1.6.0.16
bamboo_build_commandline_com_atlassian_bamboo_plugins_scripttask_task_builder_script_4=/bin/sh /home/bamboo/temp/PHPBB3-PR-JOB1-6975-ScriptBuildTask-4662042880874320813.sh
bamboo_buildResultKey=PHPBB3-PR-JOB1-6975
bamboo_repository_git_branch=3.1.x
bamboo_repository_branch_name=3.1.x
bamboo_buildPlanName=phpBB3 - Pull Requests - Build and Test Job
bamboo_planRepository_1_revision=f9a596c544fb6677d822cd78d16987d8e751b729
bamboo_repository_name=phpBB Ascraeus
bamboo_capability_system_docker_executable=/usr/bin/docker
bamboo_planRepository_branch=3.1.x
bamboo_agentWorkingDirectory=/home/bamboo/xml-data/build-dir
bamboo_capability_system_git_executable=/usr/bin/git
bamboo_planRepository_1_previousRevision=f9a596c544fb6677d822cd78d16987d8e751b729
bamboo_capability_system_builder_phpunit_PHPUnit_3_4=/usr/bin/phpunit
bamboo_repository_git_username=bantu
bamboo_repository_75956235_revision_number=f9a596c544fb6677d822cd78d16987d8e751b729
bamboo_planRepository_branchDisplayName=3.1.x
bamboo_planRepository_1_type=gitv2
bamboo_planRepository_branchName=3.1.x
bamboo_repository_75956235_previous_revision_number=f9a596c544fb6677d822cd78d16987d8e751b729
bamboo_capability_system_jdk_JDK=/usr/lib/jvm/java-6-sun
bamboo_plan_storageTag=PHPBB3-PR
bamboo_planRepository_type=gitv2
bamboo_planRepository_1_username=bantu
bamboo_ManualBuildTriggerReason_userName=Build Robot
bamboo_repository_git_repositoryUrl=https://github.com/phpbb/phpbb.git
bamboo_repository_75956235_git_branch=3.1.x
bamboo_capability_system_builder_ant_Ant=/usr/share/ant
bamboo_repository_75956235_name=phpBB Ascraeus
bamboo_working_directory=/home/bamboo/xml-data/build-dir/PHPBB3-PR-JOB1
bamboo_planKey=PHPBB3-PR
bamboo_planRepository_1_repositoryUrl=https://github.com/phpbb/phpbb.git
bamboo_planRepository_username=bantu
bamboo_capability_local=true
bamboo_capability_system_jdk_JDK_1_6=/usr/lib/jvm/java-6-sun
bamboo_capability_system_jdk_JDK_1_7=/usr/lib/jvm/java-7-openjdk-amd64
bamboo_planRepository_1_branchName=3.1.x
13-Apr-2017 13:35:00 You are running composer with xdebug enabled. This has a major impact on runtime performance. See https://getcomposer.org/xdebug
13-Apr-2017 13:35:00 You are using the deprecated option "dev". Dev packages are installed by default now.
13-Apr-2017 13:35:00 Cannot create cache directory /home/bamboo/.composer/cache/repo/https---packagist.org/, or directory is not writable. Proceeding without cache
13-Apr-2017 13:35:00 Cannot create cache directory /home/bamboo/.composer/cache/files/, or directory is not writable. Proceeding without cache
13-Apr-2017 13:35:00 Loading composer repositories with package information
13-Apr-2017 13:35:00 Installing dependencies (including require-dev) from lock file
13-Apr-2017 13:35:00   - Installing bantu/ini-get-wrapper (v1.0.1)
13-Apr-2017 13:35:02     Downloading: Connecting...    Downloading: 100%         
13-Apr-2017 13:35:02
13-Apr-2017 13:35:02   - Installing google/recaptcha (1.1.2)
13-Apr-2017 13:35:03     Downloading: Connecting...    Downloading: 0%               Downloading: 30%    Downloading: 55%    Downloading: 60%    Downloading: 85%    Downloading: 100%    Downloading: 100%
13-Apr-2017 13:35:03
13-Apr-2017 13:35:03   - Installing guzzlehttp/promises (1.3.0)
13-Apr-2017 13:35:05     Downloading: Connecting...    Downloading: 0%               Downloading: 15%    Downloading: 25%    Downloading: 40%    Downloading: 60%    Downloading: 70%    Downloading: 85%    Downloading: 100%    Downloading: 100%
13-Apr-2017 13:35:05
13-Apr-2017 13:35:05   - Installing psr/http-message (1.0.1)
13-Apr-2017 13:35:06     Downloading: Connecting...    Downloading: 0%               Downloading: 95%    Downloading: 100%    Downloading: 100%
13-Apr-2017 13:35:06
13-Apr-2017 13:35:06   - Installing guzzlehttp/psr7 (1.3.1)
13-Apr-2017 13:35:07     Downloading: Connecting...    Downloading: 0%               Downloading: 5%    Downloading: 15%    Downloading: 20%    Downloading: 35%    Downloading: 40%    Downloading: 55%    Downloading: 60%    Downloading: 70%    Downloading: 75%    Downloading: 90%    Downloading: 95%    Downloading: 100%    Downloading: 100%
13-Apr-2017 13:35:07
13-Apr-2017 13:35:07   - Installing lusitanian/oauth (v0.8.9)
13-Apr-2017 13:35:08     Downloading: Connecting...    Downloading: 0%               Downloading: 5%    Downloading: 10%    Downloading: 15%    Downloading: 20%    Downloading: 25%    Downloading: 30%    Downloading: 35%    Downloading: 40%    Downloading: 45%    Downloading: 50%    Downloading: 55%    Downloading: 60%    Downloading: 65%    Downloading: 70%    Downloading: 75%    Downloading: 80%    Downloading: 85%    Downloading: 90%    Downloading: 95%    Downloading: 100%    Downloading: 100%
13-Apr-2017 13:35:08
13-Apr-2017 13:35:08   - Installing marc1706/fast-image-size (v1.1.2)
13-Apr-2017 13:35:09     Downloading: Connecting...    Downloading: 100%         
13-Apr-2017 13:35:09
13-Apr-2017 13:35:09   - Installing paragonie/random_compat (v1.4.1)
13-Apr-2017 13:35:10     Downloading: Connecting...    Downloading: 0%               Downloading: 20%    Downloading: 30%    Downloading: 50%    Downloading: 60%    Downloading: 80%    Downloading: 95%    Downloading: 100%    Downloading: 100%
13-Apr-2017 13:35:10
13-Apr-2017 13:35:10   - Installing patchwork/utf8 (v1.3.1)
13-Apr-2017 13:35:12     Downloading: Connecting...    Downloading: 0%               Downloading: 5%    Downloading: 10%    Downloading: 15%    Downloading: 20%    Downloading: 25%    Downloading: 30%    Downloading: 35%    Downloading: 40%    Downloading: 45%    Downloading: 50%    Downloading: 55%    Downloading: 60%    Downloading: 65%    Downloading: 70%    Downloading: 75%    Downloading: 80%    Downloading: 85%    Downloading: 90%    Downloading: 95%    Downloading: 100%    Downloading: 100%
13-Apr-2017 13:35:12
13-Apr-2017 13:35:12   - Installing s9e/text-formatter (0.9.1)
13-Apr-2017 13:35:13     Downloading: Connecting...    Downloading: 100%         
13-Apr-2017 13:35:13
13-Apr-2017 13:35:13   - Installing symfony/filesystem (v3.2.0)
13-Apr-2017 13:35:14     Downloading: Connecting...    Downloading: 0%               Downloading: 35%    Downloading: 40%    Downloading: 75%    Downloading: 95%    Downloading: 100%    Downloading: 100%
13-Apr-2017 13:35:14
13-Apr-2017 13:35:14   - Installing symfony/config (v3.2.0)
13-Apr-2017 13:35:15     Downloading: Connecting...    Downloading: 0%               Downloading: 5%    Downloading: 10%    Downloading: 15%    Downloading: 20%    Downloading: 25%    Downloading: 35%    Downloading: 40%    Downloading: 45%    Downloading: 55%    Downloading: 60%    Downloading: 65%    Downloading: 75%    Downloading: 80%    Downloading: 85%    Downloading: 95%    Downloading: 100%    Downloading: 100%
13-Apr-2017 13:35:15
13-Apr-2017 13:35:15   - Installing symfony/finder (v3.2.0)
13-Apr-2017 13:35:16     Downloading: Connecting...    Downloading: 0%               Downloading: 5%    Downloading: 10%    Downloading: 15%    Downloading: 20%    Downloading: 25%    Downloading: 35%    Downloading: 40%    Downloading: 45%    Downloading: 50%    Downloading: 55%    Downloading: 60%    Downloading: 65%    Downloading: 70%    Downloading: 75%    Downloading: 80%    Downloading: 100%    Downloading: 100%
13-Apr-2017 13:35:16
13-Apr-2017 13:35:16   - Installing symfony/polyfill-mbstring (v1.3.0)
13-Apr-2017 13:35:17     Downloading: Connecting...    Downloading: 0%               Downloading: 35%    Downloading: 70%    Downloading: 100%    Downloading: 100%
13-Apr-2017 13:35:17
13-Apr-2017 13:35:17   - Installing symfony/http-foundation (v3.2.0)
13-Apr-2017 13:35:19     Downloading: Connecting...    Downloading: 0%               Downloading: 5%    Downloading: 10%    Downloading: 15%    Downloading: 20%    Downloading: 25%    Downloading: 30%    Downloading: 35%    Downloading: 40%    Downloading: 45%    Downloading: 50%    Downloading: 55%    Downloading: 60%    Downloading: 65%    Downloading: 70%    Downloading: 75%    Downloading: 80%    Downloading: 85%    Downloading: 90%    Downloading: 95%    Downloading: 100%    Downloading: 100%
13-Apr-2017 13:35:19
13-Apr-2017 13:35:19   - Installing symfony/event-dispatcher (v3.2.0)
13-Apr-2017 13:35:20     Downloading: Connecting...    Downloading: 0%               Downloading: 5%    Downloading: 10%    Downloading: 15%    Downloading: 65%    Downloading: 70%    Downloading: 75%    Downloading: 80%    Downloading: 85%    Downloading: 90%    Downloading: 100%    Downloading: 100%
13-Apr-2017 13:35:20
13-Apr-2017 13:35:20   - Installing psr/log (1.0.2)
13-Apr-2017 13:35:21     Downloading: Connecting...    Downloading: 0%               Downloading: 15%    Downloading: 100%
13-Apr-2017 13:35:21
13-Apr-2017 13:35:21   - Installing symfony/debug (v3.2.0)
13-Apr-2017 13:35:22     Downloading: Connecting...    Downloading: 0%               Downloading: 5%    Downloading: 25%    Downloading: 30%    Downloading: 35%    Downloading: 40%    Downloading: 45%    Downloading: 70%    Downloading: 75%    Downloading: 100%    Downloading: 100%
13-Apr-2017 13:35:22
13-Apr-2017 13:35:22   - Installing symfony/http-kernel (v3.2.0)
13-Apr-2017 13:35:23     Downloading: Connecting...    Downloading: 0%               Downloading: 5%    Downloading: 10%    Downloading: 15%    Downloading: 20%    Downloading: 25%    Downloading: 30%    Downloading: 35%    Downloading: 40%    Downloading: 45%    Downloading: 50%    Downloading: 55%    Downloading: 60%    Downloading: 65%    Downloading: 70%    Downloading: 75%    Downloading: 80%    Downloading: 85%    Downloading: 90%    Downloading: 95%    Downloading: 100%    Downloading: 100%
13-Apr-2017 13:35:23
13-Apr-2017 13:35:23   - Installing symfony/dependency-injection (v3.2.0)
13-Apr-2017 13:35:24     Downloading: Connecting...    Downloading: 0%               Downloading: 5%    Downloading: 10%    Downloading: 15%    Downloading: 20%    Downloading: 25%    Downloading: 30%    Downloading: 35%    Downloading: 40%    Downloading: 45%    Downloading: 50%    Downloading: 55%    Downloading: 60%    Downloading: 65%    Downloading: 70%    Downloading: 75%    Downloading: 80%    Downloading: 85%    Downloading: 90%    Downloading: 95%    Downloading: 100%    Downloading: 100%
13-Apr-2017 13:35:24
13-Apr-2017 13:35:24   - Installing zendframework/zend-eventmanager (3.0.1)
13-Apr-2017 13:35:25     Downloading: Connecting...    Downloading: 0%               Downloading: 15%    Downloading: 30%    Downloading: 75%    Downloading: 90%    Downloading: 100%    Downloading: 100%
13-Apr-2017 13:35:25
13-Apr-2017 13:35:25   - Installing zendframework/zend-code (2.6.3)
13-Apr-2017 13:35:26     Downloading: Connecting...    Downloading: 0%               Downloading: 5%    Downloading: 10%    Downloading: 15%    Downloading: 20%    Downloading: 25%    Downloading: 30%    Downloading: 35%    Downloading: 40%    Downloading: 45%    Downloading: 50%    Downloading: 55%    Downloading: 60%    Downloading: 65%    Downloading: 70%    Downloading: 75%    Downloading: 85%    Downloading: 90%    Downloading: 95%    Downloading: 100%    Downloading: 100%
13-Apr-2017 13:35:26
13-Apr-2017 13:35:26   - Installing ocramius/proxy-manager (1.0.2)
13-Apr-2017 13:35:28     Downloading: Connecting...    Downloading: 0%               Downloading: 5%    Downloading: 10%    Downloading: 15%    Downloading: 20%    Downloading: 25%    Downloading: 30%    Downloading: 35%    Downloading: 40%    Downloading: 45%    Downloading: 50%    Downloading: 55%    Downloading: 60%    Downloading: 65%    Downloading: 70%    Downloading: 75%    Downloading: 80%    Downloading: 85%    Downloading: 90%    Downloading: 95%    Downloading: 100%    Downloading: 100%
13-Apr-2017 13:35:28
13-Apr-2017 13:35:28   - Installing symfony/proxy-manager-bridge (v3.2.0)
13-Apr-2017 13:35:29     Downloading: Connecting...    Downloading: 100%         
13-Apr-2017 13:35:29
13-Apr-2017 13:35:29   - Installing symfony/routing (v3.2.0)
13-Apr-2017 13:35:30     Downloading: Connecting...    Downloading: 0%               Downloading: 5%    Downloading: 10%    Downloading: 15%    Downloading: 20%    Downloading: 25%    Downloading: 30%    Downloading: 35%    Downloading: 40%    Downloading: 45%    Downloading: 50%    Downloading: 55%    Downloading: 60%    Downloading: 65%    Downloading: 70%    Downloading: 75%    Downloading: 80%    Downloading: 85%    Downloading: 90%    Downloading: 95%    Downloading: 100%
13-Apr-2017 13:35:30
13-Apr-2017 13:35:30   - Installing twig/twig (v1.24.2)
13-Apr-2017 13:35:31     Downloading: Connecting...    Downloading: 0%               Downloading: 5%    Downloading: 10%    Downloading: 15%    Downloading: 20%    Downloading: 25%    Downloading: 30%    Downloading: 35%    Downloading: 40%    Downloading: 45%    Downloading: 50%    Downloading: 55%    Downloading: 60%    Downloading: 65%    Downloading: 70%    Downloading: 75%    Downloading: 80%    Downloading: 85%    Downloading: 90%    Downloading: 95%    Downloading: 100%    Downloading: 100%
13-Apr-2017 13:35:32
13-Apr-2017 13:35:32   - Installing symfony/twig-bridge (v3.1.4)
13-Apr-2017 13:35:33     Downloading: Connecting...    Downloading: 0%               Downloading: 10%    Downloading: 15%    Downloading: 25%    Downloading: 30%    Downloading: 40%    Downloading: 50%    Downloading: 60%    Downloading: 70%    Downloading: 75%    Downloading: 80%    Downloading: 85%    Downloading: 95%    Downloading: 100%    Downloading: 100%
13-Apr-2017 13:35:33
13-Apr-2017 13:35:33   - Installing symfony/dom-crawler (v3.2.0)
13-Apr-2017 13:35:34     Downloading: Connecting...    Downloading: 0%               Downloading: 25%    Downloading: 30%    Downloading: 55%    Downloading: 80%    Downloading: 85%    Downloading: 100%
13-Apr-2017 13:35:34
13-Apr-2017 13:35:34   - Installing symfony/css-selector (v3.2.0)
13-Apr-2017 13:35:35     Downloading: Connecting...    Downloading: 0%               Downloading: 5%    Downloading: 10%    Downloading: 45%    Downloading: 50%    Downloading: 55%    Downloading: 60%    Downloading: 65%    Downloading: 70%    Downloading: 75%    Downloading: 80%    Downloading: 85%    Downloading: 90%    Downloading: 100%    Downloading: 100%
13-Apr-2017 13:35:35
13-Apr-2017 13:35:35   - Installing symfony/browser-kit (v3.2.0)
13-Apr-2017 13:35:37     Downloading: Connecting...    Downloading: 0%               Downloading: 65%    Downloading: 100%    Downloading: 100%
13-Apr-2017 13:35:37
13-Apr-2017 13:35:37   - Installing guzzlehttp/guzzle (6.2.2)
13-Apr-2017 13:35:38     Downloading: Connecting...    Downloading: 0%               Downloading: 5%    Downloading: 10%    Downloading: 15%    Downloading: 25%    Downloading: 30%    Downloading: 40%    Downloading: 45%    Downloading: 55%    Downloading: 60%    Downloading: 70%    Downloading: 75%    Downloading: 80%    Downloading: 85%    Downloading: 100%    Downloading: 100%
13-Apr-2017 13:35:38
13-Apr-2017 13:35:38   - Installing fabpot/goutte (v3.2.0)
13-Apr-2017 13:35:39     Downloading: Connecting...    Downloading: 0%               Downloading: 70%    Downloading: 100%    Downloading: 100%
13-Apr-2017 13:35:39
13-Apr-2017 13:35:39   - Installing facebook/webdriver (1.2.0)
13-Apr-2017 13:35:40     Downloading: Connecting...    Downloading: 0%               Downloading: 5%    Downloading: 10%    Downloading: 15%    Downloading: 20%    Downloading: 25%    Downloading: 30%    Downloading: 35%    Downloading: 40%    Downloading: 45%    Downloading: 50%    Downloading: 55%    Downloading: 60%    Downloading: 65%    Downloading: 70%    Downloading: 75%    Downloading: 80%    Downloading: 85%    Downloading: 90%    Downloading: 95%    Downloading: 100%
13-Apr-2017 13:35:40
13-Apr-2017 13:35:40   - Installing symfony/process (v3.2.0)
13-Apr-2017 13:35:41     Downloading: Connecting...    Downloading: 0%               Downloading: 20%    Downloading: 35%    Downloading: 50%    Downloading: 65%    Downloading: 70%    Downloading: 85%    Downloading: 100%    Downloading: 100%
13-Apr-2017 13:35:41
13-Apr-2017 13:35:41   - Installing symfony/console (v3.2.0)
13-Apr-2017 13:35:42     Downloading: Connecting...    Downloading: 0%               Downloading: 5%    Downloading: 10%    Downloading: 15%    Downloading: 20%    Downloading: 25%    Downloading: 30%    Downloading: 35%    Downloading: 40%    Downloading: 45%    Downloading: 50%    Downloading: 55%    Downloading: 60%    Downloading: 65%    Downloading: 70%    Downloading: 75%    Downloading: 80%    Downloading: 85%    Downloading: 90%    Downloading: 95%    Downloading: 100%    Downloading: 100%
13-Apr-2017 13:35:42
13-Apr-2017 13:35:42   - Installing laravel/homestead (v4.0.5)
13-Apr-2017 13:35:43     Downloading: Connecting...    Downloading: 0%               Downloading: 5%    Downloading: 10%    Downloading: 70%    Downloading: 75%    Downloading: 80%    Downloading: 85%    Downloading: 100%    Downloading: 100%
13-Apr-2017 13:35:43
13-Apr-2017 13:35:43   - Installing phing/phing (2.4.14)
13-Apr-2017 13:35:45     Downloading: Connecting...    Downloading: 100%         
13-Apr-2017 13:35:45
13-Apr-2017 13:35:45   - Installing phpdocumentor/reflection-docblock (2.0.4)
13-Apr-2017 13:35:46     Downloading: Connecting...    Downloading: 0%               Downloading: 15%    Downloading: 20%    Downloading: 30%    Downloading: 35%    Downloading: 50%    Downloading: 55%    Downloading: 70%    Downloading: 85%    Downloading: 90%    Downloading: 100%
13-Apr-2017 13:35:46
13-Apr-2017 13:35:46   - Installing phpdocumentor/reflection-common (1.0)
13-Apr-2017 13:35:47     Downloading: Connecting...    Downloading: 0%               Downloading: 65%    Downloading: 100%    Downloading: 100%
13-Apr-2017 13:35:47
13-Apr-2017 13:35:47   - Installing phpdocumentor/type-resolver (0.2.1)
13-Apr-2017 13:35:48     Downloading: Connecting...    Downloading: 0%               Downloading: 20%    Downloading: 35%    Downloading: 55%    Downloading: 75%    Downloading: 95%    Downloading: 100%    Downloading: 100%
13-Apr-2017 13:35:48
13-Apr-2017 13:35:48   - Installing symfony/yaml (v3.2.0)
13-Apr-2017 13:35:49     Downloading: Connecting...    Downloading: 0%               Downloading: 10%    Downloading: 15%    Downloading: 25%    Downloading: 40%    Downloading: 50%    Downloading: 65%    Downloading: 75%    Downloading: 85%    Downloading: 90%    Downloading: 100%
13-Apr-2017 13:35:49
13-Apr-2017 13:35:49   - Installing sebastian/version (1.0.6)
13-Apr-2017 13:35:50     Downloading: Connecting...    Downloading: 0%               Downloading: 100%    Downloading: 100%
13-Apr-2017 13:35:50
13-Apr-2017 13:35:50   - Installing sebastian/global-state (1.1.1)
13-Apr-2017 13:35:51     Downloading: Connecting...    Downloading: 0%               Downloading: 40%    Downloading: 50%    Downloading: 90%    Downloading: 100%
13-Apr-2017 13:35:51
13-Apr-2017 13:35:51   - Installing sebastian/recursion-context (1.0.2)
13-Apr-2017 13:35:52     Downloading: Connecting...    Downloading: 0%               Downloading: 35%    Downloading: 70%    Downloading: 100%    Downloading: 100%
13-Apr-2017 13:35:52
13-Apr-2017 13:35:52   - Installing sebastian/exporter (1.2.2)
13-Apr-2017 13:35:53     Downloading: Connecting...    Downloading: 0%               Downloading: 100%    Downloading: 100%
13-Apr-2017 13:35:53
13-Apr-2017 13:35:53   - Installing sebastian/environment (1.3.8)
13-Apr-2017 13:35:54     Downloading: Connecting...    Downloading: 0%               Downloading: 15%    Downloading: 30%    Downloading: 45%    Downloading: 60%    Downloading: 75%    Downloading: 100%    Downloading: 100%
13-Apr-2017 13:35:54
13-Apr-2017 13:35:54   - Installing sebastian/diff (1.4.1)
13-Apr-2017 13:35:55     Downloading: Connecting...    Downloading: 0%               Downloading: 15%    Downloading: 30%    Downloading: 45%    Downloading: 100%    Downloading: 100%
13-Apr-2017 13:35:55
13-Apr-2017 13:35:55   - Installing sebastian/comparator (1.2.2)
13-Apr-2017 13:35:56     Downloading: Connecting...    Downloading: 0%               Downloading: 10%    Downloading: 20%    Downloading: 30%    Downloading: 40%    Downloading: 45%    Downloading: 55%    Downloading: 65%    Downloading: 75%    Downloading: 85%    Downloading: 100%    Downloading: 100%
13-Apr-2017 13:35:56
13-Apr-2017 13:35:56   - Installing phpunit/php-text-template (1.2.1)
13-Apr-2017 13:35:57     Downloading: Connecting...    Downloading: 0%               Downloading: 35%    Downloading: 100%    Downloading: 100%
13-Apr-2017 13:35:57
13-Apr-2017 13:35:57   - Installing doctrine/instantiator (1.0.5)
13-Apr-2017 13:35:58     Downloading: Connecting...    Downloading: 0%               Downloading: 15%    Downloading: 30%    Downloading: 45%    Downloading: 50%    Downloading: 65%    Downloading: 75%    Downloading: 90%    Downloading: 100%    Downloading: 100%
13-Apr-2017 13:35:58
13-Apr-2017 13:35:58   - Installing phpunit/phpunit-mock-objects (2.3.8)
13-Apr-2017 13:35:59     Downloading: Connecting...    Downloading: 0%               Downloading: 5%    Downloading: 20%    Downloading: 25%    Downloading: 35%    Downloading: 40%    Downloading: 45%    Downloading: 50%    Downloading: 60%    Downloading: 65%    Downloading: 70%    Downloading: 75%    Downloading: 90%    Downloading: 95%    Downloading: 100%    Downloading: 100%
13-Apr-2017 13:35:59
13-Apr-2017 13:35:59   - Installing phpunit/php-timer (1.0.8)
13-Apr-2017 13:36:00     Downloading: Connecting...    Downloading: 0%               Downloading: 100%    Downloading: 100%
13-Apr-2017 13:36:00
13-Apr-2017 13:36:00   - Installing phpunit/php-file-iterator (1.4.2)
13-Apr-2017 13:36:01     Downloading: Connecting...    Downloading: 0%               Downloading: 20%    Downloading: 40%    Downloading: 60%    Downloading: 100%    Downloading: 100%
13-Apr-2017 13:36:01
13-Apr-2017 13:36:01   - Installing phpunit/php-token-stream (1.4.9)
13-Apr-2017 13:36:02     Downloading: Connecting...    Downloading: 0%               Downloading: 5%    Downloading: 10%    Downloading: 15%    Downloading: 20%    Downloading: 65%    Downloading: 70%    Downloading: 75%    Downloading: 80%    Downloading: 85%    Downloading: 90%    Downloading: 95%    Downloading: 100%    Downloading: 100%
13-Apr-2017 13:36:02
13-Apr-2017 13:36:02   - Installing phpunit/php-code-coverage (2.2.4)
13-Apr-2017 13:36:04     Downloading: Connecting...    Downloading: 0%               Downloading: 5%    Downloading: 10%    Downloading: 15%    Downloading: 20%    Downloading: 25%    Downloading: 30%    Downloading: 35%    Downloading: 40%    Downloading: 45%    Downloading: 50%    Downloading: 55%    Downloading: 60%    Downloading: 65%    Downloading: 75%    Downloading: 85%    Downloading: 90%    Downloading: 95%    Downloading: 100%    Downloading: 100%
13-Apr-2017 13:36:04
13-Apr-2017 13:36:04   - Installing phpspec/prophecy (v1.6.2)
13-Apr-2017 13:36:05     Downloading: Connecting...    Downloading: 0%               Downloading: 5%    Downloading: 10%    Downloading: 15%    Downloading: 20%    Downloading: 25%    Downloading: 30%    Downloading: 35%    Downloading: 40%    Downloading: 45%    Downloading: 50%    Downloading: 55%    Downloading: 60%    Downloading: 65%    Downloading: 70%    Downloading: 75%    Downloading: 80%    Downloading: 85%    Downloading: 90%    Downloading: 95%    Downloading: 100%    Downloading: 100%
13-Apr-2017 13:36:05
13-Apr-2017 13:36:05   - Installing phpunit/phpunit (4.8.31)
13-Apr-2017 13:36:06     Downloading: Connecting...    Downloading: 0%               Downloading: 5%    Downloading: 10%    Downloading: 15%    Downloading: 20%    Downloading: 25%    Downloading: 30%    Downloading: 35%    Downloading: 40%    Downloading: 45%    Downloading: 50%    Downloading: 55%    Downloading: 60%    Downloading: 65%    Downloading: 70%    Downloading: 75%    Downloading: 85%    Downloading: 95%    Downloading: 100%    Downloading: 100%
13-Apr-2017 13:36:06
13-Apr-2017 13:36:06   - Installing phpunit/dbunit (2.0.3)
13-Apr-2017 13:36:08     Downloading: Connecting...    Downloading: 0%               Downloading: 5%    Downloading: 10%    Downloading: 15%    Downloading: 20%    Downloading: 25%    Downloading: 30%    Downloading: 35%    Downloading: 40%    Downloading: 45%    Downloading: 50%    Downloading: 55%    Downloading: 60%    Downloading: 65%    Downloading: 70%    Downloading: 75%    Downloading: 80%    Downloading: 85%    Downloading: 90%    Downloading: 95%    Downloading: 100%    Downloading: 100%
13-Apr-2017 13:36:08
13-Apr-2017 13:36:08   - Installing squizlabs/php_codesniffer (2.7.1)
13-Apr-2017 13:36:09     Downloading: Connecting...    Downloading: 0%               Downloading: 5%    Downloading: 10%    Downloading: 15%    Downloading: 20%    Downloading: 25%    Downloading: 30%    Downloading: 35%    Downloading: 40%    Downloading: 45%    Downloading: 50%    Downloading: 60%    Downloading: 65%    Downloading: 70%    Downloading: 75%    Downloading: 80%    Downloading: 85%    Downloading: 90%    Downloading: 95%    Downloading: 100%    Downloading: 100%
13-Apr-2017 13:36:09
13-Apr-2017 13:36:09   - Installing webmozart/assert (1.2.0)
13-Apr-2017 13:36:11     Downloading: Connecting...    Downloading: 0%               Downloading: 55%    Downloading: 80%    Downloading: 100%    Downloading: 100%
13-Apr-2017 13:36:11
13-Apr-2017 13:36:12 lusitanian/oauth suggests installing predis/predis (Allows using the Redis storage backend.)
13-Apr-2017 13:36:12 paragonie/random_compat suggests installing ext-libsodium (Provides a modern crypto API that can be used to generate random bytes.)
13-Apr-2017 13:36:12 patchwork/utf8 suggests installing ext-intl (Use Intl for best performance)
13-Apr-2017 13:36:12 patchwork/utf8 suggests installing ext-wfio (Use WFIO for UTF-8 filesystem access on Windows)
13-Apr-2017 13:36:12 s9e/text-formatter suggests installing ext-intl (Allows international URLs to be accepted by the URL filter)
13-Apr-2017 13:36:12 s9e/text-formatter suggests installing ext-xsl (Enables the XSLT renderer)
13-Apr-2017 13:36:12 symfony/http-kernel suggests installing symfony/class-loader ()
13-Apr-2017 13:36:12 symfony/http-kernel suggests installing symfony/var-dumper ()
13-Apr-2017 13:36:12 symfony/dependency-injection suggests installing symfony/expression-language (For using expressions in service container configuration)
13-Apr-2017 13:36:12 zendframework/zend-eventmanager suggests installing container-interop/container-interop (^1.1.0, to use the lazy listeners feature)
13-Apr-2017 13:36:12 zendframework/zend-eventmanager suggests installing zendframework/zend-stdlib (^2.7.3 || ^3.0, to use the FilterChain feature)
13-Apr-2017 13:36:12 zendframework/zend-code suggests installing doctrine/annotations (Doctrine\Common\Annotations >=1.0 for annotation features)
13-Apr-2017 13:36:12 zendframework/zend-code suggests installing zendframework/zend-stdlib (Zend\Stdlib component)
13-Apr-2017 13:36:12 ocramius/proxy-manager suggests installing ocramius/generated-hydrator (To have very fast object to array to object conversion for ghost objects)
13-Apr-2017 13:36:12 ocramius/proxy-manager suggests installing zendframework/zend-json (To have the JsonRpc adapter (Remote Object feature))
13-Apr-2017 13:36:12 ocramius/proxy-manager suggests installing zendframework/zend-soap (To have the Soap adapter (Remote Object feature))
13-Apr-2017 13:36:12 ocramius/proxy-manager suggests installing zendframework/zend-stdlib (To use the hydrator proxy)
13-Apr-2017 13:36:12 ocramius/proxy-manager suggests installing zendframework/zend-xmlrpc (To have the XmlRpc adapter (Remote Object feature))
13-Apr-2017 13:36:12 symfony/routing suggests installing doctrine/annotations (For using the annotation loader)
13-Apr-2017 13:36:12 symfony/routing suggests installing symfony/expression-language (For using expression matching)
13-Apr-2017 13:36:12 symfony/twig-bridge suggests installing symfony/asset (For using the AssetExtension)
13-Apr-2017 13:36:12 symfony/twig-bridge suggests installing symfony/expression-language (For using the ExpressionExtension)
13-Apr-2017 13:36:12 symfony/twig-bridge suggests installing symfony/form (For using the FormExtension)
13-Apr-2017 13:36:12 symfony/twig-bridge suggests installing symfony/security (For using the SecurityExtension)
13-Apr-2017 13:36:12 symfony/twig-bridge suggests installing symfony/stopwatch (For using the StopwatchExtension)
13-Apr-2017 13:36:12 symfony/twig-bridge suggests installing symfony/templating (For using the TwigEngine)
13-Apr-2017 13:36:12 symfony/twig-bridge suggests installing symfony/translation (For using the TranslationExtension)
13-Apr-2017 13:36:12 symfony/twig-bridge suggests installing symfony/var-dumper (For using the DumpExtension)
13-Apr-2017 13:36:12 facebook/webdriver suggests installing phpdocumentor/phpdocumentor (2.*)
13-Apr-2017 13:36:12 phpdocumentor/reflection-docblock suggests installing dflydev/markdown (~1.0)
13-Apr-2017 13:36:12 phpdocumentor/reflection-docblock suggests installing erusev/parsedown (~1.0)
13-Apr-2017 13:36:12 sebastian/global-state suggests installing ext-uopz (*)
13-Apr-2017 13:36:12 phpunit/phpunit-mock-objects suggests installing ext-soap (*)
13-Apr-2017 13:36:12 phpunit/phpunit suggests installing phpunit/php-invoker (~1.1)
13-Apr-2017 13:36:12 Generating autoload files
13-Apr-2017 13:36:13 Buildfile: /data/build/build.xml
13-Apr-2017 13:36:13
13-Apr-2017 13:36:13 phpBB > clean:
13-Apr-2017 13:36:13
13-Apr-2017 13:36:13    [delete] Directory /data/build/logs does not exist or is not a directory.
13-Apr-2017 13:36:13    [delete] Directory /data/build/api does not exist or is not a directory.
13-Apr-2017 13:36:13    [delete] Directory /data/build/codebrowser does not exist or is not a directory.
13-Apr-2017 13:36:13    [delete] Directory /data/build/coverage does not exist or is not a directory.
13-Apr-2017 13:36:13    [delete] Directory /data/build/cpd does not exist or is not a directory.
13-Apr-2017 13:36:13    [delete] Directory /data/build/dependencies does not exist or is not a directory.
13-Apr-2017 13:36:13    [delete] Directory /data/build/new_version does not exist or is not a directory.
13-Apr-2017 13:36:13    [delete] Directory /data/build/old_versions does not exist or is not a directory.
13-Apr-2017 13:36:13    [delete] Directory /data/build/save does not exist or is not a directory.
13-Apr-2017 13:36:13
13-Apr-2017 13:36:13 phpBB > prepare:
13-Apr-2017 13:36:13
13-Apr-2017 13:36:13     [mkdir] Created dir: /data/build/logs
13-Apr-2017 13:36:13     [mkdir] Created dir: /data/build/api
13-Apr-2017 13:36:13     [mkdir] Created dir: /data/build/codebrowser
13-Apr-2017 13:36:13     [mkdir] Created dir: /data/build/coverage
13-Apr-2017 13:36:13     [mkdir] Created dir: /data/build/cpd
13-Apr-2017 13:36:13     [mkdir] Created dir: /data/build/dependencies
13-Apr-2017 13:36:13     [mkdir] Created dir: /data/build/new_version
13-Apr-2017 13:36:13     [mkdir] Created dir: /data/build/new_version/files
13-Apr-2017 13:36:13     [mkdir] Created dir: /data/build/new_version/patches
13-Apr-2017 13:36:13     [mkdir] Created dir: /data/build/new_version/release_files
13-Apr-2017 13:36:13     [mkdir] Created dir: /data/build/new_version/update
13-Apr-2017 13:36:13     [mkdir] Created dir: /data/build/old_versions
13-Apr-2017 13:36:13     [mkdir] Created dir: /data/build/save
13-Apr-2017 13:36:13
13-Apr-2017 13:36:13 BUILD FINISHED
13-Apr-2017 13:36:13
13-Apr-2017 13:36:13 Total time: 0.1113 seconds
13-Apr-2017 13:36:13
13-Apr-2017 13:36:13 Finished task 'Prepare directory' with result: Success
13-Apr-2017 13:36:13 Skipping execution of task 'Run sniffs' as it is disabled
13-Apr-2017 13:36:13
Substituting variable: ${bamboo.working.directory} with /home/bamboo/xml-data/build-dir/PHPBB3-PR-JOB1
13-Apr-2017 13:36:13 Starting task 'Run sniffs' of type 'com.atlassian.bamboo.plugins.bamboo-docker-plugin:task.docker.cli'
13-Apr-2017 13:36:13 Running image name (phpbb:php-5.6)
13-Apr-2017 13:36:13
Beginning to execute external process for build 'phpBB3 - Pull Requests - Build and Test Job #6975 (PHPBB3-PR-JOB1-6975)'
... running command line:
/usr/bin/docker run --volume /home/bamboo/xml-data/build-dir/PHPBB3-PR-JOB1:/data --workdir /data/build --rm -u=991 phpbb:php-5.6 ../phpBB/vendor/bin/phing sniff
... in: /home/bamboo/xml-data/build-dir/PHPBB3-PR-JOB1
... using extra environment variables:
bamboo_planRepository_1_branch=3.1.x
bamboo_planRepository_1_branchDisplayName=3.1.x
bamboo_repository_revision_number=f9a596c544fb6677d822cd78d16987d8e751b729
bamboo_PRref=master
bamboo_resultsUrl=https://bamboo.phpbb.com/browse/PHPBB3-PR-JOB1-6975
bamboo_capability_system_builder_command_Git=/usr/bin/git
bamboo_repository_75956235_git_username=bantu
bamboo_planRepository_1_name=phpBB Ascraeus
bamboo_build_working_directory=/home/bamboo/xml-data/build-dir/PHPBB3-PR-JOB1
bamboo_buildKey=PHPBB3-PR-JOB1
bamboo_capability_phpbb_tests=true
bamboo_shortPlanName=Pull Requests
bamboo_capability_system_builder_command_fop=/usr/bin/fop
bamboo_capability_dbms_sqlite_2=true
bamboo_planRepository_name=phpBB Ascraeus
bamboo_PRnumber=4789
bamboo_buildNumber=6975
bamboo_repository_75956235_git_repositoryUrl=https://github.com/phpbb/phpbb.git
bamboo_capability_system_builder_phpunit_PHPUnit=/usr/bin/phpunit
bamboo_shortJobName=Build and Test Job
bamboo_buildResultsUrl=https://bamboo.phpbb.com/browse/PHPBB3-PR-JOB1-6975
bamboo_repository_75956235_branch_name=3.1.x
bamboo_planRepository_repositoryUrl=https://github.com/phpbb/phpbb.git
bamboo_agentId=131073
bamboo_planName=phpBB3 - Pull Requests
bamboo_build_commandline_com_atlassian_bamboo_plugins_scripttask_task_builder_script_7=/bin/sh /home/bamboo/temp/PHPBB3-PR-JOB1-6975-ScriptBuildTask-719199374796854473.sh
bamboo_shortPlanKey=PR
bamboo_shortJobKey=JOB1
bamboo_capability_dbms_mysql_55=true
bamboo_capability_system_jdk_JDK_1_7_0_65=/usr/lib/jvm/java-7-openjdk-amd64
bamboo_planRepository_revision=f9a596c544fb6677d822cd78d16987d8e751b729
bamboo_repository_previous_revision_number=f9a596c544fb6677d822cd78d16987d8e751b729
bamboo_buildTimeStamp=2017-04-13T13:34:55.250Z
bamboo_planRepository_previousRevision=f9a596c544fb6677d822cd78d16987d8e751b729
bamboo_capability_system_builder_mvn2_Maven_2=/usr/share/maven2
bamboo_capability_system_jdk_JDK_1_6_0_16=/usr/lib/jvm/java-6-sun-1.6.0.16
bamboo_build_commandline_com_atlassian_bamboo_plugins_scripttask_task_builder_script_4=/bin/sh /home/bamboo/temp/PHPBB3-PR-JOB1-6975-ScriptBuildTask-4662042880874320813.sh
bamboo_buildResultKey=PHPBB3-PR-JOB1-6975
bamboo_repository_git_branch=3.1.x
bamboo_repository_branch_name=3.1.x
bamboo_buildPlanName=phpBB3 - Pull Requests - Build and Test Job
bamboo_planRepository_1_revision=f9a596c544fb6677d822cd78d16987d8e751b729
bamboo_repository_name=phpBB Ascraeus
bamboo_capability_system_docker_executable=/usr/bin/docker
bamboo_build_commandline_com_atlassian_bamboo_plugins_bamboo_docker_plugin_task_docker_cli_12=/usr/bin/docker run --volume /home/bamboo/xml-data/build-dir/PHPBB3-PR-JOB1:/data --workdir /data/phpBB --rm -e HOME=/home/bamboo -u=991 phpbb:php-5.6 /bin/bash -c php ../composer.phar install --dev; cd ../build; ../phpBB/vendor/bin/phing clean prepare
bamboo_planRepository_branch=3.1.x
bamboo_agentWorkingDirectory=/home/bamboo/xml-data/build-dir
bamboo_capability_system_git_executable=/usr/bin/git
bamboo_planRepository_1_previousRevision=f9a596c544fb6677d822cd78d16987d8e751b729
bamboo_capability_system_builder_phpunit_PHPUnit_3_4=/usr/bin/phpunit
bamboo_repository_git_username=bantu
bamboo_repository_75956235_revision_number=f9a596c544fb6677d822cd78d16987d8e751b729
bamboo_planRepository_branchDisplayName=3.1.x
bamboo_planRepository_1_type=gitv2
bamboo_planRepository_branchName=3.1.x
bamboo_repository_75956235_previous_revision_number=f9a596c544fb6677d822cd78d16987d8e751b729
bamboo_capability_system_jdk_JDK=/usr/lib/jvm/java-6-sun
bamboo_plan_storageTag=PHPBB3-PR
bamboo_planRepository_type=gitv2
bamboo_planRepository_1_username=bantu
bamboo_ManualBuildTriggerReason_userName=Build Robot
bamboo_repository_git_repositoryUrl=https://github.com/phpbb/phpbb.git
bamboo_repository_75956235_git_branch=3.1.x
bamboo_capability_system_builder_ant_Ant=/usr/share/ant
bamboo_repository_75956235_name=phpBB Ascraeus
bamboo_working_directory=/home/bamboo/xml-data/build-dir/PHPBB3-PR-JOB1
bamboo_planKey=PHPBB3-PR
bamboo_planRepository_1_repositoryUrl=https://github.com/phpbb/phpbb.git
bamboo_planRepository_username=bantu
bamboo_capability_local=true
bamboo_capability_system_jdk_JDK_1_6=/usr/lib/jvm/java-6-sun
bamboo_capability_system_jdk_JDK_1_7=/usr/lib/jvm/java-7-openjdk-amd64
bamboo_planRepository_1_branchName=3.1.x
13-Apr-2017 13:36:14 Buildfile: /data/build/build.xml
13-Apr-2017 13:36:14
13-Apr-2017 13:36:14 phpBB > sniff:
13-Apr-2017 13:36:14
13-Apr-2017 13:36:22 ............................................................  60 / 688 (9%)
13-Apr-2017 13:36:23 ............................................................ 120 / 688 (17%)
13-Apr-2017 13:36:24 ............................................................ 180 / 688 (26%)
13-Apr-2017 13:36:26 ............................................................ 240 / 688 (35%)
13-Apr-2017 13:36:31 .........................E.................................. 300 / 688 (44%)
13-Apr-2017 13:36:35 ............................................................ 360 / 688 (52%)
13-Apr-2017 13:36:41 ............................................................ 420 / 688 (61%)
13-Apr-2017 13:36:45 ............................................................ 480 / 688 (70%)
13-Apr-2017 13:36:49 ............................................................ 540 / 688 (78%)
13-Apr-2017 13:36:53 ............................................................ 600 / 688 (87%)
13-Apr-2017 13:36:56 ..........................................................E. 660 / 688 (96%)
13-Apr-2017 13:36:57 ............................
13-Apr-2017 13:36:57
13-Apr-2017 13:36:57
13-Apr-2017 13:36:57 FILE: /data/phpBB/phpbb/console/command/style/install.php
13-Apr-2017 13:36:57 ----------------------------------------------------------------------
13-Apr-2017 13:36:57 FOUND 3 ERRORS AFFECTING 3 LINES
13-Apr-2017 13:36:57 ----------------------------------------------------------------------
13-Apr-2017 13:36:57 47 | ERROR | There should be exactly one space between the keyword and
13-Apr-2017 13:36:57     |       | opening parenthesis
13-Apr-2017 13:36:57     |       | (phpbb.ControlStructures.OpeningParenthesis.NoSpaceBeforeOpeningParenthesis)
13-Apr-2017 13:36:57 49 | ERROR | There should be exactly one space between the keyword and
13-Apr-2017 13:36:57     |       | opening parenthesis
13-Apr-2017 13:36:57     |       | (phpbb.ControlStructures.OpeningParenthesis.NoSpaceBeforeOpeningParenthesis)
13-Apr-2017 13:36:57 56 | ERROR | There should be exactly one space between the keyword and
13-Apr-2017 13:36:57     |       | opening parenthesis
13-Apr-2017 13:36:57     |       | (phpbb.ControlStructures.OpeningParenthesis.NoSpaceBeforeOpeningParenthesis)
13-Apr-2017 13:36:57 ----------------------------------------------------------------------
13-Apr-2017 13:36:57
13-Apr-2017 13:36:57
13-Apr-2017 13:36:57 FILE: /data/phpBB/phpbb/style/manager.php
13-Apr-2017 13:36:57 ----------------------------------------------------------------------
13-Apr-2017 13:36:57 FOUND 8 ERRORS AFFECTING 8 LINES
13-Apr-2017 13:36:57 ----------------------------------------------------------------------
13-Apr-2017 13:36:57   91 | ERROR | There should be exactly one space between the keyword and
13-Apr-2017 13:36:57      |       | opening parenthesis
13-Apr-2017 13:36:57      |       | (phpbb.ControlStructures.OpeningParenthesis.NoSpaceBeforeOpeningParenthesis)
13-Apr-2017 13:36:57   94 | ERROR | There should be exactly one space between the keyword and
13-Apr-2017 13:36:57      |       | opening parenthesis
13-Apr-2017 13:36:57      |       | (phpbb.ControlStructures.OpeningParenthesis.NoSpaceBeforeOpeningParenthesis)
13-Apr-2017 13:36:57 104 | ERROR | There should be exactly one space between the keyword and
13-Apr-2017 13:36:57      |       | opening parenthesis
13-Apr-2017 13:36:57      |       | (phpbb.ControlStructures.OpeningParenthesis.NoSpaceBeforeOpeningParenthesis)
13-Apr-2017 13:36:57 116 | ERROR | There should be exactly one space between the keyword and
13-Apr-2017 13:36:57      |       | opening parenthesis
13-Apr-2017 13:36:57      |       | (phpbb.ControlStructures.OpeningParenthesis.NoSpaceBeforeOpeningParenthesis)
13-Apr-2017 13:36:57 130 | ERROR | There should be exactly one space between the keyword and
13-Apr-2017 13:36:57      |       | opening parenthesis
13-Apr-2017 13:36:57      |       | (phpbb.ControlStructures.OpeningParenthesis.NoSpaceBeforeOpeningParenthesis)
13-Apr-2017 13:36:57 148 | ERROR | There should be exactly one space between the keyword and
13-Apr-2017 13:36:57      |       | opening parenthesis
13-Apr-2017 13:36:57      |       | (phpbb.ControlStructures.OpeningParenthesis.NoSpaceBeforeOpeningParenthesis)
13-Apr-2017 13:36:57 157 | ERROR | There should be exactly one space between the keyword and
13-Apr-2017 13:36:57      |       | opening parenthesis
13-Apr-2017 13:36:57      |       | (phpbb.ControlStructures.OpeningParenthesis.NoSpaceBeforeOpeningParenthesis)
13-Apr-2017 13:36:57 251 | ERROR | There should be exactly one space between the keyword and
13-Apr-2017 13:36:57      |       | opening parenthesis
13-Apr-2017 13:36:57      |       | (phpbb.ControlStructures.OpeningParenthesis.NoSpaceBeforeOpeningParenthesis)
13-Apr-2017 13:36:57 ----------------------------------------------------------------------
13-Apr-2017 13:36:57
13-Apr-2017 13:36:57 Time: 42.95 secs; Memory: 77.5Mb
13-Apr-2017 13:36:57
13-Apr-2017 13:37:05 ............................................................  60 / 206 (29%)
13-Apr-2017 13:37:25 ............................................................ 120 / 206 (58%)
13-Apr-2017 13:37:40 ................................E........................... 180 / 206 (87%)
13-Apr-2017 13:37:47 ..........................
13-Apr-2017 13:37:47
13-Apr-2017 13:37:47
13-Apr-2017 13:37:47 FILE: /data/phpBB/includes/acp/acp_styles.php
13-Apr-2017 13:37:47 ----------------------------------------------------------------------
13-Apr-2017 13:37:47 FOUND 3 ERRORS AFFECTING 3 LINES
13-Apr-2017 13:37:47 ----------------------------------------------------------------------
13-Apr-2017 13:37:47 202 | ERROR | There should be exactly one space between the keyword and
13-Apr-2017 13:37:47      |       | opening parenthesis
13-Apr-2017 13:37:47      |       | (phpbb.ControlStructures.OpeningParenthesis.NoSpaceBeforeOpeningParenthesis)
13-Apr-2017 13:37:47 303 | ERROR | There should be exactly one space between the keyword and
13-Apr-2017 13:37:47      |       | opening parenthesis
13-Apr-2017 13:37:47      |       | (phpbb.ControlStructures.OpeningParenthesis.NoSpaceBeforeOpeningParenthesis)
13-Apr-2017 13:37:47 310 | ERROR | There should be exactly one space between the keyword and
13-Apr-2017 13:37:47      |       | opening parenthesis
13-Apr-2017 13:37:47      |       | (phpbb.ControlStructures.OpeningParenthesis.NoSpaceBeforeOpeningParenthesis)
13-Apr-2017 13:37:47 ----------------------------------------------------------------------
13-Apr-2017 13:37:47
13-Apr-2017 13:37:47 Time: 50.37 secs; Memory: 60.25Mb
13-Apr-2017 13:37:47
13-Apr-2017 13:37:47
13-Apr-2017 13:37:47
13-Apr-2017 13:37:47 Time: 17ms; Memory: 3.75Mb
13-Apr-2017 13:37:47
13-Apr-2017 13:37:47        [if] Error in IfTask
13-Apr-2017 13:37:47 Execution of target "sniff" failed for the following reason: /data/build/build.xml:108:6: /data/build/build.xml:114:9: PHP Code Sniffer failed.
13-Apr-2017 13:37:47
13-Apr-2017 13:37:47 BUILD FAILED
13-Apr-2017 13:37:47 /data/build/build.xml:108:6: /data/build/build.xml:114:9: PHP Code Sniffer failed.
13-Apr-2017 13:37:47 Total time: 2 minutes  33.73 seconds
13-Apr-2017 13:37:47
13-Apr-2017 13:37:47 Failing task since return code of [/usr/bin/docker run --volume /home/bamboo/xml-data/build-dir/PHPBB3-PR-JOB1:/data --workdir /data/build --rm -u=991 phpbb:php-5.6 ../phpBB/vendor/bin/phing sniff] was 1 while expected 0
13-Apr-2017 13:37:47 Error occurred while running Task 'Run sniffs(11)' of type com.atlassian.bamboo.plugins.bamboo-docker-plugin:task.docker.cli.
13-Apr-2017 13:37:48 com.atlassian.bamboo.task.TaskException: Failed to execute task
13-Apr-2017 13:37:48         at com.atlassian.bamboo.plugins.docker.service.RunService.execute(RunService.java:71)
13-Apr-2017 13:37:48         at com.atlassian.bamboo.plugins.docker.tasks.cli.DockerCliTask.execute(DockerCliTask.java:60)
13-Apr-2017 13:37:48         at com.atlassian.bamboo.task.TaskExecutorImpl.lambda$executeTasks$3(TaskExecutorImpl.java:317)
13-Apr-2017 13:37:48         at com.atlassian.bamboo.task.TaskExecutorImpl.executeTaskWithPrePostActions(TaskExecutorImpl.java:246)
13-Apr-2017 13:37:48         at com.atlassian.bamboo.task.TaskExecutorImpl.executeTasks(TaskExecutorImpl.java:317)
13-Apr-2017 13:37:48         at com.atlassian.bamboo.task.TaskExecutorImpl.execute(TaskExecutorImpl.java:118)
13-Apr-2017 13:37:48         at com.atlassian.bamboo.build.pipeline.tasks.ExecuteBuildTask.call(ExecuteBuildTask.java:74)
13-Apr-2017 13:37:48         at com.atlassian.bamboo.v2.build.agent.DefaultBuildAgent.build(DefaultBuildAgent.java:216)
13-Apr-2017 13:37:48         at com.atlassian.bamboo.v2.build.agent.BuildAgentControllerImpl$1.call(BuildAgentControllerImpl.java:139)
13-Apr-2017 13:37:48         at com.atlassian.bamboo.v2.build.agent.BuildAgentControllerImpl$1.call(BuildAgentControllerImpl.java:130)
13-Apr-2017 13:37:48         at com.atlassian.bamboo.variable.CustomVariableContextImpl.withVariableSubstitutor(CustomVariableContextImpl.java:221)
13-Apr-2017 13:37:48         at com.atlassian.bamboo.v2.build.agent.BuildAgentControllerImpl.waitAndPerformBuild(BuildAgentControllerImpl.java:129)
13-Apr-2017 13:37:48         at com.atlassian.bamboo.v2.build.agent.DefaultBuildAgent$1.run(DefaultBuildAgent.java:138)
13-Apr-2017 13:37:48         at com.atlassian.bamboo.utils.BambooRunnables$1.run(BambooRunnables.java:51)
13-Apr-2017 13:37:48         at com.atlassian.bamboo.security.ImpersonationHelper.runWith(ImpersonationHelper.java:31)
13-Apr-2017 13:37:48         at com.atlassian.bamboo.security.ImpersonationHelper.runWithSystemAuthority(ImpersonationHelper.java:20)
13-Apr-2017 13:37:48         at com.atlassian.bamboo.security.ImpersonationHelper$1.run(ImpersonationHelper.java:52)
13-Apr-2017 13:37:48         at java.lang.Thread.run(Thread.java:745)
13-Apr-2017 13:37:48 Caused by: com.atlassian.bamboo.plugins.docker.client.DockerException: Error running Docker run command
13-Apr-2017 13:37:48         at com.atlassian.bamboo.plugins.docker.client.DockerCmd.run(DockerCmd.java:103)
13-Apr-2017 13:37:48         at com.atlassian.bamboo.plugins.docker.service.RunService.execute(RunService.java:60)
13-Apr-2017 13:37:48         ... 17 more
13-Apr-2017 13:37:48 Caused by: com.atlassian.utils.process.ProcessException: Error executing /usr/bin/docker run --volume /home/bamboo/xml-data/build-dir/PHPBB3-PR-JOB1:/data --workdir /data/build --rm -u=991 phpbb:php-5.6 ../phpBB/vendor/bin/phing sniff
13-Apr-2017 13:37:48         at com.atlassian.bamboo.plugins.docker.process.DockerTaskProcessService.execute(DockerTaskProcessService.java:60)
13-Apr-2017 13:37:48         at com.atlassian.bamboo.plugins.docker.client.DockerCmd.run(DockerCmd.java:99)
13-Apr-2017 13:37:48         ... 18 more
13-Apr-2017 13:37:48 Starting task 'Parsing test results produced by script' of type 'com.atlassian.bamboo.plugins.testresultparser:task.testresultparser.junit'
13-Apr-2017 13:37:48 Parsing test results under /home/bamboo/xml-data/build-dir/PHPBB3-PR-JOB1...
13-Apr-2017 13:37:48 Failing task since test cases were expected but none were found.
13-Apr-2017 13:37:48 Finished task 'Parsing test results produced by script' with result: Failed
13-Apr-2017 13:37:48
Substituting variable: ${bamboo.PRnumber} with 4789
13-Apr-2017 13:37:48
Substituting variable: ${bamboo.buildResultsUrl} with https://bamboo.phpbb.com/browse/PHPBB3-PR-JOB1-6975
13-Apr-2017 13:37:48
Substituting variable: ${bamboo.buildResultsUrl} with https://bamboo.phpbb.com/browse/PHPBB3-PR-JOB1-6975
13-Apr-2017 13:37:48 Starting task 'Set result build status' of type 'com.atlassian.bamboo.plugins.scripttask:task.builder.script'
13-Apr-2017 13:37:48
Beginning to execute external process for build 'phpBB3 - Pull Requests - Build and Test Job #6975 (PHPBB3-PR-JOB1-6975)'
... running command line:
/bin/sh /home/bamboo/temp/PHPBB3-PR-JOB1-6975-ScriptBuildTask-3252460145607362832.sh
... in: /home/bamboo/xml-data/build-dir/PHPBB3-PR-JOB1
... using extra environment variables:
bamboo_planRepository_1_branch=3.1.x
bamboo_planRepository_1_branchDisplayName=3.1.x
bamboo_repository_revision_number=f9a596c544fb6677d822cd78d16987d8e751b729
bamboo_PRref=master
bamboo_resultsUrl=https://bamboo.phpbb.com/browse/PHPBB3-PR-JOB1-6975
bamboo_capability_system_builder_command_Git=/usr/bin/git
bamboo_repository_75956235_git_username=bantu
bamboo_planRepository_1_name=phpBB Ascraeus
bamboo_build_working_directory=/home/bamboo/xml-data/build-dir/PHPBB3-PR-JOB1
bamboo_buildKey=PHPBB3-PR-JOB1
bamboo_capability_phpbb_tests=true
bamboo_shortPlanName=Pull Requests
bamboo_capability_system_builder_command_fop=/usr/bin/fop
bamboo_capability_dbms_sqlite_2=true
bamboo_planRepository_name=phpBB Ascraeus
bamboo_PRnumber=4789
bamboo_buildNumber=6975
bamboo_repository_75956235_git_repositoryUrl=https://github.com/phpbb/phpbb.git
bamboo_capability_system_builder_phpunit_PHPUnit=/usr/bin/phpunit
bamboo_shortJobName=Build and Test Job
bamboo_buildResultsUrl=https://bamboo.phpbb.com/browse/PHPBB3-PR-JOB1-6975
bamboo_repository_75956235_branch_name=3.1.x
bamboo_planRepository_repositoryUrl=https://github.com/phpbb/phpbb.git
bamboo_agentId=131073
bamboo_planName=phpBB3 - Pull Requests
bamboo_build_commandline_com_atlassian_bamboo_plugins_scripttask_task_builder_script_7=/bin/sh /home/bamboo/temp/PHPBB3-PR-JOB1-6975-ScriptBuildTask-719199374796854473.sh
bamboo_shortPlanKey=PR
bamboo_shortJobKey=JOB1
bamboo_capability_dbms_mysql_55=true
bamboo_capability_system_jdk_JDK_1_7_0_65=/usr/lib/jvm/java-7-openjdk-amd64
bamboo_planRepository_revision=f9a596c544fb6677d822cd78d16987d8e751b729
bamboo_repository_previous_revision_number=f9a596c544fb6677d822cd78d16987d8e751b729
bamboo_buildTimeStamp=2017-04-13T13:34:55.250Z
bamboo_planRepository_previousRevision=f9a596c544fb6677d822cd78d16987d8e751b729
bamboo_capability_system_builder_mvn2_Maven_2=/usr/share/maven2
bamboo_capability_system_jdk_JDK_1_6_0_16=/usr/lib/jvm/java-6-sun-1.6.0.16
bamboo_build_commandline_com_atlassian_bamboo_plugins_scripttask_task_builder_script_4=/bin/sh /home/bamboo/temp/PHPBB3-PR-JOB1-6975-ScriptBuildTask-4662042880874320813.sh
bamboo_buildResultKey=PHPBB3-PR-JOB1-6975
bamboo_repository_git_branch=3.1.x
bamboo_repository_branch_name=3.1.x
bamboo_buildPlanName=phpBB3 - Pull Requests - Build and Test Job
bamboo_planRepository_1_revision=f9a596c544fb6677d822cd78d16987d8e751b729
bamboo_repository_name=phpBB Ascraeus
bamboo_capability_system_docker_executable=/usr/bin/docker
bamboo_build_commandline_com_atlassian_bamboo_plugins_bamboo_docker_plugin_task_docker_cli_11=/usr/bin/docker run --volume /home/bamboo/xml-data/build-dir/PHPBB3-PR-JOB1:/data --workdir /data/build --rm -u=991 phpbb:php-5.6 ../phpBB/vendor/bin/phing sniff
bamboo_build_commandline_com_atlassian_bamboo_plugins_bamboo_docker_plugin_task_docker_cli_12=/usr/bin/docker run --volume /home/bamboo/xml-data/build-dir/PHPBB3-PR-JOB1:/data --workdir /data/phpBB --rm -e HOME=/home/bamboo -u=991 phpbb:php-5.6 /bin/bash -c php ../composer.phar install --dev; cd ../build; ../phpBB/vendor/bin/phing clean prepare
bamboo_planRepository_branch=3.1.x
bamboo_agentWorkingDirectory=/home/bamboo/xml-data/build-dir
bamboo_capability_system_git_executable=/usr/bin/git
bamboo_planRepository_1_previousRevision=f9a596c544fb6677d822cd78d16987d8e751b729
bamboo_capability_system_builder_phpunit_PHPUnit_3_4=/usr/bin/phpunit
bamboo_repository_git_username=bantu
bamboo_repository_75956235_revision_number=f9a596c544fb6677d822cd78d16987d8e751b729
bamboo_planRepository_branchDisplayName=3.1.x
bamboo_planRepository_1_type=gitv2
bamboo_planRepository_branchName=3.1.x
bamboo_repository_75956235_previous_revision_number=f9a596c544fb6677d822cd78d16987d8e751b729
bamboo_capability_system_jdk_JDK=/usr/lib/jvm/java-6-sun
bamboo_plan_storageTag=PHPBB3-PR
bamboo_planRepository_type=gitv2
bamboo_planRepository_1_username=bantu
bamboo_ManualBuildTriggerReason_userName=Build Robot
bamboo_repository_git_repositoryUrl=https://github.com/phpbb/phpbb.git
bamboo_repository_75956235_git_branch=3.1.x
bamboo_capability_system_builder_ant_Ant=/usr/share/ant
bamboo_repository_75956235_name=phpBB Ascraeus
bamboo_working_directory=/home/bamboo/xml-data/build-dir/PHPBB3-PR-JOB1
bamboo_planKey=PHPBB3-PR
bamboo_planRepository_1_repositoryUrl=https://github.com/phpbb/phpbb.git
bamboo_planRepository_username=bantu
bamboo_capability_local=true
bamboo_capability_system_jdk_JDK_1_6=/usr/lib/jvm/java-6-sun
bamboo_capability_system_jdk_JDK_1_7=/usr/lib/jvm/java-7-openjdk-amd64
bamboo_planRepository_1_branchName=3.1.x
13-Apr-2017 13:37:48 From https://github.com/phpbb/phpbb
13-Apr-2017 13:37:48 * branch            refs/pull/4789/head -> FETCH_HEAD
13-Apr-2017 13:37:48 grep: build/logs/phpunit.xml: No such file or directory
13-Apr-2017 13:37:48 grep: build/logs/phpunit.xml: No such file or directory
13-Apr-2017 13:37:48   % Total    % Received % Xferd  Average Speed   Time    Time     Time  Current
13-Apr-2017 13:37:48                                  Dload  Upload   Total   Spent    Left  Speed
13-Apr-2017 13:37:48
13-Apr-2017 13:37:49   0     0    0     0    0     0      0      0 --:--:-- --:--:-- --:--:--     0
13-Apr-2017 13:37:49 100   273  100    93  100   180    126    244 --:--:-- --:--:-- --:--:--   245
13-Apr-2017 13:37:49 Finished task 'Set result build status' with result: Success
13-Apr-2017 13:37:49 Running post build plugin 'NCover Results Collector'
13-Apr-2017 13:37:49 Running post build plugin 'Artifact Copier'
13-Apr-2017 13:37:49 Running post build plugin 'npm Cache Cleanup'
13-Apr-2017 13:37:49 Running post build plugin 'Clover Results Collector'
13-Apr-2017 13:37:49 Running post build plugin 'Docker Container Cleanup'
13-Apr-2017 13:37:49 Successfully removed working directory at '/home/bamboo/xml-data/build-dir/PHPBB3-PR-JOB1'
13-Apr-2017 13:37:49 Finalising the build...
13-Apr-2017 13:37:49 Stopping timer.
13-Apr-2017 13:37:49 Build PHPBB3-PR-JOB1-6975 completed.
13-Apr-2017 13:37:49 Running on server: post build plugin 'NCover Results Collector'
13-Apr-2017 13:37:49 Running on server: post build plugin 'Build Hanging Detection Configuration'
13-Apr-2017 13:37:49 Running on server: post build plugin 'Clover Delta Calculator'
13-Apr-2017 13:37:49 Running on server: post build plugin 'Maven Dependencies Postprocessor'
13-Apr-2017 13:37:49 All post build plugins have finished
13-Apr-2017 13:37:49 Generating build results summary...
13-Apr-2017 13:37:49 Saving build results to disk...
13-Apr-2017 13:37:49 Logging substituted variables...
13-Apr-2017 13:37:49 Indexing build results...
13-Apr-2017 13:37:49 Finished building PHPBB3-PR-JOB1-6975.
13-Apr-2017 13:37:49
Substituting variable: ${bamboo.PRnumber} with 4789