Tests pending pull requests

Build: #6976 failed

Job: Build and Test Job failed

Stages & jobs

  1. Build and Test

Build log

The build generated 484 lines of output. Download or view full build log

13-Apr-2017 14:27:10 Build phpBB3 - Pull Requests - Build and Test Job #6976 (PHPBB3-PR-JOB1-6976) started building on agent Default Agent
13-Apr-2017 14:27:10
13-Apr-2017 14:27:10 Build working directory is /home/bamboo/xml-data/build-dir/PHPBB3-PR-JOB1
13-Apr-2017 14:27:10 Executing build phpBB3 - Pull Requests - Build and Test Job #6976 (PHPBB3-PR-JOB1-6976)
13-Apr-2017 14:27:10 Starting task 'Checkout develop branch' of type 'com.atlassian.bamboo.plugins.vcs:task.vcs.checkout'
13-Apr-2017 14:27:10 Build always requires a clean checkout
13-Apr-2017 14:27:10 Cleaning build directory '/home/bamboo/xml-data/build-dir/PHPBB3-PR-JOB1'
13-Apr-2017 14:27:10 Updating source code to revision: f9a596c544fb6677d822cd78d16987d8e751b729
13-Apr-2017 14:27:10 Fetching 'refs/heads/3.1.x' from 'https://github.com/phpbb/phpbb.git'.
13-Apr-2017 14:27:10 Checking out revision f9a596c544fb6677d822cd78d16987d8e751b729.
13-Apr-2017 14:27:10 Creating local git repository in '/home/bamboo/xml-data/build-dir/PHPBB3-PR-JOB1/.git'.
13-Apr-2017 14:27:10 Cloning into '/home/bamboo/xml-data/build-dir/PHPBB3-PR-JOB1'...
13-Apr-2017 14:27:10 done.
13-Apr-2017 14:27:12 Branch 3.1.x set up to track remote branch 3.1.x from origin.
13-Apr-2017 14:27:12 Switched to a new branch '3.1.x'
13-Apr-2017 14:27:12 Updated source code to revision: f9a596c544fb6677d822cd78d16987d8e751b729
13-Apr-2017 14:27:12 Finished task 'Checkout develop branch' with result: Success
13-Apr-2017 14:27:12 Running pre-build action: VCS Version Collector
13-Apr-2017 14:27:12
Substituting variable: ${bamboo.PRnumber} with 4789
13-Apr-2017 14:27:12
Substituting variable: ${bamboo.buildResultsUrl} with https://bamboo.phpbb.com/browse/PHPBB3-PR-JOB1-6976
13-Apr-2017 14:27:12 Starting task 'Set pending build status' of type 'com.atlassian.bamboo.plugins.scripttask:task.builder.script'
13-Apr-2017 14:27:12
Beginning to execute external process for build 'phpBB3 - Pull Requests - Build and Test Job #6976 (PHPBB3-PR-JOB1-6976)'
... running command line:
/bin/sh /home/bamboo/temp/PHPBB3-PR-JOB1-6976-ScriptBuildTask-2540851502768520956.sh
... in: /home/bamboo/xml-data/build-dir/PHPBB3-PR-JOB1
... using extra environment variables:
bamboo_planRepository_1_branch=3.1.x
bamboo_planRepository_1_branchDisplayName=3.1.x
bamboo_repository_revision_number=f9a596c544fb6677d822cd78d16987d8e751b729
bamboo_PRref=master
bamboo_resultsUrl=https://bamboo.phpbb.com/browse/PHPBB3-PR-JOB1-6976
bamboo_capability_system_builder_command_Git=/usr/bin/git
bamboo_repository_75956235_git_username=bantu
bamboo_planRepository_1_name=phpBB Ascraeus
bamboo_build_working_directory=/home/bamboo/xml-data/build-dir/PHPBB3-PR-JOB1
bamboo_buildKey=PHPBB3-PR-JOB1
bamboo_capability_phpbb_tests=true
bamboo_shortPlanName=Pull Requests
bamboo_capability_system_builder_command_fop=/usr/bin/fop
bamboo_capability_dbms_sqlite_2=true
bamboo_planRepository_name=phpBB Ascraeus
bamboo_PRnumber=4789
bamboo_buildNumber=6976
bamboo_repository_75956235_git_repositoryUrl=https://github.com/phpbb/phpbb.git
bamboo_capability_system_builder_phpunit_PHPUnit=/usr/bin/phpunit
bamboo_shortJobName=Build and Test Job
bamboo_buildResultsUrl=https://bamboo.phpbb.com/browse/PHPBB3-PR-JOB1-6976
bamboo_repository_75956235_branch_name=3.1.x
bamboo_planRepository_repositoryUrl=https://github.com/phpbb/phpbb.git
bamboo_agentId=131073
bamboo_planName=phpBB3 - Pull Requests
bamboo_shortPlanKey=PR
bamboo_shortJobKey=JOB1
bamboo_capability_dbms_mysql_55=true
bamboo_capability_system_jdk_JDK_1_7_0_65=/usr/lib/jvm/java-7-openjdk-amd64
bamboo_planRepository_revision=f9a596c544fb6677d822cd78d16987d8e751b729
bamboo_repository_previous_revision_number=f9a596c544fb6677d822cd78d16987d8e751b729
bamboo_buildTimeStamp=2017-04-13T14:27:10.520Z
bamboo_planRepository_previousRevision=f9a596c544fb6677d822cd78d16987d8e751b729
bamboo_capability_system_builder_mvn2_Maven_2=/usr/share/maven2
bamboo_capability_system_jdk_JDK_1_6_0_16=/usr/lib/jvm/java-6-sun-1.6.0.16
bamboo_buildResultKey=PHPBB3-PR-JOB1-6976
bamboo_repository_git_branch=3.1.x
bamboo_repository_branch_name=3.1.x
bamboo_buildPlanName=phpBB3 - Pull Requests - Build and Test Job
bamboo_planRepository_1_revision=f9a596c544fb6677d822cd78d16987d8e751b729
bamboo_repository_name=phpBB Ascraeus
bamboo_capability_system_docker_executable=/usr/bin/docker
bamboo_planRepository_branch=3.1.x
bamboo_agentWorkingDirectory=/home/bamboo/xml-data/build-dir
bamboo_capability_system_git_executable=/usr/bin/git
bamboo_planRepository_1_previousRevision=f9a596c544fb6677d822cd78d16987d8e751b729
bamboo_capability_system_builder_phpunit_PHPUnit_3_4=/usr/bin/phpunit
bamboo_repository_git_username=bantu
bamboo_repository_75956235_revision_number=f9a596c544fb6677d822cd78d16987d8e751b729
bamboo_planRepository_branchDisplayName=3.1.x
bamboo_planRepository_1_type=gitv2
bamboo_planRepository_branchName=3.1.x
bamboo_repository_75956235_previous_revision_number=f9a596c544fb6677d822cd78d16987d8e751b729
bamboo_capability_system_jdk_JDK=/usr/lib/jvm/java-6-sun
bamboo_plan_storageTag=PHPBB3-PR
bamboo_planRepository_type=gitv2
bamboo_planRepository_1_username=bantu
bamboo_ManualBuildTriggerReason_userName=Build Robot
bamboo_repository_git_repositoryUrl=https://github.com/phpbb/phpbb.git
bamboo_repository_75956235_git_branch=3.1.x
bamboo_capability_system_builder_ant_Ant=/usr/share/ant
bamboo_repository_75956235_name=phpBB Ascraeus
bamboo_working_directory=/home/bamboo/xml-data/build-dir/PHPBB3-PR-JOB1
bamboo_planKey=PHPBB3-PR
bamboo_planRepository_1_repositoryUrl=https://github.com/phpbb/phpbb.git
bamboo_planRepository_username=bantu
bamboo_capability_local=true
bamboo_capability_system_jdk_JDK_1_6=/usr/lib/jvm/java-6-sun
bamboo_capability_system_jdk_JDK_1_7=/usr/lib/jvm/java-7-openjdk-amd64
bamboo_planRepository_1_branchName=3.1.x
13-Apr-2017 14:27:13 From https://github.com/phpbb/phpbb
13-Apr-2017 14:27:13 * branch            refs/pull/4789/head -> FETCH_HEAD
13-Apr-2017 14:27:13   % Total    % Received % Xferd  Average Speed   Time    Time     Time  Current
13-Apr-2017 14:27:13                                  Dload  Upload   Total   Spent    Left  Speed
13-Apr-2017 14:27:13
13-Apr-2017 14:27:14   0     0    0     0    0     0      0      0 --:--:-- --:--:-- --:--:--     0
13-Apr-2017 14:27:14   0     0    0     0    0     0      0      0 --:--:-- --:--:-- --:--:--     0
13-Apr-2017 14:27:14 100   275  100    93  100   182    124    244 --:--:-- --:--:-- --:--:--   243
13-Apr-2017 14:27:14 Finished task 'Set pending build status' with result: Success
13-Apr-2017 14:27:14
Substituting variable: ${bamboo.PRnumber} with 4789
13-Apr-2017 14:27:14 Starting task 'Fetch PR' of type 'com.atlassian.bamboo.plugins.scripttask:task.builder.script'
13-Apr-2017 14:27:14
Beginning to execute external process for build 'phpBB3 - Pull Requests - Build and Test Job #6976 (PHPBB3-PR-JOB1-6976)'
... running command line:
/bin/sh /home/bamboo/temp/PHPBB3-PR-JOB1-6976-ScriptBuildTask-6388490789464179505.sh
... in: /home/bamboo/xml-data/build-dir/PHPBB3-PR-JOB1
... using extra environment variables:
bamboo_planRepository_1_branch=3.1.x
bamboo_planRepository_1_branchDisplayName=3.1.x
bamboo_repository_revision_number=f9a596c544fb6677d822cd78d16987d8e751b729
bamboo_PRref=master
bamboo_resultsUrl=https://bamboo.phpbb.com/browse/PHPBB3-PR-JOB1-6976
bamboo_capability_system_builder_command_Git=/usr/bin/git
bamboo_repository_75956235_git_username=bantu
bamboo_planRepository_1_name=phpBB Ascraeus
bamboo_build_working_directory=/home/bamboo/xml-data/build-dir/PHPBB3-PR-JOB1
bamboo_buildKey=PHPBB3-PR-JOB1
bamboo_capability_phpbb_tests=true
bamboo_shortPlanName=Pull Requests
bamboo_capability_system_builder_command_fop=/usr/bin/fop
bamboo_capability_dbms_sqlite_2=true
bamboo_planRepository_name=phpBB Ascraeus
bamboo_PRnumber=4789
bamboo_buildNumber=6976
bamboo_repository_75956235_git_repositoryUrl=https://github.com/phpbb/phpbb.git
bamboo_capability_system_builder_phpunit_PHPUnit=/usr/bin/phpunit
bamboo_shortJobName=Build and Test Job
bamboo_buildResultsUrl=https://bamboo.phpbb.com/browse/PHPBB3-PR-JOB1-6976
bamboo_repository_75956235_branch_name=3.1.x
bamboo_planRepository_repositoryUrl=https://github.com/phpbb/phpbb.git
bamboo_agentId=131073
bamboo_planName=phpBB3 - Pull Requests
bamboo_build_commandline_com_atlassian_bamboo_plugins_scripttask_task_builder_script_7=/bin/sh /home/bamboo/temp/PHPBB3-PR-JOB1-6976-ScriptBuildTask-2540851502768520956.sh
bamboo_shortPlanKey=PR
bamboo_shortJobKey=JOB1
bamboo_capability_dbms_mysql_55=true
bamboo_capability_system_jdk_JDK_1_7_0_65=/usr/lib/jvm/java-7-openjdk-amd64
bamboo_planRepository_revision=f9a596c544fb6677d822cd78d16987d8e751b729
bamboo_repository_previous_revision_number=f9a596c544fb6677d822cd78d16987d8e751b729
bamboo_buildTimeStamp=2017-04-13T14:27:10.520Z
bamboo_planRepository_previousRevision=f9a596c544fb6677d822cd78d16987d8e751b729
bamboo_capability_system_builder_mvn2_Maven_2=/usr/share/maven2
bamboo_capability_system_jdk_JDK_1_6_0_16=/usr/lib/jvm/java-6-sun-1.6.0.16
bamboo_buildResultKey=PHPBB3-PR-JOB1-6976
bamboo_repository_git_branch=3.1.x
bamboo_repository_branch_name=3.1.x
bamboo_buildPlanName=phpBB3 - Pull Requests - Build and Test Job
bamboo_planRepository_1_revision=f9a596c544fb6677d822cd78d16987d8e751b729
bamboo_repository_name=phpBB Ascraeus
bamboo_capability_system_docker_executable=/usr/bin/docker
bamboo_planRepository_branch=3.1.x
bamboo_agentWorkingDirectory=/home/bamboo/xml-data/build-dir
bamboo_capability_system_git_executable=/usr/bin/git
bamboo_planRepository_1_previousRevision=f9a596c544fb6677d822cd78d16987d8e751b729
bamboo_capability_system_builder_phpunit_PHPUnit_3_4=/usr/bin/phpunit
bamboo_repository_git_username=bantu
bamboo_repository_75956235_revision_number=f9a596c544fb6677d822cd78d16987d8e751b729
bamboo_planRepository_branchDisplayName=3.1.x
bamboo_planRepository_1_type=gitv2
bamboo_planRepository_branchName=3.1.x
bamboo_repository_75956235_previous_revision_number=f9a596c544fb6677d822cd78d16987d8e751b729
bamboo_capability_system_jdk_JDK=/usr/lib/jvm/java-6-sun
bamboo_plan_storageTag=PHPBB3-PR
bamboo_planRepository_type=gitv2
bamboo_planRepository_1_username=bantu
bamboo_ManualBuildTriggerReason_userName=Build Robot
bamboo_repository_git_repositoryUrl=https://github.com/phpbb/phpbb.git
bamboo_repository_75956235_git_branch=3.1.x
bamboo_capability_system_builder_ant_Ant=/usr/share/ant
bamboo_repository_75956235_name=phpBB Ascraeus
bamboo_working_directory=/home/bamboo/xml-data/build-dir/PHPBB3-PR-JOB1
bamboo_planKey=PHPBB3-PR
bamboo_planRepository_1_repositoryUrl=https://github.com/phpbb/phpbb.git
bamboo_planRepository_username=bantu
bamboo_capability_local=true
bamboo_capability_system_jdk_JDK_1_6=/usr/lib/jvm/java-6-sun
bamboo_capability_system_jdk_JDK_1_7=/usr/lib/jvm/java-7-openjdk-amd64
bamboo_planRepository_1_branchName=3.1.x
13-Apr-2017 14:27:15 From https://github.com/phpbb/phpbb
13-Apr-2017 14:27:15 * branch            refs/pull/4789/merge -> FETCH_HEAD
13-Apr-2017 14:27:15 Note: checking out 'FETCH_HEAD'.
13-Apr-2017 14:27:15
13-Apr-2017 14:27:15 You are in 'detached HEAD' state. You can look around, make experimental
13-Apr-2017 14:27:15 changes and commit them, and you can discard any commits you make in this
13-Apr-2017 14:27:15 state without impacting any branches by performing another checkout.
13-Apr-2017 14:27:15
13-Apr-2017 14:27:15 If you want to create a new branch to retain commits you create, you may
13-Apr-2017 14:27:15 do so (now or later) by using -b with the checkout command again. Example:
13-Apr-2017 14:27:15
13-Apr-2017 14:27:15   git checkout -b new_branch_name
13-Apr-2017 14:27:15
13-Apr-2017 14:27:15 HEAD is now at 908b509... Merge a62acb8e2117f530f39ae1129cc7d381cae2050c into fba85954212019dd5f2e4ccbf884de87fbe3c19b
13-Apr-2017 14:27:15 Finished task 'Fetch PR' with result: Success
13-Apr-2017 14:27:15 Skipping execution of task 'Prepare directory' as it is disabled
13-Apr-2017 14:27:15
Substituting variable: ${bamboo.working.directory} with /home/bamboo/xml-data/build-dir/PHPBB3-PR-JOB1
13-Apr-2017 14:27:15 Starting task 'Prepare directory' of type 'com.atlassian.bamboo.plugins.bamboo-docker-plugin:task.docker.cli'
13-Apr-2017 14:27:15 Running image name (phpbb:php-5.6)
13-Apr-2017 14:27:15
Beginning to execute external process for build 'phpBB3 - Pull Requests - Build and Test Job #6976 (PHPBB3-PR-JOB1-6976)'
... running command line:
/usr/bin/docker run --volume /home/bamboo/xml-data/build-dir/PHPBB3-PR-JOB1:/data --workdir /data/phpBB --rm -e HOME=/home/bamboo -u=991 phpbb:php-5.6 /bin/bash -c php ../composer.phar install --dev; cd ../build; ../phpBB/vendor/bin/phing clean prepare
... in: /home/bamboo/xml-data/build-dir/PHPBB3-PR-JOB1
... using extra environment variables:
bamboo_planRepository_1_branch=3.1.x
bamboo_planRepository_1_branchDisplayName=3.1.x
bamboo_repository_revision_number=f9a596c544fb6677d822cd78d16987d8e751b729
bamboo_PRref=master
bamboo_resultsUrl=https://bamboo.phpbb.com/browse/PHPBB3-PR-JOB1-6976
bamboo_capability_system_builder_command_Git=/usr/bin/git
bamboo_repository_75956235_git_username=bantu
bamboo_planRepository_1_name=phpBB Ascraeus
bamboo_build_working_directory=/home/bamboo/xml-data/build-dir/PHPBB3-PR-JOB1
bamboo_buildKey=PHPBB3-PR-JOB1
bamboo_capability_phpbb_tests=true
bamboo_shortPlanName=Pull Requests
bamboo_capability_system_builder_command_fop=/usr/bin/fop
bamboo_capability_dbms_sqlite_2=true
bamboo_planRepository_name=phpBB Ascraeus
bamboo_PRnumber=4789
bamboo_buildNumber=6976
bamboo_repository_75956235_git_repositoryUrl=https://github.com/phpbb/phpbb.git
bamboo_capability_system_builder_phpunit_PHPUnit=/usr/bin/phpunit
bamboo_shortJobName=Build and Test Job
bamboo_buildResultsUrl=https://bamboo.phpbb.com/browse/PHPBB3-PR-JOB1-6976
bamboo_repository_75956235_branch_name=3.1.x
bamboo_planRepository_repositoryUrl=https://github.com/phpbb/phpbb.git
bamboo_agentId=131073
bamboo_planName=phpBB3 - Pull Requests
bamboo_build_commandline_com_atlassian_bamboo_plugins_scripttask_task_builder_script_7=/bin/sh /home/bamboo/temp/PHPBB3-PR-JOB1-6976-ScriptBuildTask-2540851502768520956.sh
bamboo_shortPlanKey=PR
bamboo_shortJobKey=JOB1
bamboo_capability_dbms_mysql_55=true
bamboo_capability_system_jdk_JDK_1_7_0_65=/usr/lib/jvm/java-7-openjdk-amd64
bamboo_planRepository_revision=f9a596c544fb6677d822cd78d16987d8e751b729
bamboo_repository_previous_revision_number=f9a596c544fb6677d822cd78d16987d8e751b729
bamboo_buildTimeStamp=2017-04-13T14:27:10.520Z
bamboo_planRepository_previousRevision=f9a596c544fb6677d822cd78d16987d8e751b729
bamboo_capability_system_builder_mvn2_Maven_2=/usr/share/maven2
bamboo_capability_system_jdk_JDK_1_6_0_16=/usr/lib/jvm/java-6-sun-1.6.0.16
bamboo_build_commandline_com_atlassian_bamboo_plugins_scripttask_task_builder_script_4=/bin/sh /home/bamboo/temp/PHPBB3-PR-JOB1-6976-ScriptBuildTask-6388490789464179505.sh
bamboo_buildResultKey=PHPBB3-PR-JOB1-6976
bamboo_repository_git_branch=3.1.x
bamboo_repository_branch_name=3.1.x
bamboo_buildPlanName=phpBB3 - Pull Requests - Build and Test Job
bamboo_planRepository_1_revision=f9a596c544fb6677d822cd78d16987d8e751b729
bamboo_repository_name=phpBB Ascraeus
bamboo_capability_system_docker_executable=/usr/bin/docker
bamboo_planRepository_branch=3.1.x
bamboo_agentWorkingDirectory=/home/bamboo/xml-data/build-dir
bamboo_capability_system_git_executable=/usr/bin/git
bamboo_planRepository_1_previousRevision=f9a596c544fb6677d822cd78d16987d8e751b729
bamboo_capability_system_builder_phpunit_PHPUnit_3_4=/usr/bin/phpunit
bamboo_repository_git_username=bantu
bamboo_repository_75956235_revision_number=f9a596c544fb6677d822cd78d16987d8e751b729
bamboo_planRepository_branchDisplayName=3.1.x
bamboo_planRepository_1_type=gitv2
bamboo_planRepository_branchName=3.1.x
bamboo_repository_75956235_previous_revision_number=f9a596c544fb6677d822cd78d16987d8e751b729
bamboo_capability_system_jdk_JDK=/usr/lib/jvm/java-6-sun
bamboo_plan_storageTag=PHPBB3-PR
bamboo_planRepository_type=gitv2
bamboo_planRepository_1_username=bantu
bamboo_ManualBuildTriggerReason_userName=Build Robot
bamboo_repository_git_repositoryUrl=https://github.com/phpbb/phpbb.git
bamboo_repository_75956235_git_branch=3.1.x
bamboo_capability_system_builder_ant_Ant=/usr/share/ant
bamboo_repository_75956235_name=phpBB Ascraeus
bamboo_working_directory=/home/bamboo/xml-data/build-dir/PHPBB3-PR-JOB1
bamboo_planKey=PHPBB3-PR
bamboo_planRepository_1_repositoryUrl=https://github.com/phpbb/phpbb.git
bamboo_planRepository_username=bantu
bamboo_capability_local=true
bamboo_capability_system_jdk_JDK_1_6=/usr/lib/jvm/java-6-sun
bamboo_capability_system_jdk_JDK_1_7=/usr/lib/jvm/java-7-openjdk-amd64
bamboo_planRepository_1_branchName=3.1.x
13-Apr-2017 14:27:15 You are running composer with xdebug enabled. This has a major impact on runtime performance. See https://getcomposer.org/xdebug
13-Apr-2017 14:27:15 You are using the deprecated option "dev". Dev packages are installed by default now.
13-Apr-2017 14:27:15 Cannot create cache directory /home/bamboo/.composer/cache/repo/https---packagist.org/, or directory is not writable. Proceeding without cache
13-Apr-2017 14:27:15 Cannot create cache directory /home/bamboo/.composer/cache/files/, or directory is not writable. Proceeding without cache
13-Apr-2017 14:27:15 Loading composer repositories with package information
13-Apr-2017 14:27:15 Installing dependencies (including require-dev) from lock file
13-Apr-2017 14:27:16   - Installing bantu/ini-get-wrapper (v1.0.1)
13-Apr-2017 14:27:17     Downloading: Connecting...    Downloading: 0%               Downloading: 100%    Downloading: 100%
13-Apr-2017 14:27:17
13-Apr-2017 14:27:17   - Installing google/recaptcha (1.1.2)
13-Apr-2017 14:27:19     Downloading: Connecting...    Downloading: 0%               Downloading: 30%    Downloading: 55%    Downloading: 65%    Downloading: 70%    Downloading: 95%    Downloading: 100%    Downloading: 100%
13-Apr-2017 14:27:19
13-Apr-2017 14:27:19   - Installing guzzlehttp/promises (1.3.0)
13-Apr-2017 14:27:20     Downloading: Connecting...    Downloading: 0%               Downloading: 15%    Downloading: 35%    Downloading: 50%    Downloading: 75%    Downloading: 90%    Downloading: 100%    Downloading: 100%
13-Apr-2017 14:27:20
13-Apr-2017 14:27:20   - Installing psr/http-message (1.0.1)
13-Apr-2017 14:27:21     Downloading: Connecting...    Downloading: 0%               Downloading: 50%    Downloading: 100%
13-Apr-2017 14:27:21
13-Apr-2017 14:27:21   - Installing guzzlehttp/psr7 (1.3.1)
13-Apr-2017 14:27:22     Downloading: Connecting...    Downloading: 0%               Downloading: 5%    Downloading: 15%    Downloading: 20%    Downloading: 35%    Downloading: 40%    Downloading: 55%    Downloading: 60%    Downloading: 75%    Downloading: 80%    Downloading: 95%    Downloading: 100%
13-Apr-2017 14:27:22
13-Apr-2017 14:27:22   - Installing lusitanian/oauth (v0.8.9)
13-Apr-2017 14:27:23     Downloading: Connecting...    Downloading: 0%               Downloading: 5%    Downloading: 10%    Downloading: 15%    Downloading: 20%    Downloading: 25%    Downloading: 30%    Downloading: 35%    Downloading: 40%    Downloading: 45%    Downloading: 50%    Downloading: 55%    Downloading: 60%    Downloading: 65%    Downloading: 70%    Downloading: 75%    Downloading: 80%    Downloading: 85%    Downloading: 90%    Downloading: 95%    Downloading: 100%    Downloading: 100%
13-Apr-2017 14:27:23
13-Apr-2017 14:27:23   - Installing marc1706/fast-image-size (v1.1.2)
13-Apr-2017 14:27:24     Downloading: Connecting...    Downloading: 100%         
13-Apr-2017 14:27:24
13-Apr-2017 14:27:24   - Installing paragonie/random_compat (v1.4.1)
13-Apr-2017 14:27:25     Downloading: Connecting...    Downloading: 0%               Downloading: 20%    Downloading: 35%    Downloading: 60%    Downloading: 80%    Downloading: 95%    Downloading: 100%    Downloading: 100%
13-Apr-2017 14:27:25
13-Apr-2017 14:27:25   - Installing patchwork/utf8 (v1.3.1)
13-Apr-2017 14:27:27     Downloading: Connecting...    Downloading: 0%               Downloading: 5%    Downloading: 10%    Downloading: 15%    Downloading: 20%    Downloading: 25%    Downloading: 30%    Downloading: 35%    Downloading: 40%    Downloading: 45%    Downloading: 50%    Downloading: 55%    Downloading: 60%    Downloading: 65%    Downloading: 70%    Downloading: 75%    Downloading: 80%    Downloading: 85%    Downloading: 90%    Downloading: 95%    Downloading: 100%    Downloading: 100%
13-Apr-2017 14:27:27
13-Apr-2017 14:27:27   - Installing s9e/text-formatter (0.9.1)
13-Apr-2017 14:27:28     Downloading: Connecting...    Downloading: 100%         
13-Apr-2017 14:27:28
13-Apr-2017 14:27:28   - Installing symfony/filesystem (v3.2.0)
13-Apr-2017 14:27:29     Downloading: Connecting...    Downloading: 0%               Downloading: 35%    Downloading: 40%    Downloading: 75%    Downloading: 95%    Downloading: 100%    Downloading: 100%
13-Apr-2017 14:27:29
13-Apr-2017 14:27:29   - Installing symfony/config (v3.2.0)
13-Apr-2017 14:27:30     Downloading: Connecting...    Downloading: 0%               Downloading: 5%    Downloading: 15%    Downloading: 20%    Downloading: 25%    Downloading: 35%    Downloading: 40%    Downloading: 45%    Downloading: 55%    Downloading: 60%    Downloading: 65%    Downloading: 75%    Downloading: 80%    Downloading: 85%    Downloading: 95%    Downloading: 100%    Downloading: 100%
13-Apr-2017 14:27:31
13-Apr-2017 14:27:31   - Installing symfony/finder (v3.2.0)
13-Apr-2017 14:27:32     Downloading: Connecting...    Downloading: 0%               Downloading: 5%    Downloading: 10%    Downloading: 15%    Downloading: 80%    Downloading: 85%    Downloading: 90%    Downloading: 95%    Downloading: 100%    Downloading: 100%
13-Apr-2017 14:27:32
13-Apr-2017 14:27:32   - Installing symfony/polyfill-mbstring (v1.3.0)
13-Apr-2017 14:27:33     Downloading: Connecting...    Downloading: 0%               Downloading: 35%    Downloading: 70%    Downloading: 100%    Downloading: 100%
13-Apr-2017 14:27:33
13-Apr-2017 14:27:33   - Installing symfony/http-foundation (v3.2.0)
13-Apr-2017 14:27:34     Downloading: Connecting...    Downloading: 0%               Downloading: 5%    Downloading: 10%    Downloading: 15%    Downloading: 20%    Downloading: 25%    Downloading: 30%    Downloading: 35%    Downloading: 40%    Downloading: 45%    Downloading: 50%    Downloading: 55%    Downloading: 60%    Downloading: 65%    Downloading: 70%    Downloading: 75%    Downloading: 80%    Downloading: 85%    Downloading: 90%    Downloading: 95%    Downloading: 100%    Downloading: 100%
13-Apr-2017 14:27:34
13-Apr-2017 14:27:34   - Installing symfony/event-dispatcher (v3.2.0)
13-Apr-2017 14:27:35     Downloading: Connecting...    Downloading: 0%               Downloading: 5%    Downloading: 10%    Downloading: 15%    Downloading: 100%
13-Apr-2017 14:27:35
13-Apr-2017 14:27:35   - Installing psr/log (1.0.2)
13-Apr-2017 14:27:36     Downloading: Connecting...    Downloading: 0%               Downloading: 15%    Downloading: 100%    Downloading: 100%
13-Apr-2017 14:27:36
13-Apr-2017 14:27:36   - Installing symfony/debug (v3.2.0)
13-Apr-2017 14:27:37     Downloading: Connecting...    Downloading: 0%               Downloading: 5%    Downloading: 30%    Downloading: 50%    Downloading: 55%    Downloading: 60%    Downloading: 80%    Downloading: 85%    Downloading: 90%    Downloading: 100%
13-Apr-2017 14:27:37
13-Apr-2017 14:27:37   - Installing symfony/http-kernel (v3.2.0)
13-Apr-2017 14:27:38     Downloading: Connecting...    Downloading: 0%               Downloading: 5%    Downloading: 10%    Downloading: 15%    Downloading: 20%    Downloading: 25%    Downloading: 30%    Downloading: 35%    Downloading: 40%    Downloading: 45%    Downloading: 50%    Downloading: 55%    Downloading: 60%    Downloading: 65%    Downloading: 70%    Downloading: 75%    Downloading: 80%    Downloading: 85%    Downloading: 90%    Downloading: 95%    Downloading: 100%    Downloading: 100%
13-Apr-2017 14:27:38
13-Apr-2017 14:27:38   - Installing symfony/dependency-injection (v3.2.0)
13-Apr-2017 14:27:39     Downloading: Connecting...    Downloading: 0%               Downloading: 5%    Downloading: 10%    Downloading: 15%    Downloading: 20%    Downloading: 25%    Downloading: 30%    Downloading: 35%    Downloading: 40%    Downloading: 45%    Downloading: 50%    Downloading: 55%    Downloading: 60%    Downloading: 65%    Downloading: 70%    Downloading: 75%    Downloading: 80%    Downloading: 85%    Downloading: 90%    Downloading: 95%    Downloading: 100%    Downloading: 100%
13-Apr-2017 14:27:39
13-Apr-2017 14:27:39   - Installing zendframework/zend-eventmanager (3.0.1)
13-Apr-2017 14:27:41     Downloading: Connecting...    Downloading: 0%               Downloading: 15%    Downloading: 30%    Downloading: 45%    Downloading: 60%    Downloading: 75%    Downloading: 100%
13-Apr-2017 14:27:41
13-Apr-2017 14:27:41   - Installing zendframework/zend-code (2.6.3)
13-Apr-2017 14:27:42     Downloading: Connecting...    Downloading: 0%               Downloading: 5%    Downloading: 10%    Downloading: 15%    Downloading: 20%    Downloading: 25%    Downloading: 30%    Downloading: 35%    Downloading: 40%    Downloading: 45%    Downloading: 50%    Downloading: 55%    Downloading: 60%    Downloading: 65%    Downloading: 70%    Downloading: 75%    Downloading: 80%    Downloading: 90%    Downloading: 95%    Downloading: 100%
13-Apr-2017 14:27:42
13-Apr-2017 14:27:42   - Installing ocramius/proxy-manager (1.0.2)
13-Apr-2017 14:27:43     Downloading: Connecting...    Downloading: 0%               Downloading: 5%    Downloading: 10%    Downloading: 15%    Downloading: 20%    Downloading: 25%    Downloading: 30%    Downloading: 35%    Downloading: 40%    Downloading: 45%    Downloading: 50%    Downloading: 55%    Downloading: 60%    Downloading: 70%    Downloading: 75%    Downloading: 80%    Downloading: 85%    Downloading: 90%    Downloading: 95%    Downloading: 100%    Downloading: 100%
13-Apr-2017 14:27:43
13-Apr-2017 14:27:43   - Installing symfony/proxy-manager-bridge (v3.2.0)
13-Apr-2017 14:27:44     Downloading: Connecting...    Downloading: 100%         
13-Apr-2017 14:27:44
13-Apr-2017 14:27:44   - Installing symfony/routing (v3.2.0)
13-Apr-2017 14:27:46     Downloading: Connecting...    Downloading: 100%         
13-Apr-2017 14:27:46
13-Apr-2017 14:27:46   - Installing twig/twig (v1.24.2)
13-Apr-2017 14:27:47     Downloading: Connecting...    Downloading: 0%               Downloading: 5%    Downloading: 10%    Downloading: 15%    Downloading: 20%    Downloading: 25%    Downloading: 30%    Downloading: 35%    Downloading: 40%    Downloading: 45%    Downloading: 50%    Downloading: 55%    Downloading: 60%    Downloading: 65%    Downloading: 70%    Downloading: 75%    Downloading: 80%    Downloading: 85%    Downloading: 90%    Downloading: 95%    Downloading: 100%    Downloading: 100%
13-Apr-2017 14:27:47
13-Apr-2017 14:27:47   - Installing symfony/twig-bridge (v3.1.4)
13-Apr-2017 14:27:48     Downloading: Connecting...    Downloading: 0%               Downloading: 10%    Downloading: 15%    Downloading: 25%    Downloading: 30%    Downloading: 40%    Downloading: 45%    Downloading: 55%    Downloading: 65%    Downloading: 70%    Downloading: 75%    Downloading: 80%    Downloading: 90%    Downloading: 100%    Downloading: 100%
13-Apr-2017 14:27:48
13-Apr-2017 14:27:48   - Installing symfony/dom-crawler (v3.2.0)
13-Apr-2017 14:27:49     Downloading: Connecting...    Downloading: 100%         
13-Apr-2017 14:27:49
13-Apr-2017 14:27:49   - Installing symfony/css-selector (v3.2.0)
13-Apr-2017 14:27:51     Downloading: Connecting...    Downloading: 0%               Downloading: 5%    Downloading: 10%    Downloading: 15%    Downloading: 20%    Downloading: 65%    Downloading: 70%    Downloading: 75%    Downloading: 80%    Downloading: 85%    Downloading: 90%    Downloading: 95%    Downloading: 100%
13-Apr-2017 14:27:51
13-Apr-2017 14:27:51   - Installing symfony/browser-kit (v3.2.0)
13-Apr-2017 14:27:52     Downloading: Connecting...    Downloading: 0%               Downloading: 50%    Downloading: 80%    Downloading: 85%    Downloading: 100%    Downloading: 100%
13-Apr-2017 14:27:52
13-Apr-2017 14:27:52   - Installing guzzlehttp/guzzle (6.2.2)
13-Apr-2017 14:27:53     Downloading: Connecting...    Downloading: 0%               Downloading: 5%    Downloading: 10%    Downloading: 15%    Downloading: 20%    Downloading: 25%    Downloading: 30%    Downloading: 40%    Downloading: 45%    Downloading: 55%    Downloading: 60%    Downloading: 70%    Downloading: 75%    Downloading: 80%    Downloading: 85%    Downloading: 100%    Downloading: 100%
13-Apr-2017 14:27:53
13-Apr-2017 14:27:53   - Installing fabpot/goutte (v3.2.0)
13-Apr-2017 14:27:54     Downloading: Connecting...    Downloading: 0%               Downloading: 70%    Downloading: 100%    Downloading: 100%
13-Apr-2017 14:27:54
13-Apr-2017 14:27:54   - Installing facebook/webdriver (1.2.0)
13-Apr-2017 14:27:55     Downloading: Connecting...    Downloading: 0%               Downloading: 5%    Downloading: 10%    Downloading: 15%    Downloading: 20%    Downloading: 25%    Downloading: 30%    Downloading: 35%    Downloading: 40%    Downloading: 45%    Downloading: 50%    Downloading: 55%    Downloading: 60%    Downloading: 65%    Downloading: 70%    Downloading: 75%    Downloading: 80%    Downloading: 85%    Downloading: 90%    Downloading: 95%    Downloading: 100%
13-Apr-2017 14:27:55
13-Apr-2017 14:27:55   - Installing symfony/process (v3.2.0)
13-Apr-2017 14:27:56     Downloading: Connecting...    Downloading: 0%               Downloading: 20%    Downloading: 35%    Downloading: 50%    Downloading: 65%    Downloading: 70%    Downloading: 80%    Downloading: 95%    Downloading: 100%    Downloading: 100%
13-Apr-2017 14:27:56
13-Apr-2017 14:27:56   - Installing symfony/console (v3.2.0)
13-Apr-2017 14:27:58     Downloading: Connecting...    Downloading: 0%               Downloading: 5%    Downloading: 10%    Downloading: 15%    Downloading: 20%    Downloading: 25%    Downloading: 30%    Downloading: 35%    Downloading: 40%    Downloading: 45%    Downloading: 50%    Downloading: 55%    Downloading: 60%    Downloading: 65%    Downloading: 70%    Downloading: 75%    Downloading: 80%    Downloading: 85%    Downloading: 90%    Downloading: 95%    Downloading: 100%    Downloading: 100%
13-Apr-2017 14:27:58
13-Apr-2017 14:27:58   - Installing laravel/homestead (v4.0.5)
13-Apr-2017 14:27:59     Downloading: Connecting...    Downloading: 0%               Downloading: 5%    Downloading: 10%    Downloading: 100%
13-Apr-2017 14:27:59
13-Apr-2017 14:27:59   - Installing phing/phing (2.4.14)
13-Apr-2017 14:28:01     Downloading: Connecting...    Downloading: 100%         
13-Apr-2017 14:28:01
13-Apr-2017 14:28:01   - Installing phpdocumentor/reflection-docblock (2.0.4)
13-Apr-2017 14:28:02     Downloading: Connecting...    Downloading: 0%               Downloading: 20%    Downloading: 25%    Downloading: 30%    Downloading: 35%    Downloading: 50%    Downloading: 55%    Downloading: 70%    Downloading: 85%    Downloading: 90%    Downloading: 100%
13-Apr-2017 14:28:02
13-Apr-2017 14:28:02   - Installing phpdocumentor/reflection-common (1.0)
13-Apr-2017 14:28:03     Downloading: Connecting...    Downloading: 0%               Downloading: 65%    Downloading: 100%
13-Apr-2017 14:28:03
13-Apr-2017 14:28:03   - Installing phpdocumentor/type-resolver (0.2.1)
13-Apr-2017 14:28:04     Downloading: Connecting...    Downloading: 0%               Downloading: 20%    Downloading: 35%    Downloading: 55%    Downloading: 75%    Downloading: 100%
13-Apr-2017 14:28:04
13-Apr-2017 14:28:04   - Installing symfony/yaml (v3.2.0)
13-Apr-2017 14:28:05     Downloading: Connecting...    Downloading: 0%               Downloading: 10%    Downloading: 15%    Downloading: 25%    Downloading: 35%    Downloading: 50%    Downloading: 60%    Downloading: 70%    Downloading: 75%    Downloading: 85%    Downloading: 95%    Downloading: 100%    Downloading: 100%
13-Apr-2017 14:28:05
13-Apr-2017 14:28:05   - Installing sebastian/version (1.0.6)
13-Apr-2017 14:28:06     Downloading: Connecting...    Downloading: 0%               Downloading: 100%    Downloading: 100%
13-Apr-2017 14:28:06
13-Apr-2017 14:28:06   - Installing sebastian/global-state (1.1.1)
13-Apr-2017 14:28:07     Downloading: Connecting...    Downloading: 0%               Downloading: 40%    Downloading: 70%    Downloading: 100%    Downloading: 100%
13-Apr-2017 14:28:07
13-Apr-2017 14:28:07   - Installing sebastian/recursion-context (1.0.2)
13-Apr-2017 14:28:08     Downloading: Connecting...    Downloading: 0%               Downloading: 35%    Downloading: 70%    Downloading: 100%    Downloading: 100%
13-Apr-2017 14:28:08
13-Apr-2017 14:28:08   - Installing sebastian/exporter (1.2.2)
13-Apr-2017 14:28:09     Downloading: Connecting...    Downloading: 0%               Downloading: 100%
13-Apr-2017 14:28:09
13-Apr-2017 14:28:09   - Installing sebastian/environment (1.3.8)
13-Apr-2017 14:28:10     Downloading: Connecting...    Downloading: 0%               Downloading: 15%    Downloading: 30%    Downloading: 45%    Downloading: 60%    Downloading: 75%    Downloading: 100%    Downloading: 100%
13-Apr-2017 14:28:10
13-Apr-2017 14:28:10   - Installing sebastian/diff (1.4.1)
13-Apr-2017 14:28:11     Downloading: Connecting...    Downloading: 0%               Downloading: 15%    Downloading: 30%    Downloading: 45%    Downloading: 100%    Downloading: 100%
13-Apr-2017 14:28:11
13-Apr-2017 14:28:11   - Installing sebastian/comparator (1.2.2)
13-Apr-2017 14:28:12     Downloading: Connecting...    Downloading: 0%               Downloading: 10%    Downloading: 20%    Downloading: 30%    Downloading: 40%    Downloading: 45%    Downloading: 55%    Downloading: 65%    Downloading: 75%    Downloading: 85%    Downloading: 95%    Downloading: 100%    Downloading: 100%
13-Apr-2017 14:28:12
13-Apr-2017 14:28:12   - Installing phpunit/php-text-template (1.2.1)
13-Apr-2017 14:28:13     Downloading: Connecting...    Downloading: 0%               Downloading: 35%    Downloading: 100%    Downloading: 100%
13-Apr-2017 14:28:13
13-Apr-2017 14:28:13   - Installing doctrine/instantiator (1.0.5)
13-Apr-2017 14:28:14     Downloading: Connecting...    Downloading: 0%               Downloading: 15%    Downloading: 30%    Downloading: 45%    Downloading: 50%    Downloading: 65%    Downloading: 80%    Downloading: 95%    Downloading: 100%    Downloading: 100%
13-Apr-2017 14:28:14
13-Apr-2017 14:28:14   - Installing phpunit/phpunit-mock-objects (2.3.8)
13-Apr-2017 14:28:15     Downloading: Connecting...    Downloading: 0%               Downloading: 5%    Downloading: 20%    Downloading: 25%    Downloading: 30%    Downloading: 35%    Downloading: 45%    Downloading: 50%    Downloading: 55%    Downloading: 60%    Downloading: 70%    Downloading: 75%    Downloading: 80%    Downloading: 85%    Downloading: 90%    Downloading: 100%
13-Apr-2017 14:28:15
13-Apr-2017 14:28:15   - Installing phpunit/php-timer (1.0.8)
13-Apr-2017 14:28:16     Downloading: Connecting...    Downloading: 0%               Downloading: 100%    Downloading: 100%
13-Apr-2017 14:28:16
13-Apr-2017 14:28:16   - Installing phpunit/php-file-iterator (1.4.2)
13-Apr-2017 14:28:17     Downloading: Connecting...    Downloading: 0%               Downloading: 20%    Downloading: 40%    Downloading: 60%    Downloading: 100%    Downloading: 100%
13-Apr-2017 14:28:17
13-Apr-2017 14:28:17   - Installing phpunit/php-token-stream (1.4.9)
13-Apr-2017 14:28:18     Downloading: Connecting...    Downloading: 0%               Downloading: 5%    Downloading: 10%    Downloading: 15%    Downloading: 20%    Downloading: 65%    Downloading: 70%    Downloading: 75%    Downloading: 80%    Downloading: 85%    Downloading: 90%    Downloading: 95%    Downloading: 100%    Downloading: 100%
13-Apr-2017 14:28:18
13-Apr-2017 14:28:18   - Installing phpunit/php-code-coverage (2.2.4)
13-Apr-2017 14:28:20     Downloading: Connecting...    Downloading: 0%               Downloading: 5%    Downloading: 10%    Downloading: 15%    Downloading: 20%    Downloading: 25%    Downloading: 30%    Downloading: 35%    Downloading: 40%    Downloading: 45%    Downloading: 50%    Downloading: 55%    Downloading: 60%    Downloading: 65%    Downloading: 75%    Downloading: 85%    Downloading: 90%    Downloading: 100%    Downloading: 100%
13-Apr-2017 14:28:20
13-Apr-2017 14:28:20   - Installing phpspec/prophecy (v1.6.2)
13-Apr-2017 14:28:21     Downloading: Connecting...    Downloading: 0%               Downloading: 5%    Downloading: 10%    Downloading: 15%    Downloading: 20%    Downloading: 25%    Downloading: 30%    Downloading: 35%    Downloading: 40%    Downloading: 45%    Downloading: 50%    Downloading: 55%    Downloading: 60%    Downloading: 65%    Downloading: 70%    Downloading: 75%    Downloading: 80%    Downloading: 85%    Downloading: 90%    Downloading: 95%    Downloading: 100%    Downloading: 100%
13-Apr-2017 14:28:21
13-Apr-2017 14:28:21   - Installing phpunit/phpunit (4.8.31)
13-Apr-2017 14:28:22     Downloading: Connecting...    Downloading: 0%               Downloading: 5%    Downloading: 10%    Downloading: 15%    Downloading: 20%    Downloading: 25%    Downloading: 30%    Downloading: 35%    Downloading: 40%    Downloading: 45%    Downloading: 50%    Downloading: 55%    Downloading: 60%    Downloading: 65%    Downloading: 75%    Downloading: 85%    Downloading: 90%    Downloading: 95%    Downloading: 100%    Downloading: 100%
13-Apr-2017 14:28:22
13-Apr-2017 14:28:22   - Installing phpunit/dbunit (2.0.3)
13-Apr-2017 14:28:24     Downloading: Connecting...    Downloading: 0%               Downloading: 5%    Downloading: 10%    Downloading: 15%    Downloading: 20%    Downloading: 25%    Downloading: 30%    Downloading: 35%    Downloading: 40%    Downloading: 45%    Downloading: 50%    Downloading: 55%    Downloading: 60%    Downloading: 65%    Downloading: 70%    Downloading: 75%    Downloading: 80%    Downloading: 85%    Downloading: 90%    Downloading: 95%    Downloading: 100%    Downloading: 100%
13-Apr-2017 14:28:24
13-Apr-2017 14:28:24   - Installing squizlabs/php_codesniffer (2.7.1)
13-Apr-2017 14:28:25     Downloading: Connecting...    Downloading: 0%               Downloading: 5%    Downloading: 10%    Downloading: 15%    Downloading: 20%    Downloading: 25%    Downloading: 30%    Downloading: 35%    Downloading: 40%    Downloading: 45%    Downloading: 50%    Downloading: 55%    Downloading: 60%    Downloading: 65%    Downloading: 70%    Downloading: 75%    Downloading: 80%    Downloading: 85%    Downloading: 90%    Downloading: 95%    Downloading: 100%    Downloading: 100%
13-Apr-2017 14:28:25
13-Apr-2017 14:28:25   - Installing webmozart/assert (1.2.0)
13-Apr-2017 14:28:27     Downloading: Connecting...    Downloading: 0%               Downloading: 55%    Downloading: 100%    Downloading: 100%
13-Apr-2017 14:28:27
13-Apr-2017 14:28:28 lusitanian/oauth suggests installing predis/predis (Allows using the Redis storage backend.)
13-Apr-2017 14:28:28 paragonie/random_compat suggests installing ext-libsodium (Provides a modern crypto API that can be used to generate random bytes.)
13-Apr-2017 14:28:28 patchwork/utf8 suggests installing ext-intl (Use Intl for best performance)
13-Apr-2017 14:28:28 patchwork/utf8 suggests installing ext-wfio (Use WFIO for UTF-8 filesystem access on Windows)
13-Apr-2017 14:28:28 s9e/text-formatter suggests installing ext-intl (Allows international URLs to be accepted by the URL filter)
13-Apr-2017 14:28:28 s9e/text-formatter suggests installing ext-xsl (Enables the XSLT renderer)
13-Apr-2017 14:28:28 symfony/http-kernel suggests installing symfony/class-loader ()
13-Apr-2017 14:28:28 symfony/http-kernel suggests installing symfony/var-dumper ()
13-Apr-2017 14:28:28 symfony/dependency-injection suggests installing symfony/expression-language (For using expressions in service container configuration)
13-Apr-2017 14:28:28 zendframework/zend-eventmanager suggests installing container-interop/container-interop (^1.1.0, to use the lazy listeners feature)
13-Apr-2017 14:28:28 zendframework/zend-eventmanager suggests installing zendframework/zend-stdlib (^2.7.3 || ^3.0, to use the FilterChain feature)
13-Apr-2017 14:28:28 zendframework/zend-code suggests installing doctrine/annotations (Doctrine\Common\Annotations >=1.0 for annotation features)
13-Apr-2017 14:28:28 zendframework/zend-code suggests installing zendframework/zend-stdlib (Zend\Stdlib component)
13-Apr-2017 14:28:28 ocramius/proxy-manager suggests installing ocramius/generated-hydrator (To have very fast object to array to object conversion for ghost objects)
13-Apr-2017 14:28:28 ocramius/proxy-manager suggests installing zendframework/zend-json (To have the JsonRpc adapter (Remote Object feature))
13-Apr-2017 14:28:28 ocramius/proxy-manager suggests installing zendframework/zend-soap (To have the Soap adapter (Remote Object feature))
13-Apr-2017 14:28:28 ocramius/proxy-manager suggests installing zendframework/zend-stdlib (To use the hydrator proxy)
13-Apr-2017 14:28:28 ocramius/proxy-manager suggests installing zendframework/zend-xmlrpc (To have the XmlRpc adapter (Remote Object feature))
13-Apr-2017 14:28:28 symfony/routing suggests installing doctrine/annotations (For using the annotation loader)
13-Apr-2017 14:28:28 symfony/routing suggests installing symfony/expression-language (For using expression matching)
13-Apr-2017 14:28:28 symfony/twig-bridge suggests installing symfony/asset (For using the AssetExtension)
13-Apr-2017 14:28:28 symfony/twig-bridge suggests installing symfony/expression-language (For using the ExpressionExtension)
13-Apr-2017 14:28:28 symfony/twig-bridge suggests installing symfony/form (For using the FormExtension)
13-Apr-2017 14:28:28 symfony/twig-bridge suggests installing symfony/security (For using the SecurityExtension)
13-Apr-2017 14:28:28 symfony/twig-bridge suggests installing symfony/stopwatch (For using the StopwatchExtension)
13-Apr-2017 14:28:28 symfony/twig-bridge suggests installing symfony/templating (For using the TwigEngine)
13-Apr-2017 14:28:28 symfony/twig-bridge suggests installing symfony/translation (For using the TranslationExtension)
13-Apr-2017 14:28:28 symfony/twig-bridge suggests installing symfony/var-dumper (For using the DumpExtension)
13-Apr-2017 14:28:28 facebook/webdriver suggests installing phpdocumentor/phpdocumentor (2.*)
13-Apr-2017 14:28:28 phpdocumentor/reflection-docblock suggests installing dflydev/markdown (~1.0)
13-Apr-2017 14:28:28 phpdocumentor/reflection-docblock suggests installing erusev/parsedown (~1.0)
13-Apr-2017 14:28:28 sebastian/global-state suggests installing ext-uopz (*)
13-Apr-2017 14:28:28 phpunit/phpunit-mock-objects suggests installing ext-soap (*)
13-Apr-2017 14:28:28 phpunit/phpunit suggests installing phpunit/php-invoker (~1.1)
13-Apr-2017 14:28:28 Generating autoload files
13-Apr-2017 14:28:29 Buildfile: /data/build/build.xml
13-Apr-2017 14:28:29
13-Apr-2017 14:28:29 phpBB > clean:
13-Apr-2017 14:28:29
13-Apr-2017 14:28:29    [delete] Directory /data/build/logs does not exist or is not a directory.
13-Apr-2017 14:28:29    [delete] Directory /data/build/api does not exist or is not a directory.
13-Apr-2017 14:28:29    [delete] Directory /data/build/codebrowser does not exist or is not a directory.
13-Apr-2017 14:28:29    [delete] Directory /data/build/coverage does not exist or is not a directory.
13-Apr-2017 14:28:29    [delete] Directory /data/build/cpd does not exist or is not a directory.
13-Apr-2017 14:28:29    [delete] Directory /data/build/dependencies does not exist or is not a directory.
13-Apr-2017 14:28:29    [delete] Directory /data/build/new_version does not exist or is not a directory.
13-Apr-2017 14:28:29    [delete] Directory /data/build/old_versions does not exist or is not a directory.
13-Apr-2017 14:28:29    [delete] Directory /data/build/save does not exist or is not a directory.
13-Apr-2017 14:28:29
13-Apr-2017 14:28:29 phpBB > prepare:
13-Apr-2017 14:28:29
13-Apr-2017 14:28:29     [mkdir] Created dir: /data/build/logs
13-Apr-2017 14:28:29     [mkdir] Created dir: /data/build/api
13-Apr-2017 14:28:29     [mkdir] Created dir: /data/build/codebrowser
13-Apr-2017 14:28:29     [mkdir] Created dir: /data/build/coverage
13-Apr-2017 14:28:29     [mkdir] Created dir: /data/build/cpd
13-Apr-2017 14:28:29     [mkdir] Created dir: /data/build/dependencies
13-Apr-2017 14:28:29     [mkdir] Created dir: /data/build/new_version
13-Apr-2017 14:28:29     [mkdir] Created dir: /data/build/new_version/files
13-Apr-2017 14:28:29     [mkdir] Created dir: /data/build/new_version/patches
13-Apr-2017 14:28:29     [mkdir] Created dir: /data/build/new_version/release_files
13-Apr-2017 14:28:29     [mkdir] Created dir: /data/build/new_version/update
13-Apr-2017 14:28:29     [mkdir] Created dir: /data/build/old_versions
13-Apr-2017 14:28:29     [mkdir] Created dir: /data/build/save
13-Apr-2017 14:28:29
13-Apr-2017 14:28:29 BUILD FINISHED
13-Apr-2017 14:28:29
13-Apr-2017 14:28:29 Total time: 0.1135 seconds
13-Apr-2017 14:28:29
13-Apr-2017 14:28:29 Finished task 'Prepare directory' with result: Success
13-Apr-2017 14:28:29 Skipping execution of task 'Run sniffs' as it is disabled
13-Apr-2017 14:28:29
Substituting variable: ${bamboo.working.directory} with /home/bamboo/xml-data/build-dir/PHPBB3-PR-JOB1
13-Apr-2017 14:28:29 Starting task 'Run sniffs' of type 'com.atlassian.bamboo.plugins.bamboo-docker-plugin:task.docker.cli'
13-Apr-2017 14:28:29 Running image name (phpbb:php-5.6)
13-Apr-2017 14:28:29
Beginning to execute external process for build 'phpBB3 - Pull Requests - Build and Test Job #6976 (PHPBB3-PR-JOB1-6976)'
... running command line:
/usr/bin/docker run --volume /home/bamboo/xml-data/build-dir/PHPBB3-PR-JOB1:/data --workdir /data/build --rm -u=991 phpbb:php-5.6 ../phpBB/vendor/bin/phing sniff
... in: /home/bamboo/xml-data/build-dir/PHPBB3-PR-JOB1
... using extra environment variables:
bamboo_planRepository_1_branch=3.1.x
bamboo_planRepository_1_branchDisplayName=3.1.x
bamboo_repository_revision_number=f9a596c544fb6677d822cd78d16987d8e751b729
bamboo_PRref=master
bamboo_resultsUrl=https://bamboo.phpbb.com/browse/PHPBB3-PR-JOB1-6976
bamboo_capability_system_builder_command_Git=/usr/bin/git
bamboo_repository_75956235_git_username=bantu
bamboo_planRepository_1_name=phpBB Ascraeus
bamboo_build_working_directory=/home/bamboo/xml-data/build-dir/PHPBB3-PR-JOB1
bamboo_buildKey=PHPBB3-PR-JOB1
bamboo_capability_phpbb_tests=true
bamboo_shortPlanName=Pull Requests
bamboo_capability_system_builder_command_fop=/usr/bin/fop
bamboo_capability_dbms_sqlite_2=true
bamboo_planRepository_name=phpBB Ascraeus
bamboo_PRnumber=4789
bamboo_buildNumber=6976
bamboo_repository_75956235_git_repositoryUrl=https://github.com/phpbb/phpbb.git
bamboo_capability_system_builder_phpunit_PHPUnit=/usr/bin/phpunit
bamboo_shortJobName=Build and Test Job
bamboo_buildResultsUrl=https://bamboo.phpbb.com/browse/PHPBB3-PR-JOB1-6976
bamboo_repository_75956235_branch_name=3.1.x
bamboo_planRepository_repositoryUrl=https://github.com/phpbb/phpbb.git
bamboo_agentId=131073
bamboo_planName=phpBB3 - Pull Requests
bamboo_build_commandline_com_atlassian_bamboo_plugins_scripttask_task_builder_script_7=/bin/sh /home/bamboo/temp/PHPBB3-PR-JOB1-6976-ScriptBuildTask-2540851502768520956.sh
bamboo_shortPlanKey=PR
bamboo_shortJobKey=JOB1
bamboo_capability_dbms_mysql_55=true
bamboo_capability_system_jdk_JDK_1_7_0_65=/usr/lib/jvm/java-7-openjdk-amd64
bamboo_planRepository_revision=f9a596c544fb6677d822cd78d16987d8e751b729
bamboo_repository_previous_revision_number=f9a596c544fb6677d822cd78d16987d8e751b729
bamboo_buildTimeStamp=2017-04-13T14:27:10.520Z
bamboo_planRepository_previousRevision=f9a596c544fb6677d822cd78d16987d8e751b729
bamboo_capability_system_builder_mvn2_Maven_2=/usr/share/maven2
bamboo_capability_system_jdk_JDK_1_6_0_16=/usr/lib/jvm/java-6-sun-1.6.0.16
bamboo_build_commandline_com_atlassian_bamboo_plugins_scripttask_task_builder_script_4=/bin/sh /home/bamboo/temp/PHPBB3-PR-JOB1-6976-ScriptBuildTask-6388490789464179505.sh
bamboo_buildResultKey=PHPBB3-PR-JOB1-6976
bamboo_repository_git_branch=3.1.x
bamboo_repository_branch_name=3.1.x
bamboo_buildPlanName=phpBB3 - Pull Requests - Build and Test Job
bamboo_planRepository_1_revision=f9a596c544fb6677d822cd78d16987d8e751b729
bamboo_repository_name=phpBB Ascraeus
bamboo_capability_system_docker_executable=/usr/bin/docker
bamboo_build_commandline_com_atlassian_bamboo_plugins_bamboo_docker_plugin_task_docker_cli_12=/usr/bin/docker run --volume /home/bamboo/xml-data/build-dir/PHPBB3-PR-JOB1:/data --workdir /data/phpBB --rm -e HOME=/home/bamboo -u=991 phpbb:php-5.6 /bin/bash -c php ../composer.phar install --dev; cd ../build; ../phpBB/vendor/bin/phing clean prepare
bamboo_planRepository_branch=3.1.x
bamboo_agentWorkingDirectory=/home/bamboo/xml-data/build-dir
bamboo_capability_system_git_executable=/usr/bin/git
bamboo_planRepository_1_previousRevision=f9a596c544fb6677d822cd78d16987d8e751b729
bamboo_capability_system_builder_phpunit_PHPUnit_3_4=/usr/bin/phpunit
bamboo_repository_git_username=bantu
bamboo_repository_75956235_revision_number=f9a596c544fb6677d822cd78d16987d8e751b729
bamboo_planRepository_branchDisplayName=3.1.x
bamboo_planRepository_1_type=gitv2
bamboo_planRepository_branchName=3.1.x
bamboo_repository_75956235_previous_revision_number=f9a596c544fb6677d822cd78d16987d8e751b729
bamboo_capability_system_jdk_JDK=/usr/lib/jvm/java-6-sun
bamboo_plan_storageTag=PHPBB3-PR
bamboo_planRepository_type=gitv2
bamboo_planRepository_1_username=bantu
bamboo_ManualBuildTriggerReason_userName=Build Robot
bamboo_repository_git_repositoryUrl=https://github.com/phpbb/phpbb.git
bamboo_repository_75956235_git_branch=3.1.x
bamboo_capability_system_builder_ant_Ant=/usr/share/ant
bamboo_repository_75956235_name=phpBB Ascraeus
bamboo_working_directory=/home/bamboo/xml-data/build-dir/PHPBB3-PR-JOB1
bamboo_planKey=PHPBB3-PR
bamboo_planRepository_1_repositoryUrl=https://github.com/phpbb/phpbb.git
bamboo_planRepository_username=bantu
bamboo_capability_local=true
bamboo_capability_system_jdk_JDK_1_6=/usr/lib/jvm/java-6-sun
bamboo_capability_system_jdk_JDK_1_7=/usr/lib/jvm/java-7-openjdk-amd64
bamboo_planRepository_1_branchName=3.1.x
13-Apr-2017 14:28:29 Buildfile: /data/build/build.xml
13-Apr-2017 14:28:30
13-Apr-2017 14:28:30 phpBB > sniff:
13-Apr-2017 14:28:30
13-Apr-2017 14:28:37 ............................................................  60 / 688 (9%)
13-Apr-2017 14:28:39 ............................................................ 120 / 688 (17%)
13-Apr-2017 14:28:40 ............................................................ 180 / 688 (26%)
13-Apr-2017 14:28:41 ............................................................ 240 / 688 (35%)
13-Apr-2017 14:28:47 ........................E................................... 300 / 688 (44%)
13-Apr-2017 14:28:51 ............................................................ 360 / 688 (52%)
13-Apr-2017 14:28:58 ............................................................ 420 / 688 (61%)
13-Apr-2017 14:29:02 ............................................................ 480 / 688 (70%)
13-Apr-2017 14:29:06 ............................................................ 540 / 688 (78%)
13-Apr-2017 14:29:10 ............................................................ 600 / 688 (87%)
13-Apr-2017 14:29:13 ..........................................................E. 660 / 688 (96%)
13-Apr-2017 14:29:14 ............................
13-Apr-2017 14:29:14
13-Apr-2017 14:29:14
13-Apr-2017 14:29:14 FILE: /data/phpBB/phpbb/console/command/style/install.php
13-Apr-2017 14:29:14 ----------------------------------------------------------------------
13-Apr-2017 14:29:14 FOUND 3 ERRORS AFFECTING 3 LINES
13-Apr-2017 14:29:14 ----------------------------------------------------------------------
13-Apr-2017 14:29:14 48 | ERROR | There should be exactly one space between the keyword and
13-Apr-2017 14:29:14     |       | opening parenthesis
13-Apr-2017 14:29:14     |       | (phpbb.ControlStructures.OpeningParenthesis.NoSpaceBeforeOpeningParenthesis)
13-Apr-2017 14:29:14 50 | ERROR | There should be exactly one space between the keyword and
13-Apr-2017 14:29:14     |       | opening parenthesis
13-Apr-2017 14:29:14     |       | (phpbb.ControlStructures.OpeningParenthesis.NoSpaceBeforeOpeningParenthesis)
13-Apr-2017 14:29:14 58 | ERROR | There should be exactly one space between the keyword and
13-Apr-2017 14:29:14     |       | opening parenthesis
13-Apr-2017 14:29:14     |       | (phpbb.ControlStructures.OpeningParenthesis.NoSpaceBeforeOpeningParenthesis)
13-Apr-2017 14:29:14 ----------------------------------------------------------------------
13-Apr-2017 14:29:14
13-Apr-2017 14:29:14
13-Apr-2017 14:29:14 FILE: /data/phpBB/phpbb/style/manager.php
13-Apr-2017 14:29:14 ----------------------------------------------------------------------
13-Apr-2017 14:29:14 FOUND 8 ERRORS AFFECTING 8 LINES
13-Apr-2017 14:29:14 ----------------------------------------------------------------------
13-Apr-2017 14:29:14   96 | ERROR | There should be exactly one space between the keyword and
13-Apr-2017 14:29:14      |       | opening parenthesis
13-Apr-2017 14:29:14      |       | (phpbb.ControlStructures.OpeningParenthesis.NoSpaceBeforeOpeningParenthesis)
13-Apr-2017 14:29:14   99 | ERROR | There should be exactly one space between the keyword and
13-Apr-2017 14:29:14      |       | opening parenthesis
13-Apr-2017 14:29:14      |       | (phpbb.ControlStructures.OpeningParenthesis.NoSpaceBeforeOpeningParenthesis)
13-Apr-2017 14:29:14 109 | ERROR | There should be exactly one space between the keyword and
13-Apr-2017 14:29:14      |       | opening parenthesis
13-Apr-2017 14:29:14      |       | (phpbb.ControlStructures.OpeningParenthesis.NoSpaceBeforeOpeningParenthesis)
13-Apr-2017 14:29:14 121 | ERROR | There should be exactly one space between the keyword and
13-Apr-2017 14:29:14      |       | opening parenthesis
13-Apr-2017 14:29:14      |       | (phpbb.ControlStructures.OpeningParenthesis.NoSpaceBeforeOpeningParenthesis)
13-Apr-2017 14:29:14 135 | ERROR | There should be exactly one space between the keyword and
13-Apr-2017 14:29:14      |       | opening parenthesis
13-Apr-2017 14:29:14      |       | (phpbb.ControlStructures.OpeningParenthesis.NoSpaceBeforeOpeningParenthesis)
13-Apr-2017 14:29:14 153 | ERROR | There should be exactly one space between the keyword and
13-Apr-2017 14:29:14      |       | opening parenthesis
13-Apr-2017 14:29:14      |       | (phpbb.ControlStructures.OpeningParenthesis.NoSpaceBeforeOpeningParenthesis)
13-Apr-2017 14:29:14 162 | ERROR | There should be exactly one space between the keyword and
13-Apr-2017 14:29:14      |       | opening parenthesis
13-Apr-2017 14:29:14      |       | (phpbb.ControlStructures.OpeningParenthesis.NoSpaceBeforeOpeningParenthesis)
13-Apr-2017 14:29:14 256 | ERROR | There should be exactly one space between the keyword and
13-Apr-2017 14:29:14      |       | opening parenthesis
13-Apr-2017 14:29:14      |       | (phpbb.ControlStructures.OpeningParenthesis.NoSpaceBeforeOpeningParenthesis)
13-Apr-2017 14:29:14 ----------------------------------------------------------------------
13-Apr-2017 14:29:14
13-Apr-2017 14:29:14 Time: 44.24 secs; Memory: 77.5Mb
13-Apr-2017 14:29:14
13-Apr-2017 14:29:22 ............................................................  60 / 206 (29%)
13-Apr-2017 14:29:40 ............................................................ 120 / 206 (58%)
13-Apr-2017 14:29:56 ................................E........................... 180 / 206 (87%)
13-Apr-2017 14:30:03 ..........................
13-Apr-2017 14:30:03
13-Apr-2017 14:30:03
13-Apr-2017 14:30:03 FILE: /data/phpBB/includes/acp/acp_styles.php
13-Apr-2017 14:30:03 ----------------------------------------------------------------------
13-Apr-2017 14:30:03 FOUND 3 ERRORS AFFECTING 3 LINES
13-Apr-2017 14:30:03 ----------------------------------------------------------------------
13-Apr-2017 14:30:03 202 | ERROR | There should be exactly one space between the keyword and
13-Apr-2017 14:30:03      |       | opening parenthesis
13-Apr-2017 14:30:03      |       | (phpbb.ControlStructures.OpeningParenthesis.NoSpaceBeforeOpeningParenthesis)
13-Apr-2017 14:30:03 303 | ERROR | There should be exactly one space between the keyword and
13-Apr-2017 14:30:03      |       | opening parenthesis
13-Apr-2017 14:30:03      |       | (phpbb.ControlStructures.OpeningParenthesis.NoSpaceBeforeOpeningParenthesis)
13-Apr-2017 14:30:03 310 | ERROR | There should be exactly one space between the keyword and
13-Apr-2017 14:30:03      |       | opening parenthesis
13-Apr-2017 14:30:03      |       | (phpbb.ControlStructures.OpeningParenthesis.NoSpaceBeforeOpeningParenthesis)
13-Apr-2017 14:30:03 ----------------------------------------------------------------------
13-Apr-2017 14:30:03
13-Apr-2017 14:30:03 Time: 48.57 secs; Memory: 60.25Mb
13-Apr-2017 14:30:03
13-Apr-2017 14:30:03
13-Apr-2017 14:30:03
13-Apr-2017 14:30:03 Time: 16ms; Memory: 3.75Mb
13-Apr-2017 14:30:03
13-Apr-2017 14:30:03        [if] Error in IfTask
13-Apr-2017 14:30:03 Execution of target "sniff" failed for the following reason: /data/build/build.xml:108:6: /data/build/build.xml:114:9: PHP Code Sniffer failed.
13-Apr-2017 14:30:03
13-Apr-2017 14:30:03 BUILD FAILED
13-Apr-2017 14:30:03 /data/build/build.xml:108:6: /data/build/build.xml:114:9: PHP Code Sniffer failed.
13-Apr-2017 14:30:03 Total time: 2 minutes  33.22 seconds
13-Apr-2017 14:30:03
13-Apr-2017 14:30:03 Failing task since return code of [/usr/bin/docker run --volume /home/bamboo/xml-data/build-dir/PHPBB3-PR-JOB1:/data --workdir /data/build --rm -u=991 phpbb:php-5.6 ../phpBB/vendor/bin/phing sniff] was 1 while expected 0
13-Apr-2017 14:30:03 Error occurred while running Task 'Run sniffs(11)' of type com.atlassian.bamboo.plugins.bamboo-docker-plugin:task.docker.cli.
13-Apr-2017 14:30:03 com.atlassian.bamboo.task.TaskException: Failed to execute task
13-Apr-2017 14:30:03         at com.atlassian.bamboo.plugins.docker.service.RunService.execute(RunService.java:71)
13-Apr-2017 14:30:03         at com.atlassian.bamboo.plugins.docker.tasks.cli.DockerCliTask.execute(DockerCliTask.java:60)
13-Apr-2017 14:30:03         at com.atlassian.bamboo.task.TaskExecutorImpl.lambda$executeTasks$3(TaskExecutorImpl.java:317)
13-Apr-2017 14:30:03         at com.atlassian.bamboo.task.TaskExecutorImpl.executeTaskWithPrePostActions(TaskExecutorImpl.java:246)
13-Apr-2017 14:30:03         at com.atlassian.bamboo.task.TaskExecutorImpl.executeTasks(TaskExecutorImpl.java:317)
13-Apr-2017 14:30:03         at com.atlassian.bamboo.task.TaskExecutorImpl.execute(TaskExecutorImpl.java:118)
13-Apr-2017 14:30:03         at com.atlassian.bamboo.build.pipeline.tasks.ExecuteBuildTask.call(ExecuteBuildTask.java:74)
13-Apr-2017 14:30:03         at com.atlassian.bamboo.v2.build.agent.DefaultBuildAgent.build(DefaultBuildAgent.java:216)
13-Apr-2017 14:30:03         at com.atlassian.bamboo.v2.build.agent.BuildAgentControllerImpl$1.call(BuildAgentControllerImpl.java:139)
13-Apr-2017 14:30:03         at com.atlassian.bamboo.v2.build.agent.BuildAgentControllerImpl$1.call(BuildAgentControllerImpl.java:130)
13-Apr-2017 14:30:03         at com.atlassian.bamboo.variable.CustomVariableContextImpl.withVariableSubstitutor(CustomVariableContextImpl.java:221)
13-Apr-2017 14:30:03         at com.atlassian.bamboo.v2.build.agent.BuildAgentControllerImpl.waitAndPerformBuild(BuildAgentControllerImpl.java:129)
13-Apr-2017 14:30:03         at com.atlassian.bamboo.v2.build.agent.DefaultBuildAgent$1.run(DefaultBuildAgent.java:138)
13-Apr-2017 14:30:03         at com.atlassian.bamboo.utils.BambooRunnables$1.run(BambooRunnables.java:51)
13-Apr-2017 14:30:03         at com.atlassian.bamboo.security.ImpersonationHelper.runWith(ImpersonationHelper.java:31)
13-Apr-2017 14:30:03         at com.atlassian.bamboo.security.ImpersonationHelper.runWithSystemAuthority(ImpersonationHelper.java:20)
13-Apr-2017 14:30:03         at com.atlassian.bamboo.security.ImpersonationHelper$1.run(ImpersonationHelper.java:52)
13-Apr-2017 14:30:03         at java.lang.Thread.run(Thread.java:745)
13-Apr-2017 14:30:03 Caused by: com.atlassian.bamboo.plugins.docker.client.DockerException: Error running Docker run command
13-Apr-2017 14:30:03         at com.atlassian.bamboo.plugins.docker.client.DockerCmd.run(DockerCmd.java:103)
13-Apr-2017 14:30:03         at com.atlassian.bamboo.plugins.docker.service.RunService.execute(RunService.java:60)
13-Apr-2017 14:30:03         ... 17 more
13-Apr-2017 14:30:03 Caused by: com.atlassian.utils.process.ProcessException: Error executing /usr/bin/docker run --volume /home/bamboo/xml-data/build-dir/PHPBB3-PR-JOB1:/data --workdir /data/build --rm -u=991 phpbb:php-5.6 ../phpBB/vendor/bin/phing sniff
13-Apr-2017 14:30:03         at com.atlassian.bamboo.plugins.docker.process.DockerTaskProcessService.execute(DockerTaskProcessService.java:60)
13-Apr-2017 14:30:03         at com.atlassian.bamboo.plugins.docker.client.DockerCmd.run(DockerCmd.java:99)
13-Apr-2017 14:30:03         ... 18 more
13-Apr-2017 14:30:03 Starting task 'Parsing test results produced by script' of type 'com.atlassian.bamboo.plugins.testresultparser:task.testresultparser.junit'
13-Apr-2017 14:30:03 Parsing test results under /home/bamboo/xml-data/build-dir/PHPBB3-PR-JOB1...
13-Apr-2017 14:30:03 Failing task since test cases were expected but none were found.
13-Apr-2017 14:30:03 Finished task 'Parsing test results produced by script' with result: Failed
13-Apr-2017 14:30:03
Substituting variable: ${bamboo.PRnumber} with 4789
13-Apr-2017 14:30:03
Substituting variable: ${bamboo.buildResultsUrl} with https://bamboo.phpbb.com/browse/PHPBB3-PR-JOB1-6976
13-Apr-2017 14:30:03
Substituting variable: ${bamboo.buildResultsUrl} with https://bamboo.phpbb.com/browse/PHPBB3-PR-JOB1-6976
13-Apr-2017 14:30:03 Starting task 'Set result build status' of type 'com.atlassian.bamboo.plugins.scripttask:task.builder.script'
13-Apr-2017 14:30:03
Beginning to execute external process for build 'phpBB3 - Pull Requests - Build and Test Job #6976 (PHPBB3-PR-JOB1-6976)'
... running command line:
/bin/sh /home/bamboo/temp/PHPBB3-PR-JOB1-6976-ScriptBuildTask-2992394247822413048.sh
... in: /home/bamboo/xml-data/build-dir/PHPBB3-PR-JOB1
... using extra environment variables:
bamboo_planRepository_1_branch=3.1.x
bamboo_planRepository_1_branchDisplayName=3.1.x
bamboo_repository_revision_number=f9a596c544fb6677d822cd78d16987d8e751b729
bamboo_PRref=master
bamboo_resultsUrl=https://bamboo.phpbb.com/browse/PHPBB3-PR-JOB1-6976
bamboo_capability_system_builder_command_Git=/usr/bin/git
bamboo_repository_75956235_git_username=bantu
bamboo_planRepository_1_name=phpBB Ascraeus
bamboo_build_working_directory=/home/bamboo/xml-data/build-dir/PHPBB3-PR-JOB1
bamboo_buildKey=PHPBB3-PR-JOB1
bamboo_capability_phpbb_tests=true
bamboo_shortPlanName=Pull Requests
bamboo_capability_system_builder_command_fop=/usr/bin/fop
bamboo_capability_dbms_sqlite_2=true
bamboo_planRepository_name=phpBB Ascraeus
bamboo_PRnumber=4789
bamboo_buildNumber=6976
bamboo_repository_75956235_git_repositoryUrl=https://github.com/phpbb/phpbb.git
bamboo_capability_system_builder_phpunit_PHPUnit=/usr/bin/phpunit
bamboo_shortJobName=Build and Test Job
bamboo_buildResultsUrl=https://bamboo.phpbb.com/browse/PHPBB3-PR-JOB1-6976
bamboo_repository_75956235_branch_name=3.1.x
bamboo_planRepository_repositoryUrl=https://github.com/phpbb/phpbb.git
bamboo_agentId=131073
bamboo_planName=phpBB3 - Pull Requests
bamboo_build_commandline_com_atlassian_bamboo_plugins_scripttask_task_builder_script_7=/bin/sh /home/bamboo/temp/PHPBB3-PR-JOB1-6976-ScriptBuildTask-2540851502768520956.sh
bamboo_shortPlanKey=PR
bamboo_shortJobKey=JOB1
bamboo_capability_dbms_mysql_55=true
bamboo_capability_system_jdk_JDK_1_7_0_65=/usr/lib/jvm/java-7-openjdk-amd64
bamboo_planRepository_revision=f9a596c544fb6677d822cd78d16987d8e751b729
bamboo_repository_previous_revision_number=f9a596c544fb6677d822cd78d16987d8e751b729
bamboo_buildTimeStamp=2017-04-13T14:27:10.520Z
bamboo_planRepository_previousRevision=f9a596c544fb6677d822cd78d16987d8e751b729
bamboo_capability_system_builder_mvn2_Maven_2=/usr/share/maven2
bamboo_capability_system_jdk_JDK_1_6_0_16=/usr/lib/jvm/java-6-sun-1.6.0.16
bamboo_build_commandline_com_atlassian_bamboo_plugins_scripttask_task_builder_script_4=/bin/sh /home/bamboo/temp/PHPBB3-PR-JOB1-6976-ScriptBuildTask-6388490789464179505.sh
bamboo_buildResultKey=PHPBB3-PR-JOB1-6976
bamboo_repository_git_branch=3.1.x
bamboo_repository_branch_name=3.1.x
bamboo_buildPlanName=phpBB3 - Pull Requests - Build and Test Job
bamboo_planRepository_1_revision=f9a596c544fb6677d822cd78d16987d8e751b729
bamboo_repository_name=phpBB Ascraeus
bamboo_capability_system_docker_executable=/usr/bin/docker
bamboo_build_commandline_com_atlassian_bamboo_plugins_bamboo_docker_plugin_task_docker_cli_11=/usr/bin/docker run --volume /home/bamboo/xml-data/build-dir/PHPBB3-PR-JOB1:/data --workdir /data/build --rm -u=991 phpbb:php-5.6 ../phpBB/vendor/bin/phing sniff
bamboo_build_commandline_com_atlassian_bamboo_plugins_bamboo_docker_plugin_task_docker_cli_12=/usr/bin/docker run --volume /home/bamboo/xml-data/build-dir/PHPBB3-PR-JOB1:/data --workdir /data/phpBB --rm -e HOME=/home/bamboo -u=991 phpbb:php-5.6 /bin/bash -c php ../composer.phar install --dev; cd ../build; ../phpBB/vendor/bin/phing clean prepare
bamboo_planRepository_branch=3.1.x
bamboo_agentWorkingDirectory=/home/bamboo/xml-data/build-dir
bamboo_capability_system_git_executable=/usr/bin/git
bamboo_planRepository_1_previousRevision=f9a596c544fb6677d822cd78d16987d8e751b729
bamboo_capability_system_builder_phpunit_PHPUnit_3_4=/usr/bin/phpunit
bamboo_repository_git_username=bantu
bamboo_repository_75956235_revision_number=f9a596c544fb6677d822cd78d16987d8e751b729
bamboo_planRepository_branchDisplayName=3.1.x
bamboo_planRepository_1_type=gitv2
bamboo_planRepository_branchName=3.1.x
bamboo_repository_75956235_previous_revision_number=f9a596c544fb6677d822cd78d16987d8e751b729
bamboo_capability_system_jdk_JDK=/usr/lib/jvm/java-6-sun
bamboo_plan_storageTag=PHPBB3-PR
bamboo_planRepository_type=gitv2
bamboo_planRepository_1_username=bantu
bamboo_ManualBuildTriggerReason_userName=Build Robot
bamboo_repository_git_repositoryUrl=https://github.com/phpbb/phpbb.git
bamboo_repository_75956235_git_branch=3.1.x
bamboo_capability_system_builder_ant_Ant=/usr/share/ant
bamboo_repository_75956235_name=phpBB Ascraeus
bamboo_working_directory=/home/bamboo/xml-data/build-dir/PHPBB3-PR-JOB1
bamboo_planKey=PHPBB3-PR
bamboo_planRepository_1_repositoryUrl=https://github.com/phpbb/phpbb.git
bamboo_planRepository_username=bantu
bamboo_capability_local=true
bamboo_capability_system_jdk_JDK_1_6=/usr/lib/jvm/java-6-sun
bamboo_capability_system_jdk_JDK_1_7=/usr/lib/jvm/java-7-openjdk-amd64
bamboo_planRepository_1_branchName=3.1.x
13-Apr-2017 14:30:03 From https://github.com/phpbb/phpbb
13-Apr-2017 14:30:03 * branch            refs/pull/4789/head -> FETCH_HEAD
13-Apr-2017 14:30:03 grep: build/logs/phpunit.xml: No such file or directory
13-Apr-2017 14:30:03 grep: build/logs/phpunit.xml: No such file or directory
13-Apr-2017 14:30:03   % Total    % Received % Xferd  Average Speed   Time    Time     Time  Current
13-Apr-2017 14:30:03                                  Dload  Upload   Total   Spent    Left  Speed
13-Apr-2017 14:30:03
13-Apr-2017 14:30:04   0     0    0     0    0     0      0      0 --:--:-- --:--:-- --:--:--     0
13-Apr-2017 14:30:04   0     0    0     0    0     0      0      0 --:--:-- --:--:-- --:--:--     0
13-Apr-2017 14:30:04 100   273  100    93  100   180     99    193 --:--:-- --:--:-- --:--:--   193
13-Apr-2017 14:30:04 Finished task 'Set result build status' with result: Success
13-Apr-2017 14:30:04 Running post build plugin 'NCover Results Collector'
13-Apr-2017 14:30:04 Running post build plugin 'Artifact Copier'
13-Apr-2017 14:30:04 Running post build plugin 'npm Cache Cleanup'
13-Apr-2017 14:30:04 Running post build plugin 'Clover Results Collector'
13-Apr-2017 14:30:04 Running post build plugin 'Docker Container Cleanup'
13-Apr-2017 14:30:04 Successfully removed working directory at '/home/bamboo/xml-data/build-dir/PHPBB3-PR-JOB1'
13-Apr-2017 14:30:04 Finalising the build...
13-Apr-2017 14:30:04 Stopping timer.
13-Apr-2017 14:30:04 Build PHPBB3-PR-JOB1-6976 completed.
13-Apr-2017 14:30:04 Running on server: post build plugin 'NCover Results Collector'
13-Apr-2017 14:30:04 Running on server: post build plugin 'Build Hanging Detection Configuration'
13-Apr-2017 14:30:04 Running on server: post build plugin 'Clover Delta Calculator'
13-Apr-2017 14:30:04 Running on server: post build plugin 'Maven Dependencies Postprocessor'
13-Apr-2017 14:30:04 All post build plugins have finished
13-Apr-2017 14:30:04 Generating build results summary...
13-Apr-2017 14:30:04 Saving build results to disk...
13-Apr-2017 14:30:05 Logging substituted variables...
13-Apr-2017 14:30:05 Indexing build results...
13-Apr-2017 14:30:05 Finished building PHPBB3-PR-JOB1-6976.
13-Apr-2017 14:30:05
Substituting variable: ${bamboo.PRnumber} with 4789