Tests pending pull requests

Build: #6990 failed

Job: Build and Test Job failed

Stages & jobs

  1. Build and Test

Build log

The build generated 434 lines of output. Download or view full build log

17-Apr-2017 02:05:42 Build phpBB3 - Pull Requests - Build and Test Job #6990 (PHPBB3-PR-JOB1-6990) started building on agent Default Agent
17-Apr-2017 02:05:42
17-Apr-2017 02:05:42 Build working directory is /home/bamboo/xml-data/build-dir/PHPBB3-PR-JOB1
17-Apr-2017 02:05:42 Executing build phpBB3 - Pull Requests - Build and Test Job #6990 (PHPBB3-PR-JOB1-6990)
17-Apr-2017 02:05:42 Starting task 'Checkout develop branch' of type 'com.atlassian.bamboo.plugins.vcs:task.vcs.checkout'
17-Apr-2017 02:05:42 Build always requires a clean checkout
17-Apr-2017 02:05:42 Cleaning build directory '/home/bamboo/xml-data/build-dir/PHPBB3-PR-JOB1'
17-Apr-2017 02:05:42 Updating source code to revision: 1cbc6dedab1e5d02872d9ed185125383abd96de1
17-Apr-2017 02:05:42 Fetching 'refs/heads/3.1.x' from 'https://github.com/phpbb/phpbb.git'.
17-Apr-2017 02:05:43 Checking out revision 1cbc6dedab1e5d02872d9ed185125383abd96de1.
17-Apr-2017 02:05:43 Creating local git repository in '/home/bamboo/xml-data/build-dir/PHPBB3-PR-JOB1/.git'.
17-Apr-2017 02:05:43 Cloning into '/home/bamboo/xml-data/build-dir/PHPBB3-PR-JOB1'...
17-Apr-2017 02:05:43 done.
17-Apr-2017 02:05:44 Switched to a new branch '3.1.x'
17-Apr-2017 02:05:44 Branch 3.1.x set up to track remote branch 3.1.x from origin.
17-Apr-2017 02:05:44 Updated source code to revision: 1cbc6dedab1e5d02872d9ed185125383abd96de1
17-Apr-2017 02:05:44 Finished task 'Checkout develop branch' with result: Success
17-Apr-2017 02:05:44 Running pre-build action: VCS Version Collector
17-Apr-2017 02:05:44
Substituting variable: ${bamboo.PRnumber} with 4789
17-Apr-2017 02:05:44
Substituting variable: ${bamboo.buildResultsUrl} with https://bamboo.phpbb.com/browse/PHPBB3-PR-JOB1-6990
17-Apr-2017 02:05:44 Starting task 'Set pending build status' of type 'com.atlassian.bamboo.plugins.scripttask:task.builder.script'
17-Apr-2017 02:05:44
Beginning to execute external process for build 'phpBB3 - Pull Requests - Build and Test Job #6990 (PHPBB3-PR-JOB1-6990)'
... running command line:
/bin/sh /home/bamboo/temp/PHPBB3-PR-JOB1-6990-ScriptBuildTask-7699644163196756359.sh
... in: /home/bamboo/xml-data/build-dir/PHPBB3-PR-JOB1
... using extra environment variables:
bamboo_planRepository_1_branch=3.1.x
bamboo_planRepository_1_branchDisplayName=3.1.x
bamboo_repository_revision_number=1cbc6dedab1e5d02872d9ed185125383abd96de1
bamboo_PRref=master
bamboo_resultsUrl=https://bamboo.phpbb.com/browse/PHPBB3-PR-JOB1-6990
bamboo_capability_system_builder_command_Git=/usr/bin/git
bamboo_repository_75956235_git_username=bantu
bamboo_planRepository_1_name=phpBB Ascraeus
bamboo_build_working_directory=/home/bamboo/xml-data/build-dir/PHPBB3-PR-JOB1
bamboo_buildKey=PHPBB3-PR-JOB1
bamboo_capability_phpbb_tests=true
bamboo_shortPlanName=Pull Requests
bamboo_capability_system_builder_command_fop=/usr/bin/fop
bamboo_capability_dbms_sqlite_2=true
bamboo_planRepository_name=phpBB Ascraeus
bamboo_PRnumber=4789
bamboo_buildNumber=6990
bamboo_repository_75956235_git_repositoryUrl=https://github.com/phpbb/phpbb.git
bamboo_capability_system_builder_phpunit_PHPUnit=/usr/bin/phpunit
bamboo_shortJobName=Build and Test Job
bamboo_buildResultsUrl=https://bamboo.phpbb.com/browse/PHPBB3-PR-JOB1-6990
bamboo_repository_75956235_branch_name=3.1.x
bamboo_planRepository_repositoryUrl=https://github.com/phpbb/phpbb.git
bamboo_agentId=131073
bamboo_planName=phpBB3 - Pull Requests
bamboo_shortPlanKey=PR
bamboo_shortJobKey=JOB1
bamboo_capability_dbms_mysql_55=true
bamboo_capability_system_jdk_JDK_1_7_0_65=/usr/lib/jvm/java-7-openjdk-amd64
bamboo_planRepository_revision=1cbc6dedab1e5d02872d9ed185125383abd96de1
bamboo_repository_previous_revision_number=1cbc6dedab1e5d02872d9ed185125383abd96de1
bamboo_buildTimeStamp=2017-04-17T02:05:42.797Z
bamboo_planRepository_previousRevision=1cbc6dedab1e5d02872d9ed185125383abd96de1
bamboo_capability_system_builder_mvn2_Maven_2=/usr/share/maven2
bamboo_capability_system_jdk_JDK_1_6_0_16=/usr/lib/jvm/java-6-sun-1.6.0.16
bamboo_buildResultKey=PHPBB3-PR-JOB1-6990
bamboo_repository_git_branch=3.1.x
bamboo_repository_branch_name=3.1.x
bamboo_buildPlanName=phpBB3 - Pull Requests - Build and Test Job
bamboo_planRepository_1_revision=1cbc6dedab1e5d02872d9ed185125383abd96de1
bamboo_repository_name=phpBB Ascraeus
bamboo_capability_system_docker_executable=/usr/bin/docker
bamboo_planRepository_branch=3.1.x
bamboo_agentWorkingDirectory=/home/bamboo/xml-data/build-dir
bamboo_capability_system_git_executable=/usr/bin/git
bamboo_planRepository_1_previousRevision=1cbc6dedab1e5d02872d9ed185125383abd96de1
bamboo_capability_system_builder_phpunit_PHPUnit_3_4=/usr/bin/phpunit
bamboo_repository_git_username=bantu
bamboo_repository_75956235_revision_number=1cbc6dedab1e5d02872d9ed185125383abd96de1
bamboo_planRepository_branchDisplayName=3.1.x
bamboo_planRepository_1_type=gitv2
bamboo_planRepository_branchName=3.1.x
bamboo_repository_75956235_previous_revision_number=1cbc6dedab1e5d02872d9ed185125383abd96de1
bamboo_capability_system_jdk_JDK=/usr/lib/jvm/java-6-sun
bamboo_plan_storageTag=PHPBB3-PR
bamboo_planRepository_type=gitv2
bamboo_planRepository_1_username=bantu
bamboo_ManualBuildTriggerReason_userName=Build Robot
bamboo_repository_git_repositoryUrl=https://github.com/phpbb/phpbb.git
bamboo_repository_75956235_git_branch=3.1.x
bamboo_capability_system_builder_ant_Ant=/usr/share/ant
bamboo_repository_75956235_name=phpBB Ascraeus
bamboo_working_directory=/home/bamboo/xml-data/build-dir/PHPBB3-PR-JOB1
bamboo_planKey=PHPBB3-PR
bamboo_planRepository_1_repositoryUrl=https://github.com/phpbb/phpbb.git
bamboo_planRepository_username=bantu
bamboo_capability_local=true
bamboo_capability_system_jdk_JDK_1_6=/usr/lib/jvm/java-6-sun
bamboo_capability_system_jdk_JDK_1_7=/usr/lib/jvm/java-7-openjdk-amd64
bamboo_planRepository_1_branchName=3.1.x
17-Apr-2017 02:05:45 From https://github.com/phpbb/phpbb
17-Apr-2017 02:05:45 * branch            refs/pull/4789/head -> FETCH_HEAD
17-Apr-2017 02:05:45   % Total    % Received % Xferd  Average Speed   Time    Time     Time  Current
17-Apr-2017 02:05:45                                  Dload  Upload   Total   Spent    Left  Speed
17-Apr-2017 02:05:45
17-Apr-2017 02:05:46   0     0    0     0    0     0      0      0 --:--:-- --:--:-- --:--:--     0
17-Apr-2017 02:05:46   0     0    0     0    0     0      0      0 --:--:-- --:--:-- --:--:--     0
17-Apr-2017 02:05:46 100   275  100    93  100   182    129    253 --:--:-- --:--:-- --:--:--   253
17-Apr-2017 02:05:46 Finished task 'Set pending build status' with result: Success
17-Apr-2017 02:05:46
Substituting variable: ${bamboo.PRnumber} with 4789
17-Apr-2017 02:05:46 Starting task 'Fetch PR' of type 'com.atlassian.bamboo.plugins.scripttask:task.builder.script'
17-Apr-2017 02:05:46
Beginning to execute external process for build 'phpBB3 - Pull Requests - Build and Test Job #6990 (PHPBB3-PR-JOB1-6990)'
... running command line:
/bin/sh /home/bamboo/temp/PHPBB3-PR-JOB1-6990-ScriptBuildTask-6437325382177721470.sh
... in: /home/bamboo/xml-data/build-dir/PHPBB3-PR-JOB1
... using extra environment variables:
bamboo_planRepository_1_branch=3.1.x
bamboo_planRepository_1_branchDisplayName=3.1.x
bamboo_repository_revision_number=1cbc6dedab1e5d02872d9ed185125383abd96de1
bamboo_PRref=master
bamboo_resultsUrl=https://bamboo.phpbb.com/browse/PHPBB3-PR-JOB1-6990
bamboo_capability_system_builder_command_Git=/usr/bin/git
bamboo_repository_75956235_git_username=bantu
bamboo_planRepository_1_name=phpBB Ascraeus
bamboo_build_working_directory=/home/bamboo/xml-data/build-dir/PHPBB3-PR-JOB1
bamboo_buildKey=PHPBB3-PR-JOB1
bamboo_capability_phpbb_tests=true
bamboo_shortPlanName=Pull Requests
bamboo_capability_system_builder_command_fop=/usr/bin/fop
bamboo_capability_dbms_sqlite_2=true
bamboo_planRepository_name=phpBB Ascraeus
bamboo_PRnumber=4789
bamboo_buildNumber=6990
bamboo_repository_75956235_git_repositoryUrl=https://github.com/phpbb/phpbb.git
bamboo_capability_system_builder_phpunit_PHPUnit=/usr/bin/phpunit
bamboo_shortJobName=Build and Test Job
bamboo_buildResultsUrl=https://bamboo.phpbb.com/browse/PHPBB3-PR-JOB1-6990
bamboo_repository_75956235_branch_name=3.1.x
bamboo_planRepository_repositoryUrl=https://github.com/phpbb/phpbb.git
bamboo_agentId=131073
bamboo_planName=phpBB3 - Pull Requests
bamboo_build_commandline_com_atlassian_bamboo_plugins_scripttask_task_builder_script_7=/bin/sh /home/bamboo/temp/PHPBB3-PR-JOB1-6990-ScriptBuildTask-7699644163196756359.sh
bamboo_shortPlanKey=PR
bamboo_shortJobKey=JOB1
bamboo_capability_dbms_mysql_55=true
bamboo_capability_system_jdk_JDK_1_7_0_65=/usr/lib/jvm/java-7-openjdk-amd64
bamboo_planRepository_revision=1cbc6dedab1e5d02872d9ed185125383abd96de1
bamboo_repository_previous_revision_number=1cbc6dedab1e5d02872d9ed185125383abd96de1
bamboo_buildTimeStamp=2017-04-17T02:05:42.797Z
bamboo_planRepository_previousRevision=1cbc6dedab1e5d02872d9ed185125383abd96de1
bamboo_capability_system_builder_mvn2_Maven_2=/usr/share/maven2
bamboo_capability_system_jdk_JDK_1_6_0_16=/usr/lib/jvm/java-6-sun-1.6.0.16
bamboo_buildResultKey=PHPBB3-PR-JOB1-6990
bamboo_repository_git_branch=3.1.x
bamboo_repository_branch_name=3.1.x
bamboo_buildPlanName=phpBB3 - Pull Requests - Build and Test Job
bamboo_planRepository_1_revision=1cbc6dedab1e5d02872d9ed185125383abd96de1
bamboo_repository_name=phpBB Ascraeus
bamboo_capability_system_docker_executable=/usr/bin/docker
bamboo_planRepository_branch=3.1.x
bamboo_agentWorkingDirectory=/home/bamboo/xml-data/build-dir
bamboo_capability_system_git_executable=/usr/bin/git
bamboo_planRepository_1_previousRevision=1cbc6dedab1e5d02872d9ed185125383abd96de1
bamboo_capability_system_builder_phpunit_PHPUnit_3_4=/usr/bin/phpunit
bamboo_repository_git_username=bantu
bamboo_repository_75956235_revision_number=1cbc6dedab1e5d02872d9ed185125383abd96de1
bamboo_planRepository_branchDisplayName=3.1.x
bamboo_planRepository_1_type=gitv2
bamboo_planRepository_branchName=3.1.x
bamboo_repository_75956235_previous_revision_number=1cbc6dedab1e5d02872d9ed185125383abd96de1
bamboo_capability_system_jdk_JDK=/usr/lib/jvm/java-6-sun
bamboo_plan_storageTag=PHPBB3-PR
bamboo_planRepository_type=gitv2
bamboo_planRepository_1_username=bantu
bamboo_ManualBuildTriggerReason_userName=Build Robot
bamboo_repository_git_repositoryUrl=https://github.com/phpbb/phpbb.git
bamboo_repository_75956235_git_branch=3.1.x
bamboo_capability_system_builder_ant_Ant=/usr/share/ant
bamboo_repository_75956235_name=phpBB Ascraeus
bamboo_working_directory=/home/bamboo/xml-data/build-dir/PHPBB3-PR-JOB1
bamboo_planKey=PHPBB3-PR
bamboo_planRepository_1_repositoryUrl=https://github.com/phpbb/phpbb.git
bamboo_planRepository_username=bantu
bamboo_capability_local=true
bamboo_capability_system_jdk_JDK_1_6=/usr/lib/jvm/java-6-sun
bamboo_capability_system_jdk_JDK_1_7=/usr/lib/jvm/java-7-openjdk-amd64
bamboo_planRepository_1_branchName=3.1.x
17-Apr-2017 02:05:47 From https://github.com/phpbb/phpbb
17-Apr-2017 02:05:47 * branch            refs/pull/4789/merge -> FETCH_HEAD
17-Apr-2017 02:05:47 Note: checking out 'FETCH_HEAD'.
17-Apr-2017 02:05:47
17-Apr-2017 02:05:47 You are in 'detached HEAD' state. You can look around, make experimental
17-Apr-2017 02:05:47 changes and commit them, and you can discard any commits you make in this
17-Apr-2017 02:05:47 state without impacting any branches by performing another checkout.
17-Apr-2017 02:05:47
17-Apr-2017 02:05:47 If you want to create a new branch to retain commits you create, you may
17-Apr-2017 02:05:47 do so (now or later) by using -b with the checkout command again. Example:
17-Apr-2017 02:05:47
17-Apr-2017 02:05:47   git checkout -b new_branch_name
17-Apr-2017 02:05:47
17-Apr-2017 02:05:47 HEAD is now at 8c79317... Merge 9a1dc6ce77b1028e737a02b124fa721a12b3e6e8 into 465ceab1e65af2ea57acb259f0e45338051bd9f1
17-Apr-2017 02:05:47 Finished task 'Fetch PR' with result: Success
17-Apr-2017 02:05:47 Skipping execution of task 'Prepare directory' as it is disabled
17-Apr-2017 02:05:47
Substituting variable: ${bamboo.working.directory} with /home/bamboo/xml-data/build-dir/PHPBB3-PR-JOB1
17-Apr-2017 02:05:47 Starting task 'Prepare directory' of type 'com.atlassian.bamboo.plugins.bamboo-docker-plugin:task.docker.cli'
17-Apr-2017 02:05:47 Running image name (phpbb:php-5.6)
17-Apr-2017 02:05:47
Beginning to execute external process for build 'phpBB3 - Pull Requests - Build and Test Job #6990 (PHPBB3-PR-JOB1-6990)'
... running command line:
/usr/bin/docker run --volume /home/bamboo/xml-data/build-dir/PHPBB3-PR-JOB1:/data --workdir /data/phpBB --rm -e HOME=/home/bamboo -u=991 phpbb:php-5.6 /bin/bash -c php ../composer.phar install --dev; cd ../build; ../phpBB/vendor/bin/phing clean prepare
... in: /home/bamboo/xml-data/build-dir/PHPBB3-PR-JOB1
... using extra environment variables:
bamboo_planRepository_1_branch=3.1.x
bamboo_planRepository_1_branchDisplayName=3.1.x
bamboo_repository_revision_number=1cbc6dedab1e5d02872d9ed185125383abd96de1
bamboo_PRref=master
bamboo_resultsUrl=https://bamboo.phpbb.com/browse/PHPBB3-PR-JOB1-6990
bamboo_capability_system_builder_command_Git=/usr/bin/git
bamboo_repository_75956235_git_username=bantu
bamboo_planRepository_1_name=phpBB Ascraeus
bamboo_build_working_directory=/home/bamboo/xml-data/build-dir/PHPBB3-PR-JOB1
bamboo_buildKey=PHPBB3-PR-JOB1
bamboo_capability_phpbb_tests=true
bamboo_shortPlanName=Pull Requests
bamboo_capability_system_builder_command_fop=/usr/bin/fop
bamboo_capability_dbms_sqlite_2=true
bamboo_planRepository_name=phpBB Ascraeus
bamboo_PRnumber=4789
bamboo_buildNumber=6990
bamboo_repository_75956235_git_repositoryUrl=https://github.com/phpbb/phpbb.git
bamboo_capability_system_builder_phpunit_PHPUnit=/usr/bin/phpunit
bamboo_shortJobName=Build and Test Job
bamboo_buildResultsUrl=https://bamboo.phpbb.com/browse/PHPBB3-PR-JOB1-6990
bamboo_repository_75956235_branch_name=3.1.x
bamboo_planRepository_repositoryUrl=https://github.com/phpbb/phpbb.git
bamboo_agentId=131073
bamboo_planName=phpBB3 - Pull Requests
bamboo_build_commandline_com_atlassian_bamboo_plugins_scripttask_task_builder_script_7=/bin/sh /home/bamboo/temp/PHPBB3-PR-JOB1-6990-ScriptBuildTask-7699644163196756359.sh
bamboo_shortPlanKey=PR
bamboo_shortJobKey=JOB1
bamboo_capability_dbms_mysql_55=true
bamboo_capability_system_jdk_JDK_1_7_0_65=/usr/lib/jvm/java-7-openjdk-amd64
bamboo_planRepository_revision=1cbc6dedab1e5d02872d9ed185125383abd96de1
bamboo_repository_previous_revision_number=1cbc6dedab1e5d02872d9ed185125383abd96de1
bamboo_buildTimeStamp=2017-04-17T02:05:42.797Z
bamboo_planRepository_previousRevision=1cbc6dedab1e5d02872d9ed185125383abd96de1
bamboo_capability_system_builder_mvn2_Maven_2=/usr/share/maven2
bamboo_capability_system_jdk_JDK_1_6_0_16=/usr/lib/jvm/java-6-sun-1.6.0.16
bamboo_build_commandline_com_atlassian_bamboo_plugins_scripttask_task_builder_script_4=/bin/sh /home/bamboo/temp/PHPBB3-PR-JOB1-6990-ScriptBuildTask-6437325382177721470.sh
bamboo_buildResultKey=PHPBB3-PR-JOB1-6990
bamboo_repository_git_branch=3.1.x
bamboo_repository_branch_name=3.1.x
bamboo_buildPlanName=phpBB3 - Pull Requests - Build and Test Job
bamboo_planRepository_1_revision=1cbc6dedab1e5d02872d9ed185125383abd96de1
bamboo_repository_name=phpBB Ascraeus
bamboo_capability_system_docker_executable=/usr/bin/docker
bamboo_planRepository_branch=3.1.x
bamboo_agentWorkingDirectory=/home/bamboo/xml-data/build-dir
bamboo_capability_system_git_executable=/usr/bin/git
bamboo_planRepository_1_previousRevision=1cbc6dedab1e5d02872d9ed185125383abd96de1
bamboo_capability_system_builder_phpunit_PHPUnit_3_4=/usr/bin/phpunit
bamboo_repository_git_username=bantu
bamboo_repository_75956235_revision_number=1cbc6dedab1e5d02872d9ed185125383abd96de1
bamboo_planRepository_branchDisplayName=3.1.x
bamboo_planRepository_1_type=gitv2
bamboo_planRepository_branchName=3.1.x
bamboo_repository_75956235_previous_revision_number=1cbc6dedab1e5d02872d9ed185125383abd96de1
bamboo_capability_system_jdk_JDK=/usr/lib/jvm/java-6-sun
bamboo_plan_storageTag=PHPBB3-PR
bamboo_planRepository_type=gitv2
bamboo_planRepository_1_username=bantu
bamboo_ManualBuildTriggerReason_userName=Build Robot
bamboo_repository_git_repositoryUrl=https://github.com/phpbb/phpbb.git
bamboo_repository_75956235_git_branch=3.1.x
bamboo_capability_system_builder_ant_Ant=/usr/share/ant
bamboo_repository_75956235_name=phpBB Ascraeus
bamboo_working_directory=/home/bamboo/xml-data/build-dir/PHPBB3-PR-JOB1
bamboo_planKey=PHPBB3-PR
bamboo_planRepository_1_repositoryUrl=https://github.com/phpbb/phpbb.git
bamboo_planRepository_username=bantu
bamboo_capability_local=true
bamboo_capability_system_jdk_JDK_1_6=/usr/lib/jvm/java-6-sun
bamboo_capability_system_jdk_JDK_1_7=/usr/lib/jvm/java-7-openjdk-amd64
bamboo_planRepository_1_branchName=3.1.x
17-Apr-2017 02:05:47 You are running composer with xdebug enabled. This has a major impact on runtime performance. See https://getcomposer.org/xdebug
17-Apr-2017 02:05:47 You are using the deprecated option "dev". Dev packages are installed by default now.
17-Apr-2017 02:05:47 Cannot create cache directory /home/bamboo/.composer/cache/repo/https---packagist.org/, or directory is not writable. Proceeding without cache
17-Apr-2017 02:05:47 Cannot create cache directory /home/bamboo/.composer/cache/files/, or directory is not writable. Proceeding without cache
17-Apr-2017 02:05:47 Loading composer repositories with package information
17-Apr-2017 02:05:47 Installing dependencies (including require-dev) from lock file
17-Apr-2017 02:05:48   - Installing bantu/ini-get-wrapper (v1.0.1)
17-Apr-2017 02:05:50     Downloading: Connecting...    Downloading: 0%               Downloading: 100%    Downloading: 100%
17-Apr-2017 02:05:50
17-Apr-2017 02:05:50   - Installing google/recaptcha (1.1.2)
17-Apr-2017 02:05:51     Downloading: Connecting...    Downloading: 0%               Downloading: 30%    Downloading: 55%    Downloading: 80%    Downloading: 85%    Downloading: 100%
17-Apr-2017 02:05:51
17-Apr-2017 02:05:51   - Installing guzzlehttp/promises (1.3.0)
17-Apr-2017 02:05:52     Downloading: Connecting...    Downloading: 0%               Downloading: 15%    Downloading: 25%    Downloading: 40%    Downloading: 60%    Downloading: 70%    Downloading: 85%    Downloading: 100%    Downloading: 100%
17-Apr-2017 02:05:52
17-Apr-2017 02:05:52   - Installing psr/http-message (1.0.1)
17-Apr-2017 02:05:53     Downloading: Connecting...    Downloading: 0%               Downloading: 95%    Downloading: 100%    Downloading: 100%
17-Apr-2017 02:05:53
17-Apr-2017 02:05:53   - Installing guzzlehttp/psr7 (1.3.1)
17-Apr-2017 02:05:54     Downloading: Connecting...    Downloading: 0%               Downloading: 5%    Downloading: 15%    Downloading: 20%    Downloading: 30%    Downloading: 35%    Downloading: 45%    Downloading: 50%    Downloading: 65%    Downloading: 70%    Downloading: 85%    Downloading: 90%    Downloading: 100%    Downloading: 100%
17-Apr-2017 02:05:54
17-Apr-2017 02:05:54   - Installing lusitanian/oauth (v0.8.9)
17-Apr-2017 02:05:55     Downloading: Connecting...    Downloading: 0%               Downloading: 5%    Downloading: 10%    Downloading: 15%    Downloading: 20%    Downloading: 25%    Downloading: 30%    Downloading: 35%    Downloading: 40%    Downloading: 45%    Downloading: 50%    Downloading: 55%    Downloading: 60%    Downloading: 65%    Downloading: 70%    Downloading: 75%    Downloading: 80%    Downloading: 85%    Downloading: 90%    Downloading: 95%    Downloading: 100%    Downloading: 100%
17-Apr-2017 02:05:55
17-Apr-2017 02:05:55   - Installing marc1706/fast-image-size (v1.1.2)
17-Apr-2017 02:05:56     Downloading: Connecting...    Downloading: 0%               Downloading: 35%    Downloading: 55%    Downloading: 90%    Downloading: 100%    Downloading: 100%
17-Apr-2017 02:05:57
17-Apr-2017 02:05:57   - Installing paragonie/random_compat (v1.4.1)
17-Apr-2017 02:05:57     Downloading: Connecting...    Downloading: 0%               Downloading: 20%    Downloading: 35%    Downloading: 60%    Downloading: 80%    Downloading: 95%    Downloading: 100%    Downloading: 100%
17-Apr-2017 02:05:57
17-Apr-2017 02:05:57   - Installing patchwork/utf8 (v1.3.1)
17-Apr-2017 02:05:59     Downloading: Connecting...    Downloading: 0%               Downloading: 5%    Downloading: 10%    Downloading: 15%    Downloading: 20%    Downloading: 25%    Downloading: 30%    Downloading: 35%    Downloading: 40%    Downloading: 45%    Downloading: 50%    Downloading: 55%    Downloading: 60%    Downloading: 65%    Downloading: 70%    Downloading: 75%    Downloading: 80%    Downloading: 85%    Downloading: 90%    Downloading: 95%    Downloading: 100%    Downloading: 100%
17-Apr-2017 02:05:59
17-Apr-2017 02:05:59   - Installing s9e/text-formatter (0.9.1)
17-Apr-2017 02:06:00     Downloading: Connecting...    Downloading: 0%               Downloading: 5%    Downloading: 10%    Downloading: 15%    Downloading: 20%    Downloading: 25%    Downloading: 30%    Downloading: 35%    Downloading: 40%    Downloading: 45%    Downloading: 50%    Downloading: 55%    Downloading: 60%    Downloading: 65%    Downloading: 70%    Downloading: 75%    Downloading: 95%    Downloading: 100%    Downloading: 100%
17-Apr-2017 02:06:00
17-Apr-2017 02:06:00   - Installing symfony/filesystem (v3.2.0)
17-Apr-2017 02:06:01     Downloading: Connecting...    Downloading: 0%               Downloading: 35%    Downloading: 40%    Downloading: 75%    Downloading: 95%    Downloading: 100%    Downloading: 100%
17-Apr-2017 02:06:01
17-Apr-2017 02:06:01   - Installing symfony/config (v3.2.0)
17-Apr-2017 02:06:03     Downloading: Connecting...    Downloading: 0%               Downloading: 5%    Downloading: 15%    Downloading: 20%    Downloading: 25%    Downloading: 30%    Downloading: 40%    Downloading: 45%    Downloading: 50%    Downloading: 60%    Downloading: 65%    Downloading: 70%    Downloading: 80%    Downloading: 85%    Downloading: 90%    Downloading: 95%    Downloading: 100%    Downloading: 100%
17-Apr-2017 02:06:03
17-Apr-2017 02:06:03   - Installing symfony/finder (v3.2.0)
17-Apr-2017 02:06:04     Downloading: Connecting...    Downloading: 0%               Downloading: 5%    Downloading: 10%    Downloading: 15%    Downloading: 20%    Downloading: 25%    Downloading: 35%    Downloading: 40%    Downloading: 45%    Downloading: 50%    Downloading: 55%    Downloading: 60%    Downloading: 65%    Downloading: 80%    Downloading: 85%    Downloading: 90%    Downloading: 95%    Downloading: 100%    Downloading: 100%
17-Apr-2017 02:06:04
17-Apr-2017 02:06:04   - Installing symfony/polyfill-mbstring (v1.3.0)
17-Apr-2017 02:06:05     Downloading: Connecting...    Downloading: 0%               Downloading: 35%    Downloading: 70%    Downloading: 100%    Downloading: 100%
17-Apr-2017 02:06:05
17-Apr-2017 02:06:05   - Installing symfony/http-foundation (v3.2.0)
17-Apr-2017 02:06:06     Downloading: Connecting...    Downloading: 0%               Downloading: 5%    Downloading: 10%    Downloading: 15%    Downloading: 20%    Downloading: 25%    Downloading: 30%    Downloading: 35%    Downloading: 40%    Downloading: 45%    Downloading: 50%    Downloading: 55%    Downloading: 60%    Downloading: 65%    Downloading: 70%    Downloading: 75%    Downloading: 80%    Downloading: 85%    Downloading: 90%    Downloading: 95%    Downloading: 100%    Downloading: 100%
17-Apr-2017 02:06:06
17-Apr-2017 02:06:06   - Installing symfony/event-dispatcher (v3.2.0)
17-Apr-2017 02:06:07     Downloading: Connecting...    Downloading: 0%               Downloading: 5%    Downloading: 10%    Downloading: 15%    Downloading: 65%    Downloading: 70%    Downloading: 75%    Downloading: 80%    Downloading: 85%    Downloading: 90%    Downloading: 100%    Downloading: 100%
17-Apr-2017 02:06:07
17-Apr-2017 02:06:08   - Installing psr/log (1.0.2)
17-Apr-2017 02:06:08     Downloading: Connecting...    Downloading: 0%               Downloading: 15%    Downloading: 100%    Downloading: 100%
17-Apr-2017 02:06:08
17-Apr-2017 02:06:08   - Installing symfony/debug (v3.2.0)
17-Apr-2017 02:06:09     Downloading: Connecting...    Downloading: 0%               Downloading: 5%    Downloading: 25%    Downloading: 30%    Downloading: 35%    Downloading: 40%    Downloading: 45%    Downloading: 80%    Downloading: 85%    Downloading: 100%    Downloading: 100%
17-Apr-2017 02:06:09
17-Apr-2017 02:06:09   - Installing symfony/http-kernel (v3.2.0)
17-Apr-2017 02:06:11     Downloading: Connecting...    Downloading: 0%               Downloading: 5%    Downloading: 10%    Downloading: 15%    Downloading: 20%    Downloading: 25%    Downloading: 30%    Downloading: 35%    Downloading: 40%    Downloading: 45%    Downloading: 50%    Downloading: 55%    Downloading: 60%    Downloading: 65%    Downloading: 70%    Downloading: 75%    Downloading: 80%    Downloading: 85%    Downloading: 90%    Downloading: 95%    Downloading: 100%    Downloading: 100%
17-Apr-2017 02:06:11
17-Apr-2017 02:06:11   - Installing symfony/dependency-injection (v3.2.0)
17-Apr-2017 02:06:12     Downloading: Connecting...    Downloading: 0%               Downloading: 5%    Downloading: 10%    Downloading: 15%    Downloading: 20%    Downloading: 25%    Downloading: 30%    Downloading: 35%    Downloading: 40%    Downloading: 45%    Downloading: 50%    Downloading: 55%    Downloading: 60%    Downloading: 65%    Downloading: 70%    Downloading: 75%    Downloading: 80%    Downloading: 85%    Downloading: 90%    Downloading: 95%    Downloading: 100%    Downloading: 100%
17-Apr-2017 02:06:12
17-Apr-2017 02:06:12   - Installing zendframework/zend-eventmanager (3.0.1)
17-Apr-2017 02:06:13     Downloading: Connecting...    Downloading: 0%               Downloading: 15%    Downloading: 30%    Downloading: 75%    Downloading: 90%    Downloading: 100%    Downloading: 100%
17-Apr-2017 02:06:13
17-Apr-2017 02:06:13   - Installing zendframework/zend-code (2.6.3)
17-Apr-2017 02:06:14     Downloading: Connecting...    Downloading: 0%               Downloading: 5%    Downloading: 10%    Downloading: 15%    Downloading: 20%    Downloading: 25%    Downloading: 30%    Downloading: 35%    Downloading: 40%    Downloading: 45%    Downloading: 55%    Downloading: 60%    Downloading: 65%    Downloading: 70%    Downloading: 75%    Downloading: 80%    Downloading: 85%    Downloading: 95%    Downloading: 100%    Downloading: 100%
17-Apr-2017 02:06:14
17-Apr-2017 02:06:14   - Installing ocramius/proxy-manager (1.0.2)
17-Apr-2017 02:06:16     Downloading: Connecting...    Downloading: 0%               Downloading: 5%    Downloading: 10%    Downloading: 15%    Downloading: 20%    Downloading: 25%    Downloading: 30%    Downloading: 35%    Downloading: 40%    Downloading: 45%    Downloading: 50%    Downloading: 55%    Downloading: 65%    Downloading: 70%    Downloading: 75%    Downloading: 80%    Downloading: 85%    Downloading: 90%    Downloading: 95%    Downloading: 100%    Downloading: 100%
17-Apr-2017 02:06:16
17-Apr-2017 02:06:16   - Installing symfony/proxy-manager-bridge (v3.2.0)
17-Apr-2017 02:06:17     Downloading: Connecting...    Downloading: 0%               Downloading: 25%    Downloading: 65%    Downloading: 100%    Downloading: 100%
17-Apr-2017 02:06:17
17-Apr-2017 02:06:17   - Installing symfony/routing (v3.2.0)
17-Apr-2017 02:06:18     Downloading: Connecting...    Downloading: 0%               Downloading: 5%    Downloading: 10%    Downloading: 15%    Downloading: 20%    Downloading: 25%    Downloading: 30%    Downloading: 35%    Downloading: 40%    Downloading: 45%    Downloading: 50%    Downloading: 55%    Downloading: 60%    Downloading: 65%    Downloading: 70%    Downloading: 75%    Downloading: 80%    Downloading: 85%    Downloading: 90%    Downloading: 95%    Downloading: 100%    Downloading: 100%
17-Apr-2017 02:06:18
17-Apr-2017 02:06:18   - Installing twig/twig (v1.24.2)
17-Apr-2017 02:06:20     Downloading: Connecting...    Downloading: 0%               Downloading: 5%    Downloading: 10%    Downloading: 15%    Downloading: 20%    Downloading: 25%    Downloading: 30%    Downloading: 35%    Downloading: 40%    Downloading: 45%    Downloading: 50%    Downloading: 55%    Downloading: 75%    Downloading: 80%    Downloading: 85%    Downloading: 90%    Downloading: 95%    Downloading: 100%    Downloading: 100%
17-Apr-2017 02:06:20
17-Apr-2017 02:06:20   - Installing symfony/twig-bridge (v3.1.4)
17-Apr-2017 02:06:21     Downloading: Connecting...    Downloading: 0%               Downloading: 10%    Downloading: 15%    Downloading: 25%    Downloading: 35%    Downloading: 45%    Downloading: 50%    Downloading: 55%    Downloading: 60%    Downloading: 70%    Downloading: 75%    Downloading: 80%    Downloading: 85%    Downloading: 95%    Downloading: 100%    Downloading: 100%
17-Apr-2017 02:06:21
17-Apr-2017 02:06:21   - Installing symfony/dom-crawler (v3.2.0)
17-Apr-2017 02:06:22     Downloading: Connecting...    Downloading: 0%               Downloading: 30%    Downloading: 35%    Downloading: 55%    Downloading: 60%    Downloading: 80%    Downloading: 85%    Downloading: 100%    Downloading: 100%
17-Apr-2017 02:06:22
17-Apr-2017 02:06:22   - Installing symfony/css-selector (v3.2.0)
17-Apr-2017 02:06:24     Downloading: Connecting...    Downloading: 0%               Downloading: 5%    Downloading: 10%    Downloading: 15%    Downloading: 20%    Downloading: 45%    Downloading: 50%    Downloading: 55%    Downloading: 100%
17-Apr-2017 02:06:24
17-Apr-2017 02:06:24   - Installing symfony/browser-kit (v3.2.0)
17-Apr-2017 02:06:25     Downloading: Connecting...    Downloading: 0%               Downloading: 50%    Downloading: 80%    Downloading: 85%    Downloading: 100%    Downloading: 100%
17-Apr-2017 02:06:25
17-Apr-2017 02:06:25   - Installing guzzlehttp/guzzle (6.2.2)
17-Apr-2017 02:06:26     Downloading: Connecting...    Downloading: 0%               Downloading: 5%    Downloading: 10%    Downloading: 15%    Downloading: 20%    Downloading: 25%    Downloading: 35%    Downloading: 40%    Downloading: 50%    Downloading: 55%    Downloading: 65%    Downloading: 70%    Downloading: 75%    Downloading: 80%    Downloading: 85%    Downloading: 95%    Downloading: 100%    Downloading: 100%
17-Apr-2017 02:06:26
17-Apr-2017 02:06:26   - Installing fabpot/goutte (v3.2.0)
17-Apr-2017 02:06:27     Downloading: Connecting...    Downloading: 0%               Downloading: 70%    Downloading: 100%    Downloading: 100%
17-Apr-2017 02:06:27
17-Apr-2017 02:06:27   - Installing facebook/webdriver (1.2.0)
17-Apr-2017 02:06:28     Downloading: Connecting...    Downloading: 0%               Downloading: 5%    Downloading: 10%    Downloading: 15%    Downloading: 20%    Downloading: 25%    Downloading: 30%    Downloading: 35%    Downloading: 40%    Downloading: 45%    Downloading: 50%    Downloading: 55%    Downloading: 60%    Downloading: 65%    Downloading: 70%    Downloading: 75%    Downloading: 80%    Downloading: 85%    Downloading: 90%    Downloading: 95%    Downloading: 100%    Downloading: 100%
17-Apr-2017 02:06:28
17-Apr-2017 02:06:28   - Installing symfony/process (v3.2.0)
17-Apr-2017 02:06:29     Downloading: Connecting...    Downloading: 0%               Downloading: 20%    Downloading: 35%    Downloading: 50%    Downloading: 75%    Downloading: 90%    Downloading: 95%    Downloading: 100%    Downloading: 100%
17-Apr-2017 02:06:29
17-Apr-2017 02:06:29   - Installing symfony/console (v3.2.0)
17-Apr-2017 02:06:30     Downloading: Connecting...    Downloading: 0%               Downloading: 5%    Downloading: 10%    Downloading: 15%    Downloading: 20%    Downloading: 25%    Downloading: 30%    Downloading: 35%    Downloading: 40%    Downloading: 45%    Downloading: 50%    Downloading: 55%    Downloading: 60%    Downloading: 65%    Downloading: 70%    Downloading: 75%    Downloading: 80%    Downloading: 85%    Downloading: 90%    Downloading: 95%    Downloading: 100%    Downloading: 100%
17-Apr-2017 02:06:30
17-Apr-2017 02:06:30   - Installing laravel/homestead (v4.0.5)
17-Apr-2017 02:06:31     Downloading: Connecting...    Downloading: 0%               Downloading: 5%    Downloading: 10%    Downloading: 70%    Downloading: 75%    Downloading: 80%    Downloading: 85%    Downloading: 100%    Downloading: 100%
17-Apr-2017 02:06:31
17-Apr-2017 02:06:32   - Installing phing/phing (2.4.14)
17-Apr-2017 02:06:33     Downloading: Connecting...    Downloading: 0%               Downloading: 5%    Downloading: 10%    Downloading: 15%    Downloading: 20%    Downloading: 25%    Downloading: 30%    Downloading: 35%    Downloading: 40%    Downloading: 45%    Downloading: 50%    Downloading: 55%    Downloading: 60%    Downloading: 65%    Downloading: 70%    Downloading: 75%    Downloading: 80%    Downloading: 85%    Downloading: 90%    Downloading: 95%    Downloading: 100%    Downloading: 100%
17-Apr-2017 02:06:33
17-Apr-2017 02:06:33   - Installing phpdocumentor/reflection-docblock (2.0.4)
17-Apr-2017 02:06:34     Downloading: Connecting...    Downloading: 0%               Downloading: 20%    Downloading: 25%    Downloading: 40%    Downloading: 45%    Downloading: 60%    Downloading: 65%    Downloading: 80%    Downloading: 85%    Downloading: 100%
17-Apr-2017 02:06:34
17-Apr-2017 02:06:34   - Installing phpdocumentor/reflection-common (1.0)
17-Apr-2017 02:06:35     Downloading: Connecting...    Downloading: 0%               Downloading: 65%    Downloading: 100%    Downloading: 100%
17-Apr-2017 02:06:35
17-Apr-2017 02:06:35   - Installing phpdocumentor/type-resolver (0.2.1)
17-Apr-2017 02:06:36     Downloading: Connecting...    Downloading: 0%               Downloading: 20%    Downloading: 35%    Downloading: 80%    Downloading: 100%    Downloading: 100%
17-Apr-2017 02:06:36
17-Apr-2017 02:06:36   - Installing symfony/yaml (v3.2.0)
17-Apr-2017 02:06:37     Downloading: Connecting...    Downloading: 0%               Downloading: 10%    Downloading: 15%    Downloading: 25%    Downloading: 30%    Downloading: 35%    Downloading: 45%    Downloading: 55%    Downloading: 70%    Downloading: 80%    Downloading: 95%    Downloading: 100%    Downloading: 100%
17-Apr-2017 02:06:37
17-Apr-2017 02:06:37   - Installing sebastian/version (1.0.6)
17-Apr-2017 02:06:38     Downloading: Connecting...    Downloading: 0%               Downloading: 100%    Downloading: 100%
17-Apr-2017 02:06:38
17-Apr-2017 02:06:38   - Installing sebastian/global-state (1.1.1)
17-Apr-2017 02:06:39     Downloading: Connecting...    Downloading: 0%               Downloading: 40%    Downloading: 70%    Downloading: 100%    Downloading: 100%
17-Apr-2017 02:06:39
17-Apr-2017 02:06:39   - Installing sebastian/recursion-context (1.0.2)
17-Apr-2017 02:06:40     Downloading: Connecting...    Downloading: 0%               Downloading: 35%    Downloading: 70%    Downloading: 100%    Downloading: 100%
17-Apr-2017 02:06:40
17-Apr-2017 02:06:40   - Installing sebastian/exporter (1.2.2)
17-Apr-2017 02:06:41     Downloading: Connecting...    Downloading: 0%               Downloading: 100%    Downloading: 100%
17-Apr-2017 02:06:41
17-Apr-2017 02:06:41   - Installing sebastian/environment (1.3.8)
17-Apr-2017 02:06:42     Downloading: Connecting...    Downloading: 0%               Downloading: 15%    Downloading: 30%    Downloading: 45%    Downloading: 60%    Downloading: 75%    Downloading: 100%    Downloading: 100%
17-Apr-2017 02:06:42
17-Apr-2017 02:06:42   - Installing sebastian/diff (1.4.1)
17-Apr-2017 02:06:43     Downloading: Connecting...    Downloading: 0%               Downloading: 15%    Downloading: 30%    Downloading: 45%    Downloading: 100%    Downloading: 100%
17-Apr-2017 02:06:43
17-Apr-2017 02:06:43   - Installing sebastian/comparator (1.2.2)
17-Apr-2017 02:06:44     Downloading: Connecting...    Downloading: 0%               Downloading: 10%    Downloading: 20%    Downloading: 30%    Downloading: 40%    Downloading: 45%    Downloading: 55%    Downloading: 65%    Downloading: 70%    Downloading: 80%    Downloading: 100%    Downloading: 100%
17-Apr-2017 02:06:44
17-Apr-2017 02:06:44   - Installing phpunit/php-text-template (1.2.1)
17-Apr-2017 02:06:45     Downloading: Connecting...    Downloading: 0%               Downloading: 35%    Downloading: 100%    Downloading: 100%
17-Apr-2017 02:06:45
17-Apr-2017 02:06:45   - Installing doctrine/instantiator (1.0.5)
17-Apr-2017 02:06:46     Downloading: Connecting...    Downloading: 0%               Downloading: 15%    Downloading: 30%    Downloading: 45%    Downloading: 50%    Downloading: 65%    Downloading: 80%    Downloading: 95%    Downloading: 100%    Downloading: 100%
17-Apr-2017 02:06:46
17-Apr-2017 02:06:46   - Installing phpunit/phpunit-mock-objects (2.3.8)
17-Apr-2017 02:06:47     Downloading: Connecting...    Downloading: 0%               Downloading: 5%    Downloading: 20%    Downloading: 25%    Downloading: 35%    Downloading: 40%    Downloading: 45%    Downloading: 50%    Downloading: 60%    Downloading: 65%    Downloading: 70%    Downloading: 75%    Downloading: 90%    Downloading: 95%    Downloading: 100%    Downloading: 100%
17-Apr-2017 02:06:47
17-Apr-2017 02:06:47   - Installing phpunit/php-timer (1.0.8)
17-Apr-2017 02:06:48     Downloading: Connecting...    Downloading: 0%               Downloading: 100%    Downloading: 100%
17-Apr-2017 02:06:48
17-Apr-2017 02:06:48   - Installing phpunit/php-file-iterator (1.4.2)
17-Apr-2017 02:06:49     Downloading: Connecting...    Downloading: 0%               Downloading: 20%    Downloading: 40%    Downloading: 60%    Downloading: 100%    Downloading: 100%
17-Apr-2017 02:06:49
17-Apr-2017 02:06:49   - Installing phpunit/php-token-stream (1.4.9)
17-Apr-2017 02:06:50     Downloading: Connecting...    Downloading: 0%               Downloading: 5%    Downloading: 10%    Downloading: 15%    Downloading: 20%    Downloading: 100%
17-Apr-2017 02:06:50
17-Apr-2017 02:06:50   - Installing phpunit/php-code-coverage (2.2.4)
17-Apr-2017 02:06:52     Downloading: Connecting...    Downloading: 0%               Downloading: 5%    Downloading: 10%    Downloading: 15%    Downloading: 20%    Downloading: 25%    Downloading: 30%    Downloading: 35%    Downloading: 40%    Downloading: 45%    Downloading: 50%    Downloading: 55%    Downloading: 60%    Downloading: 65%    Downloading: 75%    Downloading: 85%    Downloading: 90%    Downloading: 100%    Downloading: 100%
17-Apr-2017 02:06:52
17-Apr-2017 02:06:52   - Installing phpspec/prophecy (v1.6.2)
17-Apr-2017 02:06:53     Downloading: Connecting...    Downloading: 0%               Downloading: 5%    Downloading: 10%    Downloading: 15%    Downloading: 20%    Downloading: 25%    Downloading: 30%    Downloading: 35%    Downloading: 40%    Downloading: 45%    Downloading: 50%    Downloading: 55%    Downloading: 60%    Downloading: 65%    Downloading: 70%    Downloading: 75%    Downloading: 80%    Downloading: 85%    Downloading: 90%    Downloading: 95%    Downloading: 100%    Downloading: 100%
17-Apr-2017 02:06:53
17-Apr-2017 02:06:53   - Installing phpunit/phpunit (4.8.31)
17-Apr-2017 02:06:54     Downloading: Connecting...    Downloading: 0%               Downloading: 5%    Downloading: 10%    Downloading: 15%    Downloading: 20%    Downloading: 25%    Downloading: 30%    Downloading: 35%    Downloading: 40%    Downloading: 45%    Downloading: 50%    Downloading: 55%    Downloading: 60%    Downloading: 65%    Downloading: 70%    Downloading: 75%    Downloading: 80%    Downloading: 85%    Downloading: 90%    Downloading: 95%    Downloading: 100%    Downloading: 100%
17-Apr-2017 02:06:54
17-Apr-2017 02:06:54   - Installing phpunit/dbunit (2.0.3)
17-Apr-2017 02:06:56     Downloading: Connecting...    Downloading: 0%               Downloading: 5%    Downloading: 10%    Downloading: 15%    Downloading: 20%    Downloading: 25%    Downloading: 30%    Downloading: 35%    Downloading: 40%    Downloading: 45%    Downloading: 50%    Downloading: 55%    Downloading: 60%    Downloading: 65%    Downloading: 70%    Downloading: 75%    Downloading: 80%    Downloading: 85%    Downloading: 90%    Downloading: 95%    Downloading: 100%    Downloading: 100%
17-Apr-2017 02:06:56
17-Apr-2017 02:06:56   - Installing squizlabs/php_codesniffer (2.7.1)
17-Apr-2017 02:06:57     Downloading: Connecting...    Downloading: 0%               Downloading: 5%    Downloading: 10%    Downloading: 15%    Downloading: 20%    Downloading: 25%    Downloading: 30%    Downloading: 35%    Downloading: 40%    Downloading: 45%    Downloading: 50%    Downloading: 55%    Downloading: 60%    Downloading: 65%    Downloading: 70%    Downloading: 75%    Downloading: 80%    Downloading: 85%    Downloading: 95%    Downloading: 100%    Downloading: 100%
17-Apr-2017 02:06:57
17-Apr-2017 02:06:57   - Installing webmozart/assert (1.2.0)
17-Apr-2017 02:06:59     Downloading: Connecting...    Downloading: 0%               Downloading: 55%    Downloading: 80%    Downloading: 100%    Downloading: 100%
17-Apr-2017 02:06:59
17-Apr-2017 02:07:00 lusitanian/oauth suggests installing predis/predis (Allows using the Redis storage backend.)
17-Apr-2017 02:07:00 paragonie/random_compat suggests installing ext-libsodium (Provides a modern crypto API that can be used to generate random bytes.)
17-Apr-2017 02:07:00 patchwork/utf8 suggests installing ext-intl (Use Intl for best performance)
17-Apr-2017 02:07:00 patchwork/utf8 suggests installing ext-wfio (Use WFIO for UTF-8 filesystem access on Windows)
17-Apr-2017 02:07:00 s9e/text-formatter suggests installing ext-intl (Allows international URLs to be accepted by the URL filter)
17-Apr-2017 02:07:00 s9e/text-formatter suggests installing ext-xsl (Enables the XSLT renderer)
17-Apr-2017 02:07:00 symfony/http-kernel suggests installing symfony/class-loader ()
17-Apr-2017 02:07:00 symfony/http-kernel suggests installing symfony/var-dumper ()
17-Apr-2017 02:07:00 symfony/dependency-injection suggests installing symfony/expression-language (For using expressions in service container configuration)
17-Apr-2017 02:07:00 zendframework/zend-eventmanager suggests installing container-interop/container-interop (^1.1.0, to use the lazy listeners feature)
17-Apr-2017 02:07:00 zendframework/zend-eventmanager suggests installing zendframework/zend-stdlib (^2.7.3 || ^3.0, to use the FilterChain feature)
17-Apr-2017 02:07:00 zendframework/zend-code suggests installing doctrine/annotations (Doctrine\Common\Annotations >=1.0 for annotation features)
17-Apr-2017 02:07:00 zendframework/zend-code suggests installing zendframework/zend-stdlib (Zend\Stdlib component)
17-Apr-2017 02:07:00 ocramius/proxy-manager suggests installing ocramius/generated-hydrator (To have very fast object to array to object conversion for ghost objects)
17-Apr-2017 02:07:00 ocramius/proxy-manager suggests installing zendframework/zend-json (To have the JsonRpc adapter (Remote Object feature))
17-Apr-2017 02:07:00 ocramius/proxy-manager suggests installing zendframework/zend-soap (To have the Soap adapter (Remote Object feature))
17-Apr-2017 02:07:00 ocramius/proxy-manager suggests installing zendframework/zend-stdlib (To use the hydrator proxy)
17-Apr-2017 02:07:00 ocramius/proxy-manager suggests installing zendframework/zend-xmlrpc (To have the XmlRpc adapter (Remote Object feature))
17-Apr-2017 02:07:00 symfony/routing suggests installing doctrine/annotations (For using the annotation loader)
17-Apr-2017 02:07:00 symfony/routing suggests installing symfony/expression-language (For using expression matching)
17-Apr-2017 02:07:00 symfony/twig-bridge suggests installing symfony/asset (For using the AssetExtension)
17-Apr-2017 02:07:00 symfony/twig-bridge suggests installing symfony/expression-language (For using the ExpressionExtension)
17-Apr-2017 02:07:00 symfony/twig-bridge suggests installing symfony/form (For using the FormExtension)
17-Apr-2017 02:07:00 symfony/twig-bridge suggests installing symfony/security (For using the SecurityExtension)
17-Apr-2017 02:07:00 symfony/twig-bridge suggests installing symfony/stopwatch (For using the StopwatchExtension)
17-Apr-2017 02:07:00 symfony/twig-bridge suggests installing symfony/templating (For using the TwigEngine)
17-Apr-2017 02:07:00 symfony/twig-bridge suggests installing symfony/translation (For using the TranslationExtension)
17-Apr-2017 02:07:00 symfony/twig-bridge suggests installing symfony/var-dumper (For using the DumpExtension)
17-Apr-2017 02:07:00 facebook/webdriver suggests installing phpdocumentor/phpdocumentor (2.*)
17-Apr-2017 02:07:00 phpdocumentor/reflection-docblock suggests installing dflydev/markdown (~1.0)
17-Apr-2017 02:07:00 phpdocumentor/reflection-docblock suggests installing erusev/parsedown (~1.0)
17-Apr-2017 02:07:00 sebastian/global-state suggests installing ext-uopz (*)
17-Apr-2017 02:07:00 phpunit/phpunit-mock-objects suggests installing ext-soap (*)
17-Apr-2017 02:07:00 phpunit/phpunit suggests installing phpunit/php-invoker (~1.1)
17-Apr-2017 02:07:00 Generating autoload files
17-Apr-2017 02:07:00 Buildfile: /data/build/build.xml
17-Apr-2017 02:07:01
17-Apr-2017 02:07:01 phpBB > clean:
17-Apr-2017 02:07:01
17-Apr-2017 02:07:01    [delete] Directory /data/build/logs does not exist or is not a directory.
17-Apr-2017 02:07:01    [delete] Directory /data/build/api does not exist or is not a directory.
17-Apr-2017 02:07:01    [delete] Directory /data/build/codebrowser does not exist or is not a directory.
17-Apr-2017 02:07:01    [delete] Directory /data/build/coverage does not exist or is not a directory.
17-Apr-2017 02:07:01    [delete] Directory /data/build/cpd does not exist or is not a directory.
17-Apr-2017 02:07:01    [delete] Directory /data/build/dependencies does not exist or is not a directory.
17-Apr-2017 02:07:01    [delete] Directory /data/build/new_version does not exist or is not a directory.
17-Apr-2017 02:07:01    [delete] Directory /data/build/old_versions does not exist or is not a directory.
17-Apr-2017 02:07:01    [delete] Directory /data/build/save does not exist or is not a directory.
17-Apr-2017 02:07:01
17-Apr-2017 02:07:01 phpBB > prepare:
17-Apr-2017 02:07:01
17-Apr-2017 02:07:01     [mkdir] Created dir: /data/build/logs
17-Apr-2017 02:07:01     [mkdir] Created dir: /data/build/api
17-Apr-2017 02:07:01     [mkdir] Created dir: /data/build/codebrowser
17-Apr-2017 02:07:01     [mkdir] Created dir: /data/build/coverage
17-Apr-2017 02:07:01     [mkdir] Created dir: /data/build/cpd
17-Apr-2017 02:07:01     [mkdir] Created dir: /data/build/dependencies
17-Apr-2017 02:07:01     [mkdir] Created dir: /data/build/new_version
17-Apr-2017 02:07:01     [mkdir] Created dir: /data/build/new_version/files
17-Apr-2017 02:07:01     [mkdir] Created dir: /data/build/new_version/patches
17-Apr-2017 02:07:01     [mkdir] Created dir: /data/build/new_version/release_files
17-Apr-2017 02:07:01     [mkdir] Created dir: /data/build/new_version/update
17-Apr-2017 02:07:01     [mkdir] Created dir: /data/build/old_versions
17-Apr-2017 02:07:01     [mkdir] Created dir: /data/build/save
17-Apr-2017 02:07:01
17-Apr-2017 02:07:01 BUILD FINISHED
17-Apr-2017 02:07:01
17-Apr-2017 02:07:01 Total time: 0.1126 seconds
17-Apr-2017 02:07:01
17-Apr-2017 02:07:01 Finished task 'Prepare directory' with result: Success
17-Apr-2017 02:07:01 Skipping execution of task 'Run sniffs' as it is disabled
17-Apr-2017 02:07:01
Substituting variable: ${bamboo.working.directory} with /home/bamboo/xml-data/build-dir/PHPBB3-PR-JOB1
17-Apr-2017 02:07:01 Starting task 'Run sniffs' of type 'com.atlassian.bamboo.plugins.bamboo-docker-plugin:task.docker.cli'
17-Apr-2017 02:07:01 Running image name (phpbb:php-5.6)
17-Apr-2017 02:07:01
Beginning to execute external process for build 'phpBB3 - Pull Requests - Build and Test Job #6990 (PHPBB3-PR-JOB1-6990)'
... running command line:
/usr/bin/docker run --volume /home/bamboo/xml-data/build-dir/PHPBB3-PR-JOB1:/data --workdir /data/build --rm -u=991 phpbb:php-5.6 ../phpBB/vendor/bin/phing sniff
... in: /home/bamboo/xml-data/build-dir/PHPBB3-PR-JOB1
... using extra environment variables:
bamboo_planRepository_1_branch=3.1.x
bamboo_planRepository_1_branchDisplayName=3.1.x
bamboo_repository_revision_number=1cbc6dedab1e5d02872d9ed185125383abd96de1
bamboo_PRref=master
bamboo_resultsUrl=https://bamboo.phpbb.com/browse/PHPBB3-PR-JOB1-6990
bamboo_capability_system_builder_command_Git=/usr/bin/git
bamboo_repository_75956235_git_username=bantu
bamboo_planRepository_1_name=phpBB Ascraeus
bamboo_build_working_directory=/home/bamboo/xml-data/build-dir/PHPBB3-PR-JOB1
bamboo_buildKey=PHPBB3-PR-JOB1
bamboo_capability_phpbb_tests=true
bamboo_shortPlanName=Pull Requests
bamboo_capability_system_builder_command_fop=/usr/bin/fop
bamboo_capability_dbms_sqlite_2=true
bamboo_planRepository_name=phpBB Ascraeus
bamboo_PRnumber=4789
bamboo_buildNumber=6990
bamboo_repository_75956235_git_repositoryUrl=https://github.com/phpbb/phpbb.git
bamboo_capability_system_builder_phpunit_PHPUnit=/usr/bin/phpunit
bamboo_shortJobName=Build and Test Job
bamboo_buildResultsUrl=https://bamboo.phpbb.com/browse/PHPBB3-PR-JOB1-6990
bamboo_repository_75956235_branch_name=3.1.x
bamboo_planRepository_repositoryUrl=https://github.com/phpbb/phpbb.git
bamboo_agentId=131073
bamboo_planName=phpBB3 - Pull Requests
bamboo_build_commandline_com_atlassian_bamboo_plugins_scripttask_task_builder_script_7=/bin/sh /home/bamboo/temp/PHPBB3-PR-JOB1-6990-ScriptBuildTask-7699644163196756359.sh
bamboo_shortPlanKey=PR
bamboo_shortJobKey=JOB1
bamboo_capability_dbms_mysql_55=true
bamboo_capability_system_jdk_JDK_1_7_0_65=/usr/lib/jvm/java-7-openjdk-amd64
bamboo_planRepository_revision=1cbc6dedab1e5d02872d9ed185125383abd96de1
bamboo_repository_previous_revision_number=1cbc6dedab1e5d02872d9ed185125383abd96de1
bamboo_buildTimeStamp=2017-04-17T02:05:42.797Z
bamboo_planRepository_previousRevision=1cbc6dedab1e5d02872d9ed185125383abd96de1
bamboo_capability_system_builder_mvn2_Maven_2=/usr/share/maven2
bamboo_capability_system_jdk_JDK_1_6_0_16=/usr/lib/jvm/java-6-sun-1.6.0.16
bamboo_build_commandline_com_atlassian_bamboo_plugins_scripttask_task_builder_script_4=/bin/sh /home/bamboo/temp/PHPBB3-PR-JOB1-6990-ScriptBuildTask-6437325382177721470.sh
bamboo_buildResultKey=PHPBB3-PR-JOB1-6990
bamboo_repository_git_branch=3.1.x
bamboo_repository_branch_name=3.1.x
bamboo_buildPlanName=phpBB3 - Pull Requests - Build and Test Job
bamboo_planRepository_1_revision=1cbc6dedab1e5d02872d9ed185125383abd96de1
bamboo_repository_name=phpBB Ascraeus
bamboo_capability_system_docker_executable=/usr/bin/docker
bamboo_build_commandline_com_atlassian_bamboo_plugins_bamboo_docker_plugin_task_docker_cli_12=/usr/bin/docker run --volume /home/bamboo/xml-data/build-dir/PHPBB3-PR-JOB1:/data --workdir /data/phpBB --rm -e HOME=/home/bamboo -u=991 phpbb:php-5.6 /bin/bash -c php ../composer.phar install --dev; cd ../build; ../phpBB/vendor/bin/phing clean prepare
bamboo_planRepository_branch=3.1.x
bamboo_agentWorkingDirectory=/home/bamboo/xml-data/build-dir
bamboo_capability_system_git_executable=/usr/bin/git
bamboo_planRepository_1_previousRevision=1cbc6dedab1e5d02872d9ed185125383abd96de1
bamboo_capability_system_builder_phpunit_PHPUnit_3_4=/usr/bin/phpunit
bamboo_repository_git_username=bantu
bamboo_repository_75956235_revision_number=1cbc6dedab1e5d02872d9ed185125383abd96de1
bamboo_planRepository_branchDisplayName=3.1.x
bamboo_planRepository_1_type=gitv2
bamboo_planRepository_branchName=3.1.x
bamboo_repository_75956235_previous_revision_number=1cbc6dedab1e5d02872d9ed185125383abd96de1
bamboo_capability_system_jdk_JDK=/usr/lib/jvm/java-6-sun
bamboo_plan_storageTag=PHPBB3-PR
bamboo_planRepository_type=gitv2
bamboo_planRepository_1_username=bantu
bamboo_ManualBuildTriggerReason_userName=Build Robot
bamboo_repository_git_repositoryUrl=https://github.com/phpbb/phpbb.git
bamboo_repository_75956235_git_branch=3.1.x
bamboo_capability_system_builder_ant_Ant=/usr/share/ant
bamboo_repository_75956235_name=phpBB Ascraeus
bamboo_working_directory=/home/bamboo/xml-data/build-dir/PHPBB3-PR-JOB1
bamboo_planKey=PHPBB3-PR
bamboo_planRepository_1_repositoryUrl=https://github.com/phpbb/phpbb.git
bamboo_planRepository_username=bantu
bamboo_capability_local=true
bamboo_capability_system_jdk_JDK_1_6=/usr/lib/jvm/java-6-sun
bamboo_capability_system_jdk_JDK_1_7=/usr/lib/jvm/java-7-openjdk-amd64
bamboo_planRepository_1_branchName=3.1.x
17-Apr-2017 02:07:01 Buildfile: /data/build/build.xml
17-Apr-2017 02:07:01
17-Apr-2017 02:07:01 phpBB > sniff:
17-Apr-2017 02:07:01
17-Apr-2017 02:07:09 ............................................................  60 / 688 (9%)
17-Apr-2017 02:07:10 ............................................................ 120 / 688 (17%)
17-Apr-2017 02:07:11 ............................................................ 180 / 688 (26%)
17-Apr-2017 02:07:13 ............................................................ 240 / 688 (35%)
17-Apr-2017 02:07:18 .........................E.................................. 300 / 688 (44%)
17-Apr-2017 02:07:22 ............................................................ 360 / 688 (52%)
17-Apr-2017 02:07:28 ............................................................ 420 / 688 (61%)
17-Apr-2017 02:07:32 ............................................................ 480 / 688 (70%)
17-Apr-2017 02:07:36 ............................................................ 540 / 688 (78%)
17-Apr-2017 02:07:40 ............................................................ 600 / 688 (87%)
17-Apr-2017 02:07:43 ............................................................ 660 / 688 (96%)
17-Apr-2017 02:07:44 ............................
17-Apr-2017 02:07:44
17-Apr-2017 02:07:44
17-Apr-2017 02:07:44 FILE: /data/phpBB/phpbb/console/command/style/show.php
17-Apr-2017 02:07:44 ----------------------------------------------------------------------
17-Apr-2017 02:07:44 FOUND 2 ERRORS AFFECTING 2 LINES
17-Apr-2017 02:07:44 ----------------------------------------------------------------------
17-Apr-2017 02:07:44 35 | ERROR | [x] Each PHP statement must be on a line by itself
17-Apr-2017 02:07:44     |       |     (Generic.Formatting.DisallowMultipleStatements.SameLine)
17-Apr-2017 02:07:44 40 | ERROR | [x] Each PHP statement must be on a line by itself
17-Apr-2017 02:07:44     |       |     (Generic.Formatting.DisallowMultipleStatements.SameLine)
17-Apr-2017 02:07:44 ----------------------------------------------------------------------
17-Apr-2017 02:07:44 PHPCBF CAN FIX THE 2 MARKED SNIFF VIOLATIONS AUTOMATICALLY
17-Apr-2017 02:07:44 ----------------------------------------------------------------------
17-Apr-2017 02:07:44
17-Apr-2017 02:07:44 Time: 42.67 secs; Memory: 77.5Mb
17-Apr-2017 02:07:44
17-Apr-2017 02:07:52 ............................................................  60 / 206 (29%)
17-Apr-2017 02:08:11 ............................................................ 120 / 206 (58%)
17-Apr-2017 02:08:26 ............................................................ 180 / 206 (87%)
17-Apr-2017 02:08:33 ..........................
17-Apr-2017 02:08:33
17-Apr-2017 02:08:33 Time: 48.8 secs; Memory: 60.5Mb
17-Apr-2017 02:08:33
17-Apr-2017 02:08:33
17-Apr-2017 02:08:33
17-Apr-2017 02:08:33 Time: 17ms; Memory: 3.75Mb
17-Apr-2017 02:08:33
17-Apr-2017 02:08:33        [if] Error in IfTask
17-Apr-2017 02:08:33 Execution of target "sniff" failed for the following reason: /data/build/build.xml:108:6: /data/build/build.xml:114:9: PHP Code Sniffer failed.
17-Apr-2017 02:08:33
17-Apr-2017 02:08:33 BUILD FAILED
17-Apr-2017 02:08:33 /data/build/build.xml:108:6: /data/build/build.xml:114:9: PHP Code Sniffer failed.
17-Apr-2017 02:08:33 Total time: 2 minutes  31.87 seconds
17-Apr-2017 02:08:33
17-Apr-2017 02:08:33 Failing task since return code of [/usr/bin/docker run --volume /home/bamboo/xml-data/build-dir/PHPBB3-PR-JOB1:/data --workdir /data/build --rm -u=991 phpbb:php-5.6 ../phpBB/vendor/bin/phing sniff] was 1 while expected 0
17-Apr-2017 02:08:33 Error occurred while running Task 'Run sniffs(11)' of type com.atlassian.bamboo.plugins.bamboo-docker-plugin:task.docker.cli.
17-Apr-2017 02:08:33 com.atlassian.bamboo.task.TaskException: Failed to execute task
17-Apr-2017 02:08:33         at com.atlassian.bamboo.plugins.docker.service.RunService.execute(RunService.java:71)
17-Apr-2017 02:08:33         at com.atlassian.bamboo.plugins.docker.tasks.cli.DockerCliTask.execute(DockerCliTask.java:60)
17-Apr-2017 02:08:33         at com.atlassian.bamboo.task.TaskExecutorImpl.lambda$executeTasks$3(TaskExecutorImpl.java:317)
17-Apr-2017 02:08:33         at com.atlassian.bamboo.task.TaskExecutorImpl.executeTaskWithPrePostActions(TaskExecutorImpl.java:246)
17-Apr-2017 02:08:33         at com.atlassian.bamboo.task.TaskExecutorImpl.executeTasks(TaskExecutorImpl.java:317)
17-Apr-2017 02:08:33         at com.atlassian.bamboo.task.TaskExecutorImpl.execute(TaskExecutorImpl.java:118)
17-Apr-2017 02:08:33         at com.atlassian.bamboo.build.pipeline.tasks.ExecuteBuildTask.call(ExecuteBuildTask.java:74)
17-Apr-2017 02:08:33         at com.atlassian.bamboo.v2.build.agent.DefaultBuildAgent.build(DefaultBuildAgent.java:216)
17-Apr-2017 02:08:33         at com.atlassian.bamboo.v2.build.agent.BuildAgentControllerImpl$1.call(BuildAgentControllerImpl.java:139)
17-Apr-2017 02:08:33         at com.atlassian.bamboo.v2.build.agent.BuildAgentControllerImpl$1.call(BuildAgentControllerImpl.java:130)
17-Apr-2017 02:08:33         at com.atlassian.bamboo.variable.CustomVariableContextImpl.withVariableSubstitutor(CustomVariableContextImpl.java:221)
17-Apr-2017 02:08:33         at com.atlassian.bamboo.v2.build.agent.BuildAgentControllerImpl.waitAndPerformBuild(BuildAgentControllerImpl.java:129)
17-Apr-2017 02:08:33         at com.atlassian.bamboo.v2.build.agent.DefaultBuildAgent$1.run(DefaultBuildAgent.java:138)
17-Apr-2017 02:08:33         at com.atlassian.bamboo.utils.BambooRunnables$1.run(BambooRunnables.java:51)
17-Apr-2017 02:08:33         at com.atlassian.bamboo.security.ImpersonationHelper.runWith(ImpersonationHelper.java:31)
17-Apr-2017 02:08:33         at com.atlassian.bamboo.security.ImpersonationHelper.runWithSystemAuthority(ImpersonationHelper.java:20)
17-Apr-2017 02:08:33         at com.atlassian.bamboo.security.ImpersonationHelper$1.run(ImpersonationHelper.java:52)
17-Apr-2017 02:08:33         at java.lang.Thread.run(Thread.java:745)
17-Apr-2017 02:08:33 Caused by: com.atlassian.bamboo.plugins.docker.client.DockerException: Error running Docker run command
17-Apr-2017 02:08:33         at com.atlassian.bamboo.plugins.docker.client.DockerCmd.run(DockerCmd.java:103)
17-Apr-2017 02:08:33         at com.atlassian.bamboo.plugins.docker.service.RunService.execute(RunService.java:60)
17-Apr-2017 02:08:33         ... 17 more
17-Apr-2017 02:08:33 Caused by: com.atlassian.utils.process.ProcessException: Error executing /usr/bin/docker run --volume /home/bamboo/xml-data/build-dir/PHPBB3-PR-JOB1:/data --workdir /data/build --rm -u=991 phpbb:php-5.6 ../phpBB/vendor/bin/phing sniff
17-Apr-2017 02:08:33         at com.atlassian.bamboo.plugins.docker.process.DockerTaskProcessService.execute(DockerTaskProcessService.java:60)
17-Apr-2017 02:08:33         at com.atlassian.bamboo.plugins.docker.client.DockerCmd.run(DockerCmd.java:99)
17-Apr-2017 02:08:33         ... 18 more
17-Apr-2017 02:08:33 Starting task 'Parsing test results produced by script' of type 'com.atlassian.bamboo.plugins.testresultparser:task.testresultparser.junit'
17-Apr-2017 02:08:33 Parsing test results under /home/bamboo/xml-data/build-dir/PHPBB3-PR-JOB1...
17-Apr-2017 02:08:33 Failing task since test cases were expected but none were found.
17-Apr-2017 02:08:33 Finished task 'Parsing test results produced by script' with result: Failed
17-Apr-2017 02:08:33
Substituting variable: ${bamboo.PRnumber} with 4789
17-Apr-2017 02:08:33
Substituting variable: ${bamboo.buildResultsUrl} with https://bamboo.phpbb.com/browse/PHPBB3-PR-JOB1-6990
17-Apr-2017 02:08:33
Substituting variable: ${bamboo.buildResultsUrl} with https://bamboo.phpbb.com/browse/PHPBB3-PR-JOB1-6990
17-Apr-2017 02:08:33 Starting task 'Set result build status' of type 'com.atlassian.bamboo.plugins.scripttask:task.builder.script'
17-Apr-2017 02:08:33
Beginning to execute external process for build 'phpBB3 - Pull Requests - Build and Test Job #6990 (PHPBB3-PR-JOB1-6990)'
... running command line:
/bin/sh /home/bamboo/temp/PHPBB3-PR-JOB1-6990-ScriptBuildTask-7594265527074163939.sh
... in: /home/bamboo/xml-data/build-dir/PHPBB3-PR-JOB1
... using extra environment variables:
bamboo_planRepository_1_branch=3.1.x
bamboo_planRepository_1_branchDisplayName=3.1.x
bamboo_repository_revision_number=1cbc6dedab1e5d02872d9ed185125383abd96de1
bamboo_PRref=master
bamboo_resultsUrl=https://bamboo.phpbb.com/browse/PHPBB3-PR-JOB1-6990
bamboo_capability_system_builder_command_Git=/usr/bin/git
bamboo_repository_75956235_git_username=bantu
bamboo_planRepository_1_name=phpBB Ascraeus
bamboo_build_working_directory=/home/bamboo/xml-data/build-dir/PHPBB3-PR-JOB1
bamboo_buildKey=PHPBB3-PR-JOB1
bamboo_capability_phpbb_tests=true
bamboo_shortPlanName=Pull Requests
bamboo_capability_system_builder_command_fop=/usr/bin/fop
bamboo_capability_dbms_sqlite_2=true
bamboo_planRepository_name=phpBB Ascraeus
bamboo_PRnumber=4789
bamboo_buildNumber=6990
bamboo_repository_75956235_git_repositoryUrl=https://github.com/phpbb/phpbb.git
bamboo_capability_system_builder_phpunit_PHPUnit=/usr/bin/phpunit
bamboo_shortJobName=Build and Test Job
bamboo_buildResultsUrl=https://bamboo.phpbb.com/browse/PHPBB3-PR-JOB1-6990
bamboo_repository_75956235_branch_name=3.1.x
bamboo_planRepository_repositoryUrl=https://github.com/phpbb/phpbb.git
bamboo_agentId=131073
bamboo_planName=phpBB3 - Pull Requests
bamboo_build_commandline_com_atlassian_bamboo_plugins_scripttask_task_builder_script_7=/bin/sh /home/bamboo/temp/PHPBB3-PR-JOB1-6990-ScriptBuildTask-7699644163196756359.sh
bamboo_shortPlanKey=PR
bamboo_shortJobKey=JOB1
bamboo_capability_dbms_mysql_55=true
bamboo_capability_system_jdk_JDK_1_7_0_65=/usr/lib/jvm/java-7-openjdk-amd64
bamboo_planRepository_revision=1cbc6dedab1e5d02872d9ed185125383abd96de1
bamboo_repository_previous_revision_number=1cbc6dedab1e5d02872d9ed185125383abd96de1
bamboo_buildTimeStamp=2017-04-17T02:05:42.797Z
bamboo_planRepository_previousRevision=1cbc6dedab1e5d02872d9ed185125383abd96de1
bamboo_capability_system_builder_mvn2_Maven_2=/usr/share/maven2
bamboo_capability_system_jdk_JDK_1_6_0_16=/usr/lib/jvm/java-6-sun-1.6.0.16
bamboo_build_commandline_com_atlassian_bamboo_plugins_scripttask_task_builder_script_4=/bin/sh /home/bamboo/temp/PHPBB3-PR-JOB1-6990-ScriptBuildTask-6437325382177721470.sh
bamboo_buildResultKey=PHPBB3-PR-JOB1-6990
bamboo_repository_git_branch=3.1.x
bamboo_repository_branch_name=3.1.x
bamboo_buildPlanName=phpBB3 - Pull Requests - Build and Test Job
bamboo_planRepository_1_revision=1cbc6dedab1e5d02872d9ed185125383abd96de1
bamboo_repository_name=phpBB Ascraeus
bamboo_capability_system_docker_executable=/usr/bin/docker
bamboo_build_commandline_com_atlassian_bamboo_plugins_bamboo_docker_plugin_task_docker_cli_11=/usr/bin/docker run --volume /home/bamboo/xml-data/build-dir/PHPBB3-PR-JOB1:/data --workdir /data/build --rm -u=991 phpbb:php-5.6 ../phpBB/vendor/bin/phing sniff
bamboo_build_commandline_com_atlassian_bamboo_plugins_bamboo_docker_plugin_task_docker_cli_12=/usr/bin/docker run --volume /home/bamboo/xml-data/build-dir/PHPBB3-PR-JOB1:/data --workdir /data/phpBB --rm -e HOME=/home/bamboo -u=991 phpbb:php-5.6 /bin/bash -c php ../composer.phar install --dev; cd ../build; ../phpBB/vendor/bin/phing clean prepare
bamboo_planRepository_branch=3.1.x
bamboo_agentWorkingDirectory=/home/bamboo/xml-data/build-dir
bamboo_capability_system_git_executable=/usr/bin/git
bamboo_planRepository_1_previousRevision=1cbc6dedab1e5d02872d9ed185125383abd96de1
bamboo_capability_system_builder_phpunit_PHPUnit_3_4=/usr/bin/phpunit
bamboo_repository_git_username=bantu
bamboo_repository_75956235_revision_number=1cbc6dedab1e5d02872d9ed185125383abd96de1
bamboo_planRepository_branchDisplayName=3.1.x
bamboo_planRepository_1_type=gitv2
bamboo_planRepository_branchName=3.1.x
bamboo_repository_75956235_previous_revision_number=1cbc6dedab1e5d02872d9ed185125383abd96de1
bamboo_capability_system_jdk_JDK=/usr/lib/jvm/java-6-sun
bamboo_plan_storageTag=PHPBB3-PR
bamboo_planRepository_type=gitv2
bamboo_planRepository_1_username=bantu
bamboo_ManualBuildTriggerReason_userName=Build Robot
bamboo_repository_git_repositoryUrl=https://github.com/phpbb/phpbb.git
bamboo_repository_75956235_git_branch=3.1.x
bamboo_capability_system_builder_ant_Ant=/usr/share/ant
bamboo_repository_75956235_name=phpBB Ascraeus
bamboo_working_directory=/home/bamboo/xml-data/build-dir/PHPBB3-PR-JOB1
bamboo_planKey=PHPBB3-PR
bamboo_planRepository_1_repositoryUrl=https://github.com/phpbb/phpbb.git
bamboo_planRepository_username=bantu
bamboo_capability_local=true
bamboo_capability_system_jdk_JDK_1_6=/usr/lib/jvm/java-6-sun
bamboo_capability_system_jdk_JDK_1_7=/usr/lib/jvm/java-7-openjdk-amd64
bamboo_planRepository_1_branchName=3.1.x
17-Apr-2017 02:08:33 From https://github.com/phpbb/phpbb
17-Apr-2017 02:08:33 * branch            refs/pull/4789/head -> FETCH_HEAD
17-Apr-2017 02:08:33 grep: build/logs/phpunit.xml: No such file or directory
17-Apr-2017 02:08:33 grep: build/logs/phpunit.xml: No such file or directory
17-Apr-2017 02:08:33   % Total    % Received % Xferd  Average Speed   Time    Time     Time  Current
17-Apr-2017 02:08:33                                  Dload  Upload   Total   Spent    Left  Speed
17-Apr-2017 02:08:33
17-Apr-2017 02:08:34   0     0    0     0    0     0      0      0 --:--:-- --:--:-- --:--:--     0
17-Apr-2017 02:08:34   0     0    0     0    0     0      0      0 --:--:-- --:--:-- --:--:--     0
17-Apr-2017 02:08:34 100   273  100    93  100   180    128    248 --:--:-- --:--:-- --:--:--   248
17-Apr-2017 02:08:34 Finished task 'Set result build status' with result: Success
17-Apr-2017 02:08:34 Running post build plugin 'NCover Results Collector'
17-Apr-2017 02:08:34 Running post build plugin 'Artifact Copier'
17-Apr-2017 02:08:34 Running post build plugin 'npm Cache Cleanup'
17-Apr-2017 02:08:34 Running post build plugin 'Clover Results Collector'
17-Apr-2017 02:08:34 Running post build plugin 'Docker Container Cleanup'
17-Apr-2017 02:08:34 Successfully removed working directory at '/home/bamboo/xml-data/build-dir/PHPBB3-PR-JOB1'
17-Apr-2017 02:08:34 Finalising the build...
17-Apr-2017 02:08:34 Stopping timer.
17-Apr-2017 02:08:34 Build PHPBB3-PR-JOB1-6990 completed.
17-Apr-2017 02:08:34 Running on server: post build plugin 'NCover Results Collector'
17-Apr-2017 02:08:34 Running on server: post build plugin 'Build Hanging Detection Configuration'
17-Apr-2017 02:08:34 Running on server: post build plugin 'Clover Delta Calculator'
17-Apr-2017 02:08:34 Running on server: post build plugin 'Maven Dependencies Postprocessor'
17-Apr-2017 02:08:34 All post build plugins have finished
17-Apr-2017 02:08:34 Generating build results summary...
17-Apr-2017 02:08:34 Saving build results to disk...
17-Apr-2017 02:08:34 Logging substituted variables...
17-Apr-2017 02:08:34 Indexing build results...
17-Apr-2017 02:08:35 Finished building PHPBB3-PR-JOB1-6990.
17-Apr-2017 02:08:35
Substituting variable: ${bamboo.PRnumber} with 4789