Tests pending pull requests

Build: #6999 failed

Job: Build and Test Job failed

Stages & jobs

  1. Build and Test

Build log

The build generated 581 lines of output. Download or view full build log

17-Apr-2017 21:30:59 Build phpBB3 - Pull Requests - Build and Test Job #6999 (PHPBB3-PR-JOB1-6999) started building on agent Default Agent
17-Apr-2017 21:30:59
17-Apr-2017 21:30:59 Build working directory is /home/bamboo/xml-data/build-dir/PHPBB3-PR-JOB1
17-Apr-2017 21:30:59 Executing build phpBB3 - Pull Requests - Build and Test Job #6999 (PHPBB3-PR-JOB1-6999)
17-Apr-2017 21:30:59 Starting task 'Checkout develop branch' of type 'com.atlassian.bamboo.plugins.vcs:task.vcs.checkout'
17-Apr-2017 21:30:59 Build always requires a clean checkout
17-Apr-2017 21:30:59 Cleaning build directory '/home/bamboo/xml-data/build-dir/PHPBB3-PR-JOB1'
17-Apr-2017 21:30:59 Updating source code to revision: 8303058ac613c1699b51a647b29b97f754fdf6a6
17-Apr-2017 21:30:59 Fetching 'refs/heads/3.1.x' from 'https://github.com/phpbb/phpbb.git'.
17-Apr-2017 21:31:00 Checking out revision 8303058ac613c1699b51a647b29b97f754fdf6a6.
17-Apr-2017 21:31:00 Creating local git repository in '/home/bamboo/xml-data/build-dir/PHPBB3-PR-JOB1/.git'.
17-Apr-2017 21:31:00 Cloning into '/home/bamboo/xml-data/build-dir/PHPBB3-PR-JOB1'...
17-Apr-2017 21:31:00 done.
17-Apr-2017 21:31:01 Branch 3.1.x set up to track remote branch 3.1.x from origin.
17-Apr-2017 21:31:01 Switched to a new branch '3.1.x'
17-Apr-2017 21:31:01 Updated source code to revision: 8303058ac613c1699b51a647b29b97f754fdf6a6
17-Apr-2017 21:31:01 Finished task 'Checkout develop branch' with result: Success
17-Apr-2017 21:31:01 Running pre-build action: VCS Version Collector
17-Apr-2017 21:31:01
Substituting variable: ${bamboo.PRnumber} with 3909
17-Apr-2017 21:31:01
Substituting variable: ${bamboo.buildResultsUrl} with https://bamboo.phpbb.com/browse/PHPBB3-PR-JOB1-6999
17-Apr-2017 21:31:01 Starting task 'Set pending build status' of type 'com.atlassian.bamboo.plugins.scripttask:task.builder.script'
17-Apr-2017 21:31:01
Beginning to execute external process for build 'phpBB3 - Pull Requests - Build and Test Job #6999 (PHPBB3-PR-JOB1-6999)'
... running command line:
/bin/sh /home/bamboo/temp/PHPBB3-PR-JOB1-6999-ScriptBuildTask-3290725433872607721.sh
... in: /home/bamboo/xml-data/build-dir/PHPBB3-PR-JOB1
... using extra environment variables:
bamboo_planRepository_1_branch=3.1.x
bamboo_planRepository_1_branchDisplayName=3.1.x
bamboo_repository_revision_number=8303058ac613c1699b51a647b29b97f754fdf6a6
bamboo_PRref=master
bamboo_resultsUrl=https://bamboo.phpbb.com/browse/PHPBB3-PR-JOB1-6999
bamboo_capability_system_builder_command_Git=/usr/bin/git
bamboo_repository_75956235_git_username=bantu
bamboo_planRepository_1_name=phpBB Ascraeus
bamboo_build_working_directory=/home/bamboo/xml-data/build-dir/PHPBB3-PR-JOB1
bamboo_buildKey=PHPBB3-PR-JOB1
bamboo_capability_phpbb_tests=true
bamboo_shortPlanName=Pull Requests
bamboo_capability_system_builder_command_fop=/usr/bin/fop
bamboo_capability_dbms_sqlite_2=true
bamboo_planRepository_name=phpBB Ascraeus
bamboo_PRnumber=3909
bamboo_buildNumber=6999
bamboo_repository_75956235_git_repositoryUrl=https://github.com/phpbb/phpbb.git
bamboo_capability_system_builder_phpunit_PHPUnit=/usr/bin/phpunit
bamboo_shortJobName=Build and Test Job
bamboo_buildResultsUrl=https://bamboo.phpbb.com/browse/PHPBB3-PR-JOB1-6999
bamboo_repository_75956235_branch_name=3.1.x
bamboo_planRepository_repositoryUrl=https://github.com/phpbb/phpbb.git
bamboo_agentId=131073
bamboo_planName=phpBB3 - Pull Requests
bamboo_shortPlanKey=PR
bamboo_shortJobKey=JOB1
bamboo_capability_dbms_mysql_55=true
bamboo_capability_system_jdk_JDK_1_7_0_65=/usr/lib/jvm/java-7-openjdk-amd64
bamboo_planRepository_revision=8303058ac613c1699b51a647b29b97f754fdf6a6
bamboo_repository_previous_revision_number=8303058ac613c1699b51a647b29b97f754fdf6a6
bamboo_buildTimeStamp=2017-04-17T21:30:59.900Z
bamboo_planRepository_previousRevision=8303058ac613c1699b51a647b29b97f754fdf6a6
bamboo_capability_system_builder_mvn2_Maven_2=/usr/share/maven2
bamboo_capability_system_jdk_JDK_1_6_0_16=/usr/lib/jvm/java-6-sun-1.6.0.16
bamboo_buildResultKey=PHPBB3-PR-JOB1-6999
bamboo_repository_git_branch=3.1.x
bamboo_repository_branch_name=3.1.x
bamboo_buildPlanName=phpBB3 - Pull Requests - Build and Test Job
bamboo_planRepository_1_revision=8303058ac613c1699b51a647b29b97f754fdf6a6
bamboo_repository_name=phpBB Ascraeus
bamboo_capability_system_docker_executable=/usr/bin/docker
bamboo_planRepository_branch=3.1.x
bamboo_agentWorkingDirectory=/home/bamboo/xml-data/build-dir
bamboo_capability_system_git_executable=/usr/bin/git
bamboo_planRepository_1_previousRevision=8303058ac613c1699b51a647b29b97f754fdf6a6
bamboo_capability_system_builder_phpunit_PHPUnit_3_4=/usr/bin/phpunit
bamboo_repository_git_username=bantu
bamboo_repository_75956235_revision_number=8303058ac613c1699b51a647b29b97f754fdf6a6
bamboo_planRepository_branchDisplayName=3.1.x
bamboo_planRepository_1_type=gitv2
bamboo_planRepository_branchName=3.1.x
bamboo_repository_75956235_previous_revision_number=8303058ac613c1699b51a647b29b97f754fdf6a6
bamboo_capability_system_jdk_JDK=/usr/lib/jvm/java-6-sun
bamboo_plan_storageTag=PHPBB3-PR
bamboo_planRepository_type=gitv2
bamboo_planRepository_1_username=bantu
bamboo_ManualBuildTriggerReason_userName=Build Robot
bamboo_repository_git_repositoryUrl=https://github.com/phpbb/phpbb.git
bamboo_repository_75956235_git_branch=3.1.x
bamboo_capability_system_builder_ant_Ant=/usr/share/ant
bamboo_repository_75956235_name=phpBB Ascraeus
bamboo_working_directory=/home/bamboo/xml-data/build-dir/PHPBB3-PR-JOB1
bamboo_planKey=PHPBB3-PR
bamboo_planRepository_1_repositoryUrl=https://github.com/phpbb/phpbb.git
bamboo_planRepository_username=bantu
bamboo_capability_local=true
bamboo_capability_system_jdk_JDK_1_6=/usr/lib/jvm/java-6-sun
bamboo_capability_system_jdk_JDK_1_7=/usr/lib/jvm/java-7-openjdk-amd64
bamboo_planRepository_1_branchName=3.1.x
17-Apr-2017 21:31:02 From https://github.com/phpbb/phpbb
17-Apr-2017 21:31:02 * branch            refs/pull/3909/head -> FETCH_HEAD
17-Apr-2017 21:31:02   % Total    % Received % Xferd  Average Speed   Time    Time     Time  Current
17-Apr-2017 21:31:02                                  Dload  Upload   Total   Spent    Left  Speed
17-Apr-2017 21:31:02
17-Apr-2017 21:31:03   0     0    0     0    0     0      0      0 --:--:-- --:--:-- --:--:--     0
17-Apr-2017 21:31:03   0     0    0     0    0     0      0      0 --:--:-- --:--:-- --:--:--     0
17-Apr-2017 21:31:03 100   275  100    93  100   182    128    251 --:--:-- --:--:-- --:--:--   251
17-Apr-2017 21:31:03 Finished task 'Set pending build status' with result: Success
17-Apr-2017 21:31:03
Substituting variable: ${bamboo.PRnumber} with 3909
17-Apr-2017 21:31:03 Starting task 'Fetch PR' of type 'com.atlassian.bamboo.plugins.scripttask:task.builder.script'
17-Apr-2017 21:31:03
Beginning to execute external process for build 'phpBB3 - Pull Requests - Build and Test Job #6999 (PHPBB3-PR-JOB1-6999)'
... running command line:
/bin/sh /home/bamboo/temp/PHPBB3-PR-JOB1-6999-ScriptBuildTask-3695687921406198300.sh
... in: /home/bamboo/xml-data/build-dir/PHPBB3-PR-JOB1
... using extra environment variables:
bamboo_planRepository_1_branch=3.1.x
bamboo_planRepository_1_branchDisplayName=3.1.x
bamboo_repository_revision_number=8303058ac613c1699b51a647b29b97f754fdf6a6
bamboo_PRref=master
bamboo_resultsUrl=https://bamboo.phpbb.com/browse/PHPBB3-PR-JOB1-6999
bamboo_capability_system_builder_command_Git=/usr/bin/git
bamboo_repository_75956235_git_username=bantu
bamboo_planRepository_1_name=phpBB Ascraeus
bamboo_build_working_directory=/home/bamboo/xml-data/build-dir/PHPBB3-PR-JOB1
bamboo_buildKey=PHPBB3-PR-JOB1
bamboo_capability_phpbb_tests=true
bamboo_shortPlanName=Pull Requests
bamboo_capability_system_builder_command_fop=/usr/bin/fop
bamboo_capability_dbms_sqlite_2=true
bamboo_planRepository_name=phpBB Ascraeus
bamboo_PRnumber=3909
bamboo_buildNumber=6999
bamboo_repository_75956235_git_repositoryUrl=https://github.com/phpbb/phpbb.git
bamboo_capability_system_builder_phpunit_PHPUnit=/usr/bin/phpunit
bamboo_shortJobName=Build and Test Job
bamboo_buildResultsUrl=https://bamboo.phpbb.com/browse/PHPBB3-PR-JOB1-6999
bamboo_repository_75956235_branch_name=3.1.x
bamboo_planRepository_repositoryUrl=https://github.com/phpbb/phpbb.git
bamboo_agentId=131073
bamboo_planName=phpBB3 - Pull Requests
bamboo_build_commandline_com_atlassian_bamboo_plugins_scripttask_task_builder_script_7=/bin/sh /home/bamboo/temp/PHPBB3-PR-JOB1-6999-ScriptBuildTask-3290725433872607721.sh
bamboo_shortPlanKey=PR
bamboo_shortJobKey=JOB1
bamboo_capability_dbms_mysql_55=true
bamboo_capability_system_jdk_JDK_1_7_0_65=/usr/lib/jvm/java-7-openjdk-amd64
bamboo_planRepository_revision=8303058ac613c1699b51a647b29b97f754fdf6a6
bamboo_repository_previous_revision_number=8303058ac613c1699b51a647b29b97f754fdf6a6
bamboo_buildTimeStamp=2017-04-17T21:30:59.900Z
bamboo_planRepository_previousRevision=8303058ac613c1699b51a647b29b97f754fdf6a6
bamboo_capability_system_builder_mvn2_Maven_2=/usr/share/maven2
bamboo_capability_system_jdk_JDK_1_6_0_16=/usr/lib/jvm/java-6-sun-1.6.0.16
bamboo_buildResultKey=PHPBB3-PR-JOB1-6999
bamboo_repository_git_branch=3.1.x
bamboo_repository_branch_name=3.1.x
bamboo_buildPlanName=phpBB3 - Pull Requests - Build and Test Job
bamboo_planRepository_1_revision=8303058ac613c1699b51a647b29b97f754fdf6a6
bamboo_repository_name=phpBB Ascraeus
bamboo_capability_system_docker_executable=/usr/bin/docker
bamboo_planRepository_branch=3.1.x
bamboo_agentWorkingDirectory=/home/bamboo/xml-data/build-dir
bamboo_capability_system_git_executable=/usr/bin/git
bamboo_planRepository_1_previousRevision=8303058ac613c1699b51a647b29b97f754fdf6a6
bamboo_capability_system_builder_phpunit_PHPUnit_3_4=/usr/bin/phpunit
bamboo_repository_git_username=bantu
bamboo_repository_75956235_revision_number=8303058ac613c1699b51a647b29b97f754fdf6a6
bamboo_planRepository_branchDisplayName=3.1.x
bamboo_planRepository_1_type=gitv2
bamboo_planRepository_branchName=3.1.x
bamboo_repository_75956235_previous_revision_number=8303058ac613c1699b51a647b29b97f754fdf6a6
bamboo_capability_system_jdk_JDK=/usr/lib/jvm/java-6-sun
bamboo_plan_storageTag=PHPBB3-PR
bamboo_planRepository_type=gitv2
bamboo_planRepository_1_username=bantu
bamboo_ManualBuildTriggerReason_userName=Build Robot
bamboo_repository_git_repositoryUrl=https://github.com/phpbb/phpbb.git
bamboo_repository_75956235_git_branch=3.1.x
bamboo_capability_system_builder_ant_Ant=/usr/share/ant
bamboo_repository_75956235_name=phpBB Ascraeus
bamboo_working_directory=/home/bamboo/xml-data/build-dir/PHPBB3-PR-JOB1
bamboo_planKey=PHPBB3-PR
bamboo_planRepository_1_repositoryUrl=https://github.com/phpbb/phpbb.git
bamboo_planRepository_username=bantu
bamboo_capability_local=true
bamboo_capability_system_jdk_JDK_1_6=/usr/lib/jvm/java-6-sun
bamboo_capability_system_jdk_JDK_1_7=/usr/lib/jvm/java-7-openjdk-amd64
bamboo_planRepository_1_branchName=3.1.x
17-Apr-2017 21:31:04 From https://github.com/phpbb/phpbb
17-Apr-2017 21:31:04 * branch            refs/pull/3909/merge -> FETCH_HEAD
17-Apr-2017 21:31:04 Note: checking out 'FETCH_HEAD'.
17-Apr-2017 21:31:04
17-Apr-2017 21:31:04 You are in 'detached HEAD' state. You can look around, make experimental
17-Apr-2017 21:31:04 changes and commit them, and you can discard any commits you make in this
17-Apr-2017 21:31:04 state without impacting any branches by performing another checkout.
17-Apr-2017 21:31:04
17-Apr-2017 21:31:04 If you want to create a new branch to retain commits you create, you may
17-Apr-2017 21:31:04 do so (now or later) by using -b with the checkout command again. Example:
17-Apr-2017 21:31:04
17-Apr-2017 21:31:04   git checkout -b new_branch_name
17-Apr-2017 21:31:04
17-Apr-2017 21:31:04 HEAD is now at 1099f87... Merge e0827c7fbc906dece8afeff94e5c85da6e268c71 into a87727ba4781967bc00fc784c47f94f8fb121789
17-Apr-2017 21:31:04 Finished task 'Fetch PR' with result: Success
17-Apr-2017 21:31:04 Skipping execution of task 'Prepare directory' as it is disabled
17-Apr-2017 21:31:04
Substituting variable: ${bamboo.working.directory} with /home/bamboo/xml-data/build-dir/PHPBB3-PR-JOB1
17-Apr-2017 21:31:04 Starting task 'Prepare directory' of type 'com.atlassian.bamboo.plugins.bamboo-docker-plugin:task.docker.cli'
17-Apr-2017 21:31:04 Running image name (phpbb:php-5.6)
17-Apr-2017 21:31:04
Beginning to execute external process for build 'phpBB3 - Pull Requests - Build and Test Job #6999 (PHPBB3-PR-JOB1-6999)'
... running command line:
/usr/bin/docker run --volume /home/bamboo/xml-data/build-dir/PHPBB3-PR-JOB1:/data --workdir /data/phpBB --rm -e HOME=/home/bamboo -u=991 phpbb:php-5.6 /bin/bash -c php ../composer.phar install --dev; cd ../build; ../phpBB/vendor/bin/phing clean prepare
... in: /home/bamboo/xml-data/build-dir/PHPBB3-PR-JOB1
... using extra environment variables:
bamboo_planRepository_1_branch=3.1.x
bamboo_planRepository_1_branchDisplayName=3.1.x
bamboo_repository_revision_number=8303058ac613c1699b51a647b29b97f754fdf6a6
bamboo_PRref=master
bamboo_resultsUrl=https://bamboo.phpbb.com/browse/PHPBB3-PR-JOB1-6999
bamboo_capability_system_builder_command_Git=/usr/bin/git
bamboo_repository_75956235_git_username=bantu
bamboo_planRepository_1_name=phpBB Ascraeus
bamboo_build_working_directory=/home/bamboo/xml-data/build-dir/PHPBB3-PR-JOB1
bamboo_buildKey=PHPBB3-PR-JOB1
bamboo_capability_phpbb_tests=true
bamboo_shortPlanName=Pull Requests
bamboo_capability_system_builder_command_fop=/usr/bin/fop
bamboo_capability_dbms_sqlite_2=true
bamboo_planRepository_name=phpBB Ascraeus
bamboo_PRnumber=3909
bamboo_buildNumber=6999
bamboo_repository_75956235_git_repositoryUrl=https://github.com/phpbb/phpbb.git
bamboo_capability_system_builder_phpunit_PHPUnit=/usr/bin/phpunit
bamboo_shortJobName=Build and Test Job
bamboo_buildResultsUrl=https://bamboo.phpbb.com/browse/PHPBB3-PR-JOB1-6999
bamboo_repository_75956235_branch_name=3.1.x
bamboo_planRepository_repositoryUrl=https://github.com/phpbb/phpbb.git
bamboo_agentId=131073
bamboo_planName=phpBB3 - Pull Requests
bamboo_build_commandline_com_atlassian_bamboo_plugins_scripttask_task_builder_script_7=/bin/sh /home/bamboo/temp/PHPBB3-PR-JOB1-6999-ScriptBuildTask-3290725433872607721.sh
bamboo_shortPlanKey=PR
bamboo_shortJobKey=JOB1
bamboo_capability_dbms_mysql_55=true
bamboo_capability_system_jdk_JDK_1_7_0_65=/usr/lib/jvm/java-7-openjdk-amd64
bamboo_planRepository_revision=8303058ac613c1699b51a647b29b97f754fdf6a6
bamboo_repository_previous_revision_number=8303058ac613c1699b51a647b29b97f754fdf6a6
bamboo_buildTimeStamp=2017-04-17T21:30:59.900Z
bamboo_planRepository_previousRevision=8303058ac613c1699b51a647b29b97f754fdf6a6
bamboo_capability_system_builder_mvn2_Maven_2=/usr/share/maven2
bamboo_capability_system_jdk_JDK_1_6_0_16=/usr/lib/jvm/java-6-sun-1.6.0.16
bamboo_build_commandline_com_atlassian_bamboo_plugins_scripttask_task_builder_script_4=/bin/sh /home/bamboo/temp/PHPBB3-PR-JOB1-6999-ScriptBuildTask-3695687921406198300.sh
bamboo_buildResultKey=PHPBB3-PR-JOB1-6999
bamboo_repository_git_branch=3.1.x
bamboo_repository_branch_name=3.1.x
bamboo_buildPlanName=phpBB3 - Pull Requests - Build and Test Job
bamboo_planRepository_1_revision=8303058ac613c1699b51a647b29b97f754fdf6a6
bamboo_repository_name=phpBB Ascraeus
bamboo_capability_system_docker_executable=/usr/bin/docker
bamboo_planRepository_branch=3.1.x
bamboo_agentWorkingDirectory=/home/bamboo/xml-data/build-dir
bamboo_capability_system_git_executable=/usr/bin/git
bamboo_planRepository_1_previousRevision=8303058ac613c1699b51a647b29b97f754fdf6a6
bamboo_capability_system_builder_phpunit_PHPUnit_3_4=/usr/bin/phpunit
bamboo_repository_git_username=bantu
bamboo_repository_75956235_revision_number=8303058ac613c1699b51a647b29b97f754fdf6a6
bamboo_planRepository_branchDisplayName=3.1.x
bamboo_planRepository_1_type=gitv2
bamboo_planRepository_branchName=3.1.x
bamboo_repository_75956235_previous_revision_number=8303058ac613c1699b51a647b29b97f754fdf6a6
bamboo_capability_system_jdk_JDK=/usr/lib/jvm/java-6-sun
bamboo_plan_storageTag=PHPBB3-PR
bamboo_planRepository_type=gitv2
bamboo_planRepository_1_username=bantu
bamboo_ManualBuildTriggerReason_userName=Build Robot
bamboo_repository_git_repositoryUrl=https://github.com/phpbb/phpbb.git
bamboo_repository_75956235_git_branch=3.1.x
bamboo_capability_system_builder_ant_Ant=/usr/share/ant
bamboo_repository_75956235_name=phpBB Ascraeus
bamboo_working_directory=/home/bamboo/xml-data/build-dir/PHPBB3-PR-JOB1
bamboo_planKey=PHPBB3-PR
bamboo_planRepository_1_repositoryUrl=https://github.com/phpbb/phpbb.git
bamboo_planRepository_username=bantu
bamboo_capability_local=true
bamboo_capability_system_jdk_JDK_1_6=/usr/lib/jvm/java-6-sun
bamboo_capability_system_jdk_JDK_1_7=/usr/lib/jvm/java-7-openjdk-amd64
bamboo_planRepository_1_branchName=3.1.x
17-Apr-2017 21:31:05 You are running composer with xdebug enabled. This has a major impact on runtime performance. See https://getcomposer.org/xdebug
17-Apr-2017 21:31:05 You are using the deprecated option "dev". Dev packages are installed by default now.
17-Apr-2017 21:31:05 Cannot create cache directory /home/bamboo/.composer/cache/repo/https---packagist.org/, or directory is not writable. Proceeding without cache
17-Apr-2017 21:31:05 Cannot create cache directory /home/bamboo/.composer/cache/files/, or directory is not writable. Proceeding without cache
17-Apr-2017 21:31:05 Loading composer repositories with package information
17-Apr-2017 21:31:05 Installing dependencies (including require-dev) from lock file
17-Apr-2017 21:31:05   - Installing bantu/ini-get-wrapper (v1.0.1)
17-Apr-2017 21:31:07     Downloading: Connecting...    Downloading: 0%               Downloading: 100%    Downloading: 100%
17-Apr-2017 21:31:07
17-Apr-2017 21:31:07   - Installing symfony/process (v3.1.3)
17-Apr-2017 21:31:08     Downloading: Connecting...    Downloading: 0%               Downloading: 15%    Downloading: 20%    Downloading: 35%    Downloading: 50%    Downloading: 55%    Downloading: 70%    Downloading: 85%    Downloading: 90%    Downloading: 100%
17-Apr-2017 21:31:08
17-Apr-2017 21:31:08   - Installing symfony/finder (v3.2.0)
17-Apr-2017 21:31:10     Downloading: Connecting...    Downloading: 0%               Downloading: 5%    Downloading: 10%    Downloading: 15%    Downloading: 20%    Downloading: 25%    Downloading: 35%    Downloading: 40%    Downloading: 45%    Downloading: 50%    Downloading: 55%    Downloading: 60%    Downloading: 65%    Downloading: 70%    Downloading: 75%    Downloading: 80%    Downloading: 100%    Downloading: 100%
17-Apr-2017 21:31:10
17-Apr-2017 21:31:10   - Installing symfony/filesystem (v3.2.0)
17-Apr-2017 21:31:11     Downloading: Connecting...    Downloading: 0%               Downloading: 35%    Downloading: 50%    Downloading: 95%    Downloading: 100%    Downloading: 100%
17-Apr-2017 21:31:11
17-Apr-2017 21:31:11   - Installing symfony/polyfill-mbstring (v1.3.0)
17-Apr-2017 21:31:12     Downloading: Connecting...    Downloading: 0%               Downloading: 35%    Downloading: 70%    Downloading: 100%    Downloading: 100%
17-Apr-2017 21:31:12
17-Apr-2017 21:31:12   - Installing psr/log (1.0.2)
17-Apr-2017 21:31:12     Downloading: Connecting...    Downloading: 0%               Downloading: 15%    Downloading: 100%    Downloading: 100%
17-Apr-2017 21:31:13
17-Apr-2017 21:31:13   - Installing symfony/debug (v3.2.0)
17-Apr-2017 21:31:14     Downloading: Connecting...    Downloading: 0%               Downloading: 5%    Downloading: 25%    Downloading: 30%    Downloading: 50%    Downloading: 55%    Downloading: 60%    Downloading: 80%    Downloading: 85%    Downloading: 90%    Downloading: 100%
17-Apr-2017 21:31:14
17-Apr-2017 21:31:14   - Installing symfony/console (v3.2.0)
17-Apr-2017 21:31:15     Downloading: Connecting...    Downloading: 0%               Downloading: 5%    Downloading: 10%    Downloading: 15%    Downloading: 20%    Downloading: 25%    Downloading: 30%    Downloading: 35%    Downloading: 40%    Downloading: 45%    Downloading: 50%    Downloading: 55%    Downloading: 60%    Downloading: 65%    Downloading: 70%    Downloading: 75%    Downloading: 80%    Downloading: 85%    Downloading: 90%    Downloading: 95%    Downloading: 100%    Downloading: 100%
17-Apr-2017 21:31:15
17-Apr-2017 21:31:15   - Installing seld/phar-utils (1.0.1)
17-Apr-2017 21:31:16     Downloading: Connecting...    Downloading: 0%               Downloading: 30%    Downloading: 60%    Downloading: 90%    Downloading: 100%    Downloading: 100%
17-Apr-2017 21:31:16
17-Apr-2017 21:31:16   - Installing seld/jsonlint (1.4.0)
17-Apr-2017 21:31:17     Downloading: Connecting...    Downloading: 0%               Downloading: 25%    Downloading: 55%    Downloading: 100%    Downloading: 100%
17-Apr-2017 21:31:17
17-Apr-2017 21:31:17   - Installing seld/cli-prompt (1.0.2)
17-Apr-2017 21:31:18     Downloading: Connecting...    Downloading: 0%               Downloading: 15%    Downloading: 30%    Downloading: 100%    Downloading: 100%
17-Apr-2017 21:31:18
17-Apr-2017 21:31:18   - Installing justinrainbow/json-schema (2.0.5)
17-Apr-2017 21:31:19     Downloading: Connecting...    Downloading: 0%               Downloading: 10%    Downloading: 35%    Downloading: 55%    Downloading: 70%    Downloading: 80%    Downloading: 90%    Downloading: 100%    Downloading: 100%
17-Apr-2017 21:31:19
17-Apr-2017 21:31:19   - Installing composer/spdx-licenses (1.1.4)
17-Apr-2017 21:31:21     Downloading: Connecting...    Downloading: 0%               Downloading: 35%    Downloading: 70%    Downloading: 100%
17-Apr-2017 21:31:21
17-Apr-2017 21:31:21   - Installing composer/semver (1.4.2)
17-Apr-2017 21:31:23     Downloading: Connecting...    Downloading: 0%               Downloading: 35%    Downloading: 85%    Downloading: 100%    Downloading: 100%
17-Apr-2017 21:31:23
17-Apr-2017 21:31:23   - Installing composer/ca-bundle (1.0.3)
17-Apr-2017 21:31:25     Downloading: Connecting...    Downloading: 0%               Downloading: 5%    Downloading: 10%    Downloading: 15%    Downloading: 20%    Downloading: 25%    Downloading: 30%    Downloading: 35%    Downloading: 40%    Downloading: 45%    Downloading: 50%    Downloading: 55%    Downloading: 60%    Downloading: 65%    Downloading: 70%    Downloading: 75%    Downloading: 80%    Downloading: 85%    Downloading: 90%    Downloading: 95%    Downloading: 100%    Downloading: 100%
17-Apr-2017 21:31:25
17-Apr-2017 21:31:25   - Installing composer/composer (1.2.0)
17-Apr-2017 21:31:26     Downloading: Connecting...    Downloading: 0%               Downloading: 5%    Downloading: 10%    Downloading: 15%    Downloading: 20%    Downloading: 25%    Downloading: 30%    Downloading: 35%    Downloading: 40%    Downloading: 45%    Downloading: 50%    Downloading: 55%    Downloading: 60%    Downloading: 65%    Downloading: 70%    Downloading: 75%    Downloading: 80%    Downloading: 85%    Downloading: 90%    Downloading: 95%    Downloading: 100%    Downloading: 100%
17-Apr-2017 21:31:26
17-Apr-2017 21:31:26   - Installing google/recaptcha (1.1.2)
17-Apr-2017 21:31:27     Downloading: Connecting...    Downloading: 0%               Downloading: 30%    Downloading: 55%    Downloading: 65%    Downloading: 70%    Downloading: 95%    Downloading: 100%    Downloading: 100%
17-Apr-2017 21:31:27
17-Apr-2017 21:31:27   - Installing guzzlehttp/promises (1.3.0)
17-Apr-2017 21:31:29     Downloading: Connecting...    Downloading: 0%               Downloading: 15%    Downloading: 25%    Downloading: 40%    Downloading: 60%    Downloading: 70%    Downloading: 85%    Downloading: 100%    Downloading: 100%
17-Apr-2017 21:31:29
17-Apr-2017 21:31:29   - Installing psr/http-message (1.0.1)
17-Apr-2017 21:31:30     Downloading: Connecting...    Downloading: 0%               Downloading: 95%    Downloading: 100%    Downloading: 100%
17-Apr-2017 21:31:30
17-Apr-2017 21:31:30   - Installing guzzlehttp/psr7 (1.3.1)
17-Apr-2017 21:31:31     Downloading: Connecting...    Downloading: 0%               Downloading: 5%    Downloading: 20%    Downloading: 25%    Downloading: 40%    Downloading: 45%    Downloading: 60%    Downloading: 65%    Downloading: 80%    Downloading: 85%    Downloading: 95%    Downloading: 100%    Downloading: 100%
17-Apr-2017 21:31:31
17-Apr-2017 21:31:31   - Installing lusitanian/oauth (v0.8.9)
17-Apr-2017 21:31:33     Downloading: Connecting...    Downloading: 0%               Downloading: 5%    Downloading: 10%    Downloading: 15%    Downloading: 20%    Downloading: 25%    Downloading: 30%    Downloading: 35%    Downloading: 40%    Downloading: 45%    Downloading: 50%    Downloading: 55%    Downloading: 60%    Downloading: 65%    Downloading: 70%    Downloading: 75%    Downloading: 80%    Downloading: 85%    Downloading: 90%    Downloading: 95%    Downloading: 100%    Downloading: 100%
17-Apr-2017 21:31:33
17-Apr-2017 21:31:33   - Installing marc1706/fast-image-size (v1.1.2)
17-Apr-2017 21:31:34     Downloading: Connecting...    Downloading: 0%               Downloading: 35%    Downloading: 70%    Downloading: 100%
17-Apr-2017 21:31:35
17-Apr-2017 21:31:35   - Installing paragonie/random_compat (v1.4.1)
17-Apr-2017 21:31:35     Downloading: Connecting...    Downloading: 0%               Downloading: 20%    Downloading: 35%    Downloading: 60%    Downloading: 80%    Downloading: 95%    Downloading: 100%    Downloading: 100%
17-Apr-2017 21:31:35
17-Apr-2017 21:31:35   - Installing patchwork/utf8 (v1.3.1)
17-Apr-2017 21:31:37     Downloading: Connecting...    Downloading: 0%               Downloading: 5%    Downloading: 10%    Downloading: 15%    Downloading: 20%    Downloading: 25%    Downloading: 30%    Downloading: 35%    Downloading: 40%    Downloading: 45%    Downloading: 50%    Downloading: 55%    Downloading: 60%    Downloading: 65%    Downloading: 70%    Downloading: 75%    Downloading: 80%    Downloading: 85%    Downloading: 90%    Downloading: 95%    Downloading: 100%    Downloading: 100%
17-Apr-2017 21:31:37
17-Apr-2017 21:31:37   - Installing s9e/text-formatter (0.9.1)
17-Apr-2017 21:31:39     Downloading: Connecting...    Downloading: 0%               Downloading: 5%    Downloading: 10%    Downloading: 15%    Downloading: 20%    Downloading: 25%    Downloading: 30%    Downloading: 35%    Downloading: 40%    Downloading: 45%    Downloading: 50%    Downloading: 55%    Downloading: 60%    Downloading: 65%    Downloading: 70%    Downloading: 75%    Downloading: 90%    Downloading: 95%    Downloading: 100%    Downloading: 100%
17-Apr-2017 21:31:39
17-Apr-2017 21:31:39   - Installing symfony/config (v3.2.0)
17-Apr-2017 21:31:40     Downloading: Connecting...    Downloading: 0%               Downloading: 5%    Downloading: 15%    Downloading: 20%    Downloading: 25%    Downloading: 35%    Downloading: 40%    Downloading: 45%    Downloading: 55%    Downloading: 60%    Downloading: 65%    Downloading: 70%    Downloading: 75%    Downloading: 80%    Downloading: 90%    Downloading: 95%    Downloading: 100%    Downloading: 100%
17-Apr-2017 21:31:40
17-Apr-2017 21:31:40   - Installing symfony/http-foundation (v3.2.0)
17-Apr-2017 21:31:41     Downloading: Connecting...    Downloading: 0%               Downloading: 5%    Downloading: 10%    Downloading: 15%    Downloading: 20%    Downloading: 25%    Downloading: 30%    Downloading: 35%    Downloading: 40%    Downloading: 45%    Downloading: 50%    Downloading: 55%    Downloading: 60%    Downloading: 65%    Downloading: 70%    Downloading: 75%    Downloading: 80%    Downloading: 85%    Downloading: 90%    Downloading: 95%    Downloading: 100%    Downloading: 100%
17-Apr-2017 21:31:41
17-Apr-2017 21:31:41   - Installing symfony/event-dispatcher (v3.2.0)
17-Apr-2017 21:31:42     Downloading: Connecting...    Downloading: 0%               Downloading: 5%    Downloading: 10%    Downloading: 15%    Downloading: 65%    Downloading: 70%    Downloading: 75%    Downloading: 80%    Downloading: 85%    Downloading: 90%    Downloading: 100%    Downloading: 100%
17-Apr-2017 21:31:42
17-Apr-2017 21:31:42   - Installing symfony/http-kernel (v3.2.0)
17-Apr-2017 21:31:44     Downloading: Connecting...    Downloading: 0%               Downloading: 5%    Downloading: 10%    Downloading: 15%    Downloading: 20%    Downloading: 25%    Downloading: 30%    Downloading: 35%    Downloading: 40%    Downloading: 45%    Downloading: 50%    Downloading: 55%    Downloading: 60%    Downloading: 65%    Downloading: 70%    Downloading: 75%    Downloading: 80%    Downloading: 85%    Downloading: 90%    Downloading: 95%    Downloading: 100%    Downloading: 100%
17-Apr-2017 21:31:44
17-Apr-2017 21:31:44   - Installing symfony/dependency-injection (v3.2.0)
17-Apr-2017 21:31:45     Downloading: Connecting...    Downloading: 0%               Downloading: 5%    Downloading: 10%    Downloading: 15%    Downloading: 20%    Downloading: 25%    Downloading: 30%    Downloading: 35%    Downloading: 40%    Downloading: 45%    Downloading: 50%    Downloading: 55%    Downloading: 60%    Downloading: 65%    Downloading: 70%    Downloading: 75%    Downloading: 80%    Downloading: 85%    Downloading: 90%    Downloading: 95%    Downloading: 100%    Downloading: 100%
17-Apr-2017 21:31:45
17-Apr-2017 21:31:45   - Installing zendframework/zend-eventmanager (3.0.1)
17-Apr-2017 21:31:46     Downloading: Connecting...    Downloading: 0%               Downloading: 15%    Downloading: 30%    Downloading: 55%    Downloading: 70%    Downloading: 85%    Downloading: 100%
17-Apr-2017 21:31:46
17-Apr-2017 21:31:46   - Installing zendframework/zend-code (2.6.3)
17-Apr-2017 21:31:47     Downloading: Connecting...    Downloading: 0%               Downloading: 5%    Downloading: 10%    Downloading: 15%    Downloading: 20%    Downloading: 25%    Downloading: 30%    Downloading: 35%    Downloading: 40%    Downloading: 45%    Downloading: 50%    Downloading: 55%    Downloading: 60%    Downloading: 65%    Downloading: 70%    Downloading: 75%    Downloading: 80%    Downloading: 85%    Downloading: 90%    Downloading: 95%    Downloading: 100%    Downloading: 100%
17-Apr-2017 21:31:47
17-Apr-2017 21:31:47   - Installing ocramius/proxy-manager (1.0.2)
17-Apr-2017 21:31:49     Downloading: Connecting...    Downloading: 0%               Downloading: 5%    Downloading: 10%    Downloading: 15%    Downloading: 20%    Downloading: 25%    Downloading: 30%    Downloading: 35%    Downloading: 40%    Downloading: 45%    Downloading: 50%    Downloading: 55%    Downloading: 60%    Downloading: 70%    Downloading: 75%    Downloading: 80%    Downloading: 85%    Downloading: 90%    Downloading: 95%    Downloading: 100%    Downloading: 100%
17-Apr-2017 21:31:49
17-Apr-2017 21:31:49   - Installing symfony/proxy-manager-bridge (v3.2.0)
17-Apr-2017 21:31:50     Downloading: Connecting...    Downloading: 0%               Downloading: 25%    Downloading: 65%    Downloading: 100%    Downloading: 100%
17-Apr-2017 21:31:50
17-Apr-2017 21:31:50   - Installing symfony/routing (v3.2.0)
17-Apr-2017 21:31:51     Downloading: Connecting...    Downloading: 0%               Downloading: 5%    Downloading: 10%    Downloading: 15%    Downloading: 20%    Downloading: 25%    Downloading: 30%    Downloading: 35%    Downloading: 40%    Downloading: 45%    Downloading: 50%    Downloading: 55%    Downloading: 60%    Downloading: 65%    Downloading: 70%    Downloading: 75%    Downloading: 80%    Downloading: 85%    Downloading: 90%    Downloading: 95%    Downloading: 100%    Downloading: 100%
17-Apr-2017 21:31:51
17-Apr-2017 21:31:51   - Installing twig/twig (v1.24.2)
17-Apr-2017 21:31:52     Downloading: Connecting...    Downloading: 0%               Downloading: 5%    Downloading: 10%    Downloading: 15%    Downloading: 20%    Downloading: 25%    Downloading: 30%    Downloading: 35%    Downloading: 40%    Downloading: 45%    Downloading: 50%    Downloading: 55%    Downloading: 80%    Downloading: 85%    Downloading: 90%    Downloading: 95%    Downloading: 100%    Downloading: 100%
17-Apr-2017 21:31:53
17-Apr-2017 21:31:53   - Installing symfony/twig-bridge (v3.1.4)
17-Apr-2017 21:31:54     Downloading: Connecting...    Downloading: 0%               Downloading: 10%    Downloading: 15%    Downloading: 25%    Downloading: 30%    Downloading: 40%    Downloading: 50%    Downloading: 60%    Downloading: 65%    Downloading: 75%    Downloading: 85%    Downloading: 95%    Downloading: 100%    Downloading: 100%
17-Apr-2017 21:31:54
17-Apr-2017 21:31:54   - Installing symfony/dom-crawler (v3.2.0)
17-Apr-2017 21:31:55     Downloading: Connecting...    Downloading: 0%               Downloading: 25%    Downloading: 30%    Downloading: 40%    Downloading: 45%    Downloading: 65%    Downloading: 70%    Downloading: 90%    Downloading: 95%    Downloading: 100%    Downloading: 100%
17-Apr-2017 21:31:55
17-Apr-2017 21:31:55   - Installing symfony/css-selector (v3.2.0)
17-Apr-2017 21:31:57     Downloading: Connecting...    Downloading: 0%               Downloading: 5%    Downloading: 10%    Downloading: 15%    Downloading: 20%    Downloading: 25%    Downloading: 30%    Downloading: 35%    Downloading: 40%    Downloading: 45%    Downloading: 50%    Downloading: 55%    Downloading: 60%    Downloading: 65%    Downloading: 70%    Downloading: 75%    Downloading: 100%    Downloading: 100%
17-Apr-2017 21:31:57
17-Apr-2017 21:31:57   - Installing symfony/browser-kit (v3.2.0)
17-Apr-2017 21:31:58     Downloading: Connecting...    Downloading: 0%               Downloading: 50%    Downloading: 80%    Downloading: 85%    Downloading: 100%    Downloading: 100%
17-Apr-2017 21:31:58
17-Apr-2017 21:31:58   - Installing guzzlehttp/guzzle (6.2.2)
17-Apr-2017 21:31:59     Downloading: Connecting...    Downloading: 0%               Downloading: 5%    Downloading: 10%    Downloading: 15%    Downloading: 20%    Downloading: 25%    Downloading: 35%    Downloading: 40%    Downloading: 50%    Downloading: 55%    Downloading: 65%    Downloading: 70%    Downloading: 75%    Downloading: 80%    Downloading: 85%    Downloading: 95%    Downloading: 100%    Downloading: 100%
17-Apr-2017 21:31:59
17-Apr-2017 21:31:59   - Installing fabpot/goutte (v3.2.0)
17-Apr-2017 21:32:00     Downloading: Connecting...    Downloading: 0%               Downloading: 70%    Downloading: 100%    Downloading: 100%
17-Apr-2017 21:32:00
17-Apr-2017 21:32:00   - Installing facebook/webdriver (1.2.0)
17-Apr-2017 21:32:02     Downloading: Connecting...    Downloading: 0%               Downloading: 5%    Downloading: 10%    Downloading: 15%    Downloading: 20%    Downloading: 25%    Downloading: 30%    Downloading: 35%    Downloading: 40%    Downloading: 45%    Downloading: 50%    Downloading: 55%    Downloading: 60%    Downloading: 65%    Downloading: 70%    Downloading: 75%    Downloading: 80%    Downloading: 85%    Downloading: 90%    Downloading: 95%    Downloading: 100%    Downloading: 100%
17-Apr-2017 21:32:02
17-Apr-2017 21:32:02   - Installing laravel/homestead (v4.0.5)
17-Apr-2017 21:32:03     Downloading: Connecting...    Downloading: 0%               Downloading: 5%    Downloading: 10%    Downloading: 100%
17-Apr-2017 21:32:03
17-Apr-2017 21:32:03   - Installing phing/phing (2.4.14)
17-Apr-2017 21:32:04     Downloading: Connecting...    Downloading: 0%               Downloading: 5%    Downloading: 10%    Downloading: 15%    Downloading: 20%    Downloading: 25%    Downloading: 30%    Downloading: 35%    Downloading: 40%    Downloading: 45%    Downloading: 50%    Downloading: 55%    Downloading: 60%    Downloading: 65%    Downloading: 70%    Downloading: 75%    Downloading: 80%    Downloading: 85%    Downloading: 90%    Downloading: 95%    Downloading: 100%    Downloading: 100%
17-Apr-2017 21:32:04
17-Apr-2017 21:32:05   - Installing phpdocumentor/reflection-docblock (2.0.4)
17-Apr-2017 21:32:06     Downloading: Connecting...    Downloading: 0%               Downloading: 15%    Downloading: 20%    Downloading: 40%    Downloading: 45%    Downloading: 60%    Downloading: 75%    Downloading: 80%    Downloading: 95%    Downloading: 100%    Downloading: 100%
17-Apr-2017 21:32:06
17-Apr-2017 21:32:06   - Installing phpdocumentor/reflection-common (1.0)
17-Apr-2017 21:32:07     Downloading: Connecting...    Downloading: 0%               Downloading: 65%    Downloading: 100%    Downloading: 100%
17-Apr-2017 21:32:07
17-Apr-2017 21:32:07   - Installing phpdocumentor/type-resolver (0.2.1)
17-Apr-2017 21:32:08     Downloading: Connecting...    Downloading: 0%               Downloading: 20%    Downloading: 35%    Downloading: 80%    Downloading: 100%    Downloading: 100%
17-Apr-2017 21:32:08
17-Apr-2017 21:32:08   - Installing symfony/yaml (v3.2.0)
17-Apr-2017 21:32:09     Downloading: Connecting...    Downloading: 0%               Downloading: 10%    Downloading: 15%    Downloading: 25%    Downloading: 30%    Downloading: 35%    Downloading: 45%    Downloading: 55%    Downloading: 65%    Downloading: 75%    Downloading: 90%    Downloading: 100%    Downloading: 100%
17-Apr-2017 21:32:09
17-Apr-2017 21:32:09   - Installing sebastian/version (1.0.6)
17-Apr-2017 21:32:10     Downloading: Connecting...    Downloading: 0%               Downloading: 100%    Downloading: 100%
17-Apr-2017 21:32:10
17-Apr-2017 21:32:10   - Installing sebastian/global-state (1.1.1)
17-Apr-2017 21:32:11     Downloading: Connecting...    Downloading: 0%               Downloading: 40%    Downloading: 70%    Downloading: 100%    Downloading: 100%
17-Apr-2017 21:32:11
17-Apr-2017 21:32:11   - Installing sebastian/recursion-context (1.0.2)
17-Apr-2017 21:32:12     Downloading: Connecting...    Downloading: 0%               Downloading: 35%    Downloading: 70%    Downloading: 100%    Downloading: 100%
17-Apr-2017 21:32:12
17-Apr-2017 21:32:12   - Installing sebastian/exporter (1.2.2)
17-Apr-2017 21:32:13     Downloading: Connecting...    Downloading: 0%               Downloading: 100%
17-Apr-2017 21:32:13
17-Apr-2017 21:32:13   - Installing sebastian/environment (1.3.8)
17-Apr-2017 21:32:14     Downloading: Connecting...    Downloading: 0%               Downloading: 15%    Downloading: 30%    Downloading: 45%    Downloading: 60%    Downloading: 75%    Downloading: 100%    Downloading: 100%
17-Apr-2017 21:32:14
17-Apr-2017 21:32:14   - Installing sebastian/diff (1.4.1)
17-Apr-2017 21:32:15     Downloading: Connecting...    Downloading: 0%               Downloading: 15%    Downloading: 30%    Downloading: 45%    Downloading: 100%
17-Apr-2017 21:32:15
17-Apr-2017 21:32:15   - Installing sebastian/comparator (1.2.2)
17-Apr-2017 21:32:16     Downloading: Connecting...    Downloading: 0%               Downloading: 10%    Downloading: 20%    Downloading: 50%    Downloading: 60%    Downloading: 70%    Downloading: 80%    Downloading: 100%
17-Apr-2017 21:32:16
17-Apr-2017 21:32:16   - Installing phpunit/php-text-template (1.2.1)
17-Apr-2017 21:32:17     Downloading: Connecting...    Downloading: 0%               Downloading: 35%    Downloading: 100%    Downloading: 100%
17-Apr-2017 21:32:17
17-Apr-2017 21:32:17   - Installing doctrine/instantiator (1.0.5)
17-Apr-2017 21:32:18     Downloading: Connecting...    Downloading: 0%               Downloading: 15%    Downloading: 25%    Downloading: 40%    Downloading: 55%    Downloading: 70%    Downloading: 75%    Downloading: 90%    Downloading: 100%    Downloading: 100%
17-Apr-2017 21:32:18
17-Apr-2017 21:32:18   - Installing phpunit/phpunit-mock-objects (2.3.8)
17-Apr-2017 21:32:19     Downloading: Connecting...    Downloading: 0%               Downloading: 5%    Downloading: 20%    Downloading: 25%    Downloading: 30%    Downloading: 35%    Downloading: 45%    Downloading: 50%    Downloading: 55%    Downloading: 60%    Downloading: 70%    Downloading: 75%    Downloading: 80%    Downloading: 85%    Downloading: 90%    Downloading: 100%
17-Apr-2017 21:32:19
17-Apr-2017 21:32:19   - Installing phpunit/php-timer (1.0.8)
17-Apr-2017 21:32:20     Downloading: Connecting...    Downloading: 0%               Downloading: 100%    Downloading: 100%
17-Apr-2017 21:32:20
17-Apr-2017 21:32:20   - Installing phpunit/php-file-iterator (1.4.2)
17-Apr-2017 21:32:21     Downloading: Connecting...    Downloading: 0%               Downloading: 20%    Downloading: 40%    Downloading: 60%    Downloading: 100%    Downloading: 100%
17-Apr-2017 21:32:21
17-Apr-2017 21:32:21   - Installing phpunit/php-token-stream (1.4.9)
17-Apr-2017 21:32:22     Downloading: Connecting...    Downloading: 0%               Downloading: 5%    Downloading: 10%    Downloading: 15%    Downloading: 20%    Downloading: 65%    Downloading: 70%    Downloading: 75%    Downloading: 80%    Downloading: 85%    Downloading: 90%    Downloading: 95%    Downloading: 100%    Downloading: 100%
17-Apr-2017 21:32:22
17-Apr-2017 21:32:22   - Installing phpunit/php-code-coverage (2.2.4)
17-Apr-2017 21:32:24     Downloading: Connecting...    Downloading: 0%               Downloading: 5%    Downloading: 10%    Downloading: 15%    Downloading: 20%    Downloading: 25%    Downloading: 30%    Downloading: 35%    Downloading: 40%    Downloading: 45%    Downloading: 50%    Downloading: 55%    Downloading: 60%    Downloading: 65%    Downloading: 70%    Downloading: 75%    Downloading: 80%    Downloading: 85%    Downloading: 95%    Downloading: 100%    Downloading: 100%
17-Apr-2017 21:32:24
17-Apr-2017 21:32:24   - Installing phpspec/prophecy (v1.6.2)
17-Apr-2017 21:32:25     Downloading: Connecting...    Downloading: 0%               Downloading: 5%    Downloading: 10%    Downloading: 15%    Downloading: 20%    Downloading: 25%    Downloading: 30%    Downloading: 35%    Downloading: 40%    Downloading: 45%    Downloading: 50%    Downloading: 55%    Downloading: 60%    Downloading: 65%    Downloading: 70%    Downloading: 75%    Downloading: 80%    Downloading: 85%    Downloading: 90%    Downloading: 95%    Downloading: 100%    Downloading: 100%
17-Apr-2017 21:32:25
17-Apr-2017 21:32:25   - Installing phpunit/phpunit (4.8.31)
17-Apr-2017 21:32:27     Downloading: Connecting...    Downloading: 0%               Downloading: 5%    Downloading: 10%    Downloading: 15%    Downloading: 20%    Downloading: 25%    Downloading: 30%    Downloading: 35%    Downloading: 40%    Downloading: 45%    Downloading: 50%    Downloading: 55%    Downloading: 60%    Downloading: 65%    Downloading: 70%    Downloading: 75%    Downloading: 80%    Downloading: 85%    Downloading: 90%    Downloading: 95%    Downloading: 100%    Downloading: 100%
17-Apr-2017 21:32:27
17-Apr-2017 21:32:27   - Installing phpunit/dbunit (2.0.3)
17-Apr-2017 21:32:28     Downloading: Connecting...    Downloading: 0%               Downloading: 5%    Downloading: 10%    Downloading: 15%    Downloading: 20%    Downloading: 25%    Downloading: 30%    Downloading: 35%    Downloading: 40%    Downloading: 45%    Downloading: 50%    Downloading: 55%    Downloading: 60%    Downloading: 65%    Downloading: 70%    Downloading: 75%    Downloading: 80%    Downloading: 85%    Downloading: 90%    Downloading: 95%    Downloading: 100%    Downloading: 100%
17-Apr-2017 21:32:28
17-Apr-2017 21:32:28   - Installing squizlabs/php_codesniffer (2.7.1)
17-Apr-2017 21:32:30     Downloading: Connecting...    Downloading: 0%               Downloading: 5%    Downloading: 10%    Downloading: 15%    Downloading: 20%    Downloading: 25%    Downloading: 30%    Downloading: 35%    Downloading: 40%    Downloading: 50%    Downloading: 55%    Downloading: 60%    Downloading: 65%    Downloading: 70%    Downloading: 75%    Downloading: 80%    Downloading: 85%    Downloading: 90%    Downloading: 95%    Downloading: 100%    Downloading: 100%
17-Apr-2017 21:32:30
17-Apr-2017 21:32:30   - Installing webmozart/assert (1.2.0)
17-Apr-2017 21:32:31     Downloading: Connecting...    Downloading: 0%               Downloading: 55%    Downloading: 80%    Downloading: 100%    Downloading: 100%
17-Apr-2017 21:32:31
17-Apr-2017 21:32:33 lusitanian/oauth suggests installing predis/predis (Allows using the Redis storage backend.)
17-Apr-2017 21:32:33 paragonie/random_compat suggests installing ext-libsodium (Provides a modern crypto API that can be used to generate random bytes.)
17-Apr-2017 21:32:33 patchwork/utf8 suggests installing ext-intl (Use Intl for best performance)
17-Apr-2017 21:32:33 patchwork/utf8 suggests installing ext-wfio (Use WFIO for UTF-8 filesystem access on Windows)
17-Apr-2017 21:32:33 s9e/text-formatter suggests installing ext-intl (Allows international URLs to be accepted by the URL filter)
17-Apr-2017 21:32:33 s9e/text-formatter suggests installing ext-xsl (Enables the XSLT renderer)
17-Apr-2017 21:32:33 symfony/http-kernel suggests installing symfony/class-loader ()
17-Apr-2017 21:32:33 symfony/http-kernel suggests installing symfony/var-dumper ()
17-Apr-2017 21:32:33 symfony/dependency-injection suggests installing symfony/expression-language (For using expressions in service container configuration)
17-Apr-2017 21:32:33 zendframework/zend-eventmanager suggests installing container-interop/container-interop (^1.1.0, to use the lazy listeners feature)
17-Apr-2017 21:32:33 zendframework/zend-eventmanager suggests installing zendframework/zend-stdlib (^2.7.3 || ^3.0, to use the FilterChain feature)
17-Apr-2017 21:32:33 zendframework/zend-code suggests installing doctrine/annotations (Doctrine\Common\Annotations >=1.0 for annotation features)
17-Apr-2017 21:32:33 zendframework/zend-code suggests installing zendframework/zend-stdlib (Zend\Stdlib component)
17-Apr-2017 21:32:33 ocramius/proxy-manager suggests installing ocramius/generated-hydrator (To have very fast object to array to object conversion for ghost objects)
17-Apr-2017 21:32:33 ocramius/proxy-manager suggests installing zendframework/zend-json (To have the JsonRpc adapter (Remote Object feature))
17-Apr-2017 21:32:33 ocramius/proxy-manager suggests installing zendframework/zend-soap (To have the Soap adapter (Remote Object feature))
17-Apr-2017 21:32:33 ocramius/proxy-manager suggests installing zendframework/zend-stdlib (To use the hydrator proxy)
17-Apr-2017 21:32:33 ocramius/proxy-manager suggests installing zendframework/zend-xmlrpc (To have the XmlRpc adapter (Remote Object feature))
17-Apr-2017 21:32:33 symfony/routing suggests installing doctrine/annotations (For using the annotation loader)
17-Apr-2017 21:32:33 symfony/routing suggests installing symfony/expression-language (For using expression matching)
17-Apr-2017 21:32:33 symfony/twig-bridge suggests installing symfony/asset (For using the AssetExtension)
17-Apr-2017 21:32:33 symfony/twig-bridge suggests installing symfony/expression-language (For using the ExpressionExtension)
17-Apr-2017 21:32:33 symfony/twig-bridge suggests installing symfony/form (For using the FormExtension)
17-Apr-2017 21:32:33 symfony/twig-bridge suggests installing symfony/security (For using the SecurityExtension)
17-Apr-2017 21:32:33 symfony/twig-bridge suggests installing symfony/stopwatch (For using the StopwatchExtension)
17-Apr-2017 21:32:33 symfony/twig-bridge suggests installing symfony/templating (For using the TwigEngine)
17-Apr-2017 21:32:33 symfony/twig-bridge suggests installing symfony/translation (For using the TranslationExtension)
17-Apr-2017 21:32:33 symfony/twig-bridge suggests installing symfony/var-dumper (For using the DumpExtension)
17-Apr-2017 21:32:33 facebook/webdriver suggests installing phpdocumentor/phpdocumentor (2.*)
17-Apr-2017 21:32:33 phpdocumentor/reflection-docblock suggests installing dflydev/markdown (~1.0)
17-Apr-2017 21:32:33 phpdocumentor/reflection-docblock suggests installing erusev/parsedown (~1.0)
17-Apr-2017 21:32:33 sebastian/global-state suggests installing ext-uopz (*)
17-Apr-2017 21:32:33 phpunit/phpunit-mock-objects suggests installing ext-soap (*)
17-Apr-2017 21:32:33 phpunit/phpunit suggests installing phpunit/php-invoker (~1.1)
17-Apr-2017 21:32:33 Generating autoload files
17-Apr-2017 21:32:33 Buildfile: /data/build/build.xml
17-Apr-2017 21:32:33
17-Apr-2017 21:32:33 phpBB > clean:
17-Apr-2017 21:32:33
17-Apr-2017 21:32:33    [delete] Directory /data/build/logs does not exist or is not a directory.
17-Apr-2017 21:32:33    [delete] Directory /data/build/api does not exist or is not a directory.
17-Apr-2017 21:32:33    [delete] Directory /data/build/codebrowser does not exist or is not a directory.
17-Apr-2017 21:32:33    [delete] Directory /data/build/coverage does not exist or is not a directory.
17-Apr-2017 21:32:33    [delete] Directory /data/build/cpd does not exist or is not a directory.
17-Apr-2017 21:32:33    [delete] Directory /data/build/dependencies does not exist or is not a directory.
17-Apr-2017 21:32:33    [delete] Directory /data/build/new_version does not exist or is not a directory.
17-Apr-2017 21:32:33    [delete] Directory /data/build/old_versions does not exist or is not a directory.
17-Apr-2017 21:32:33    [delete] Directory /data/build/save does not exist or is not a directory.
17-Apr-2017 21:32:33
17-Apr-2017 21:32:33 phpBB > prepare:
17-Apr-2017 21:32:33
17-Apr-2017 21:32:33     [mkdir] Created dir: /data/build/logs
17-Apr-2017 21:32:33     [mkdir] Created dir: /data/build/api
17-Apr-2017 21:32:33     [mkdir] Created dir: /data/build/codebrowser
17-Apr-2017 21:32:33     [mkdir] Created dir: /data/build/coverage
17-Apr-2017 21:32:33     [mkdir] Created dir: /data/build/cpd
17-Apr-2017 21:32:33     [mkdir] Created dir: /data/build/dependencies
17-Apr-2017 21:32:33     [mkdir] Created dir: /data/build/new_version
17-Apr-2017 21:32:33     [mkdir] Created dir: /data/build/new_version/files
17-Apr-2017 21:32:33     [mkdir] Created dir: /data/build/new_version/patches
17-Apr-2017 21:32:33     [mkdir] Created dir: /data/build/new_version/release_files
17-Apr-2017 21:32:33     [mkdir] Created dir: /data/build/new_version/update
17-Apr-2017 21:32:33     [mkdir] Created dir: /data/build/old_versions
17-Apr-2017 21:32:33     [mkdir] Created dir: /data/build/save
17-Apr-2017 21:32:33
17-Apr-2017 21:32:33 BUILD FINISHED
17-Apr-2017 21:32:33
17-Apr-2017 21:32:33 Total time: 0.1227 seconds
17-Apr-2017 21:32:33
17-Apr-2017 21:32:34 Finished task 'Prepare directory' with result: Success
17-Apr-2017 21:32:34 Skipping execution of task 'Run sniffs' as it is disabled
17-Apr-2017 21:32:34
Substituting variable: ${bamboo.working.directory} with /home/bamboo/xml-data/build-dir/PHPBB3-PR-JOB1
17-Apr-2017 21:32:34 Starting task 'Run sniffs' of type 'com.atlassian.bamboo.plugins.bamboo-docker-plugin:task.docker.cli'
17-Apr-2017 21:32:34 Running image name (phpbb:php-5.6)
17-Apr-2017 21:32:34
Beginning to execute external process for build 'phpBB3 - Pull Requests - Build and Test Job #6999 (PHPBB3-PR-JOB1-6999)'
... running command line:
/usr/bin/docker run --volume /home/bamboo/xml-data/build-dir/PHPBB3-PR-JOB1:/data --workdir /data/build --rm -u=991 phpbb:php-5.6 ../phpBB/vendor/bin/phing sniff
... in: /home/bamboo/xml-data/build-dir/PHPBB3-PR-JOB1
... using extra environment variables:
bamboo_planRepository_1_branch=3.1.x
bamboo_planRepository_1_branchDisplayName=3.1.x
bamboo_repository_revision_number=8303058ac613c1699b51a647b29b97f754fdf6a6
bamboo_PRref=master
bamboo_resultsUrl=https://bamboo.phpbb.com/browse/PHPBB3-PR-JOB1-6999
bamboo_capability_system_builder_command_Git=/usr/bin/git
bamboo_repository_75956235_git_username=bantu
bamboo_planRepository_1_name=phpBB Ascraeus
bamboo_build_working_directory=/home/bamboo/xml-data/build-dir/PHPBB3-PR-JOB1
bamboo_buildKey=PHPBB3-PR-JOB1
bamboo_capability_phpbb_tests=true
bamboo_shortPlanName=Pull Requests
bamboo_capability_system_builder_command_fop=/usr/bin/fop
bamboo_capability_dbms_sqlite_2=true
bamboo_planRepository_name=phpBB Ascraeus
bamboo_PRnumber=3909
bamboo_buildNumber=6999
bamboo_repository_75956235_git_repositoryUrl=https://github.com/phpbb/phpbb.git
bamboo_capability_system_builder_phpunit_PHPUnit=/usr/bin/phpunit
bamboo_shortJobName=Build and Test Job
bamboo_buildResultsUrl=https://bamboo.phpbb.com/browse/PHPBB3-PR-JOB1-6999
bamboo_repository_75956235_branch_name=3.1.x
bamboo_planRepository_repositoryUrl=https://github.com/phpbb/phpbb.git
bamboo_agentId=131073
bamboo_planName=phpBB3 - Pull Requests
bamboo_build_commandline_com_atlassian_bamboo_plugins_scripttask_task_builder_script_7=/bin/sh /home/bamboo/temp/PHPBB3-PR-JOB1-6999-ScriptBuildTask-3290725433872607721.sh
bamboo_shortPlanKey=PR
bamboo_shortJobKey=JOB1
bamboo_capability_dbms_mysql_55=true
bamboo_capability_system_jdk_JDK_1_7_0_65=/usr/lib/jvm/java-7-openjdk-amd64
bamboo_planRepository_revision=8303058ac613c1699b51a647b29b97f754fdf6a6
bamboo_repository_previous_revision_number=8303058ac613c1699b51a647b29b97f754fdf6a6
bamboo_buildTimeStamp=2017-04-17T21:30:59.900Z
bamboo_planRepository_previousRevision=8303058ac613c1699b51a647b29b97f754fdf6a6
bamboo_capability_system_builder_mvn2_Maven_2=/usr/share/maven2
bamboo_capability_system_jdk_JDK_1_6_0_16=/usr/lib/jvm/java-6-sun-1.6.0.16
bamboo_build_commandline_com_atlassian_bamboo_plugins_scripttask_task_builder_script_4=/bin/sh /home/bamboo/temp/PHPBB3-PR-JOB1-6999-ScriptBuildTask-3695687921406198300.sh
bamboo_buildResultKey=PHPBB3-PR-JOB1-6999
bamboo_repository_git_branch=3.1.x
bamboo_repository_branch_name=3.1.x
bamboo_buildPlanName=phpBB3 - Pull Requests - Build and Test Job
bamboo_planRepository_1_revision=8303058ac613c1699b51a647b29b97f754fdf6a6
bamboo_repository_name=phpBB Ascraeus
bamboo_capability_system_docker_executable=/usr/bin/docker
bamboo_build_commandline_com_atlassian_bamboo_plugins_bamboo_docker_plugin_task_docker_cli_12=/usr/bin/docker run --volume /home/bamboo/xml-data/build-dir/PHPBB3-PR-JOB1:/data --workdir /data/phpBB --rm -e HOME=/home/bamboo -u=991 phpbb:php-5.6 /bin/bash -c php ../composer.phar install --dev; cd ../build; ../phpBB/vendor/bin/phing clean prepare
bamboo_planRepository_branch=3.1.x
bamboo_agentWorkingDirectory=/home/bamboo/xml-data/build-dir
bamboo_capability_system_git_executable=/usr/bin/git
bamboo_planRepository_1_previousRevision=8303058ac613c1699b51a647b29b97f754fdf6a6
bamboo_capability_system_builder_phpunit_PHPUnit_3_4=/usr/bin/phpunit
bamboo_repository_git_username=bantu
bamboo_repository_75956235_revision_number=8303058ac613c1699b51a647b29b97f754fdf6a6
bamboo_planRepository_branchDisplayName=3.1.x
bamboo_planRepository_1_type=gitv2
bamboo_planRepository_branchName=3.1.x
bamboo_repository_75956235_previous_revision_number=8303058ac613c1699b51a647b29b97f754fdf6a6
bamboo_capability_system_jdk_JDK=/usr/lib/jvm/java-6-sun
bamboo_plan_storageTag=PHPBB3-PR
bamboo_planRepository_type=gitv2
bamboo_planRepository_1_username=bantu
bamboo_ManualBuildTriggerReason_userName=Build Robot
bamboo_repository_git_repositoryUrl=https://github.com/phpbb/phpbb.git
bamboo_repository_75956235_git_branch=3.1.x
bamboo_capability_system_builder_ant_Ant=/usr/share/ant
bamboo_repository_75956235_name=phpBB Ascraeus
bamboo_working_directory=/home/bamboo/xml-data/build-dir/PHPBB3-PR-JOB1
bamboo_planKey=PHPBB3-PR
bamboo_planRepository_1_repositoryUrl=https://github.com/phpbb/phpbb.git
bamboo_planRepository_username=bantu
bamboo_capability_local=true
bamboo_capability_system_jdk_JDK_1_6=/usr/lib/jvm/java-6-sun
bamboo_capability_system_jdk_JDK_1_7=/usr/lib/jvm/java-7-openjdk-amd64
bamboo_planRepository_1_branchName=3.1.x
17-Apr-2017 21:32:34 Buildfile: /data/build/build.xml
17-Apr-2017 21:32:34
17-Apr-2017 21:32:34 phpBB > sniff:
17-Apr-2017 21:32:34
17-Apr-2017 21:32:42 ............................................................  60 / 699 (9%)
17-Apr-2017 21:32:43 ............................................................ 120 / 699 (17%)
17-Apr-2017 21:32:44 ............................................................ 180 / 699 (26%)
17-Apr-2017 21:32:46 ............................................................ 240 / 699 (34%)
17-Apr-2017 21:32:51 ............................................................ 300 / 699 (43%)
17-Apr-2017 21:32:56 ............................................................ 360 / 699 (52%)
17-Apr-2017 21:33:02 ............................................................ 420 / 699 (60%)
17-Apr-2017 21:33:05 ............................................................ 480 / 699 (69%)
17-Apr-2017 21:33:09 ............................................................ 540 / 699 (77%)
17-Apr-2017 21:33:14 ............................................................ 600 / 699 (86%)
17-Apr-2017 21:33:17 ............................................................ 660 / 699 (94%)
17-Apr-2017 21:33:18 .......................................
17-Apr-2017 21:33:18
17-Apr-2017 21:33:18 Time: 44.51 secs; Memory: 79.25Mb
17-Apr-2017 21:33:18
17-Apr-2017 21:33:27 ............................................................  60 / 206 (29%)
17-Apr-2017 21:33:47 ............................................................ 120 / 206 (58%)
17-Apr-2017 21:34:02 ............................................................ 180 / 206 (87%)
17-Apr-2017 21:34:09 ..........................
17-Apr-2017 21:34:09
17-Apr-2017 21:34:09 Time: 50.32 secs; Memory: 60.25Mb
17-Apr-2017 21:34:09
17-Apr-2017 21:34:09
17-Apr-2017 21:34:09
17-Apr-2017 21:34:09 Time: 17ms; Memory: 3.5Mb
17-Apr-2017 21:34:09
17-Apr-2017 21:34:09
17-Apr-2017 21:34:09 BUILD FINISHED
17-Apr-2017 21:34:09
17-Apr-2017 21:34:09 Total time: 2 minutes  35.23 seconds
17-Apr-2017 21:34:09
17-Apr-2017 21:34:09 Finished task 'Run sniffs' with result: Success
17-Apr-2017 21:34:09 Skipping execution of task 'Run tests' as it is disabled
17-Apr-2017 21:34:09
Substituting variable: ${bamboo.working.directory} with /home/bamboo/xml-data/build-dir/PHPBB3-PR-JOB1
17-Apr-2017 21:34:09 Starting task 'Run tests' of type 'com.atlassian.bamboo.plugins.bamboo-docker-plugin:task.docker.cli'
17-Apr-2017 21:34:09 Running image name (phpbb:php-5.6)
17-Apr-2017 21:34:09
Beginning to execute external process for build 'phpBB3 - Pull Requests - Build and Test Job #6999 (PHPBB3-PR-JOB1-6999)'
... running command line:
/usr/bin/docker run --volume /home/bamboo/xml-data/build-dir/PHPBB3-PR-JOB1:/data --workdir /data --rm -u=991 phpbb:php-5.6 /bin/bash -c phpBB/vendor/bin/phpunit --log-junit build/logs/phpunit.xml
... in: /home/bamboo/xml-data/build-dir/PHPBB3-PR-JOB1
... using extra environment variables:
bamboo_planRepository_1_branch=3.1.x
bamboo_planRepository_1_branchDisplayName=3.1.x
bamboo_repository_revision_number=8303058ac613c1699b51a647b29b97f754fdf6a6
bamboo_PRref=master
bamboo_resultsUrl=https://bamboo.phpbb.com/browse/PHPBB3-PR-JOB1-6999
bamboo_capability_system_builder_command_Git=/usr/bin/git
bamboo_repository_75956235_git_username=bantu
bamboo_planRepository_1_name=phpBB Ascraeus
bamboo_build_working_directory=/home/bamboo/xml-data/build-dir/PHPBB3-PR-JOB1
bamboo_buildKey=PHPBB3-PR-JOB1
bamboo_capability_phpbb_tests=true
bamboo_shortPlanName=Pull Requests
bamboo_capability_system_builder_command_fop=/usr/bin/fop
bamboo_capability_dbms_sqlite_2=true
bamboo_planRepository_name=phpBB Ascraeus
bamboo_PRnumber=3909
bamboo_buildNumber=6999
bamboo_repository_75956235_git_repositoryUrl=https://github.com/phpbb/phpbb.git
bamboo_capability_system_builder_phpunit_PHPUnit=/usr/bin/phpunit
bamboo_shortJobName=Build and Test Job
bamboo_buildResultsUrl=https://bamboo.phpbb.com/browse/PHPBB3-PR-JOB1-6999
bamboo_repository_75956235_branch_name=3.1.x
bamboo_planRepository_repositoryUrl=https://github.com/phpbb/phpbb.git
bamboo_agentId=131073
bamboo_planName=phpBB3 - Pull Requests
bamboo_build_commandline_com_atlassian_bamboo_plugins_scripttask_task_builder_script_7=/bin/sh /home/bamboo/temp/PHPBB3-PR-JOB1-6999-ScriptBuildTask-3290725433872607721.sh
bamboo_shortPlanKey=PR
bamboo_shortJobKey=JOB1
bamboo_capability_dbms_mysql_55=true
bamboo_capability_system_jdk_JDK_1_7_0_65=/usr/lib/jvm/java-7-openjdk-amd64
bamboo_planRepository_revision=8303058ac613c1699b51a647b29b97f754fdf6a6
bamboo_repository_previous_revision_number=8303058ac613c1699b51a647b29b97f754fdf6a6
bamboo_buildTimeStamp=2017-04-17T21:30:59.900Z
bamboo_planRepository_previousRevision=8303058ac613c1699b51a647b29b97f754fdf6a6
bamboo_capability_system_builder_mvn2_Maven_2=/usr/share/maven2
bamboo_capability_system_jdk_JDK_1_6_0_16=/usr/lib/jvm/java-6-sun-1.6.0.16
bamboo_build_commandline_com_atlassian_bamboo_plugins_scripttask_task_builder_script_4=/bin/sh /home/bamboo/temp/PHPBB3-PR-JOB1-6999-ScriptBuildTask-3695687921406198300.sh
bamboo_buildResultKey=PHPBB3-PR-JOB1-6999
bamboo_repository_git_branch=3.1.x
bamboo_repository_branch_name=3.1.x
bamboo_buildPlanName=phpBB3 - Pull Requests - Build and Test Job
bamboo_planRepository_1_revision=8303058ac613c1699b51a647b29b97f754fdf6a6
bamboo_repository_name=phpBB Ascraeus
bamboo_capability_system_docker_executable=/usr/bin/docker
bamboo_build_commandline_com_atlassian_bamboo_plugins_bamboo_docker_plugin_task_docker_cli_11=/usr/bin/docker run --volume /home/bamboo/xml-data/build-dir/PHPBB3-PR-JOB1:/data --workdir /data/build --rm -u=991 phpbb:php-5.6 ../phpBB/vendor/bin/phing sniff
bamboo_build_commandline_com_atlassian_bamboo_plugins_bamboo_docker_plugin_task_docker_cli_12=/usr/bin/docker run --volume /home/bamboo/xml-data/build-dir/PHPBB3-PR-JOB1:/data --workdir /data/phpBB --rm -e HOME=/home/bamboo -u=991 phpbb:php-5.6 /bin/bash -c php ../composer.phar install --dev; cd ../build; ../phpBB/vendor/bin/phing clean prepare
bamboo_planRepository_branch=3.1.x
bamboo_agentWorkingDirectory=/home/bamboo/xml-data/build-dir
bamboo_capability_system_git_executable=/usr/bin/git
bamboo_planRepository_1_previousRevision=8303058ac613c1699b51a647b29b97f754fdf6a6
bamboo_capability_system_builder_phpunit_PHPUnit_3_4=/usr/bin/phpunit
bamboo_repository_git_username=bantu
bamboo_repository_75956235_revision_number=8303058ac613c1699b51a647b29b97f754fdf6a6
bamboo_planRepository_branchDisplayName=3.1.x
bamboo_planRepository_1_type=gitv2
bamboo_planRepository_branchName=3.1.x
bamboo_repository_75956235_previous_revision_number=8303058ac613c1699b51a647b29b97f754fdf6a6
bamboo_capability_system_jdk_JDK=/usr/lib/jvm/java-6-sun
bamboo_plan_storageTag=PHPBB3-PR
bamboo_planRepository_type=gitv2
bamboo_planRepository_1_username=bantu
bamboo_ManualBuildTriggerReason_userName=Build Robot
bamboo_repository_git_repositoryUrl=https://github.com/phpbb/phpbb.git
bamboo_repository_75956235_git_branch=3.1.x
bamboo_capability_system_builder_ant_Ant=/usr/share/ant
bamboo_repository_75956235_name=phpBB Ascraeus
bamboo_working_directory=/home/bamboo/xml-data/build-dir/PHPBB3-PR-JOB1
bamboo_planKey=PHPBB3-PR
bamboo_planRepository_1_repositoryUrl=https://github.com/phpbb/phpbb.git
bamboo_planRepository_username=bantu
bamboo_capability_local=true
bamboo_capability_system_jdk_JDK_1_6=/usr/lib/jvm/java-6-sun
bamboo_capability_system_jdk_JDK_1_7=/usr/lib/jvm/java-7-openjdk-amd64
bamboo_planRepository_1_branchName=3.1.x
17-Apr-2017 21:34:12 PHPUnit 4.8.31 by Sebastian Bergmann and contributors.
17-Apr-2017 21:34:12
17-Apr-2017 21:34:19 .............................................................   61 / 6929 (  0%)
17-Apr-2017 21:34:19 .............................................................  122 / 6929 (  1%)
17-Apr-2017 21:34:20 ...I.....SSSS............SSSS.........S...S..................  183 / 6929 (  2%)
17-Apr-2017 21:34:24 ....................................................S........  244 / 6929 (  3%)
17-Apr-2017 21:34:25 stty: standard input: Inappropriate ioctl for device
17-Apr-2017 21:34:25 stty: standard input: Inappropriate ioctl for device
17-Apr-2017 21:34:25 stty: standard input: Inappropriate ioctl for device
17-Apr-2017 21:34:25 stty: standard input: Inappropriate ioctl for device
17-Apr-2017 21:34:30 ....F........................................................  305 / 6929 (  4%)
17-Apr-2017 21:34:31 .............................................................  366 / 6929 (  5%)
17-Apr-2017 21:34:31 .............................................................  427 / 6929 (  6%)
17-Apr-2017 21:34:32 .............................................................  488 / 6929 (  7%)
17-Apr-2017 21:34:33 .............................................................  549 / 6929 (  7%)
17-Apr-2017 21:34:33 .............................................................  610 / 6929 (  8%)
17-Apr-2017 21:34:34 .............................................................  671 / 6929 (  9%)
17-Apr-2017 21:34:35 .............................................................  732 / 6929 ( 10%)
17-Apr-2017 21:34:36 .............................................................  793 / 6929 ( 11%)
17-Apr-2017 21:34:36 .............................................................  854 / 6929 ( 12%)
17-Apr-2017 21:34:37 .............................................................  915 / 6929 ( 13%)
17-Apr-2017 21:34:38 .............................................................  976 / 6929 ( 14%)
17-Apr-2017 21:34:40 ............................................................. 1037 / 6929 ( 14%)
17-Apr-2017 21:34:44 ..................................I.......................... 1098 / 6929 ( 15%)
17-Apr-2017 21:34:50 ............................................................. 1159 / 6929 ( 16%)
17-Apr-2017 21:34:53 ............................................................. 1220 / 6929 ( 17%)
17-Apr-2017 21:34:54 .S.S.S....................................................... 1281 / 6929 ( 18%)
17-Apr-2017 21:34:55 ............................................................. 1342 / 6929 ( 19%)
17-Apr-2017 21:34:55 ............................................................. 1403 / 6929 ( 20%)
17-Apr-2017 21:34:55 ............................................................. 1464 / 6929 ( 21%)
17-Apr-2017 21:34:55 ............................................................. 1525 / 6929 ( 22%)
17-Apr-2017 21:34:55 ............................................................. 1586 / 6929 ( 22%)
17-Apr-2017 21:34:56 ............................................................. 1647 / 6929 ( 23%)
17-Apr-2017 21:34:56 ............................................................. 1708 / 6929 ( 24%)
17-Apr-2017 21:34:56 ............................................................. 1769 / 6929 ( 25%)
17-Apr-2017 21:34:56 ............................................................. 1830 / 6929 ( 26%)
17-Apr-2017 21:34:56 ............................................................. 1891 / 6929 ( 27%)
17-Apr-2017 21:34:56 ............................................................. 1952 / 6929 ( 28%)
17-Apr-2017 21:34:56 ............................................................. 2013 / 6929 ( 29%)
17-Apr-2017 21:34:57 ............................................................. 2074 / 6929 ( 29%)
17-Apr-2017 21:34:58 ............................................................. 2135 / 6929 ( 30%)
17-Apr-2017 21:34:59 ............................................................. 2196 / 6929 ( 31%)
17-Apr-2017 21:34:59 ............................................................. 2257 / 6929 ( 32%)
17-Apr-2017 21:35:01 ............................................................. 2318 / 6929 ( 33%)
17-Apr-2017 21:35:03 ..I.II....................................................... 2379 / 6929 ( 34%)
17-Apr-2017 21:35:03 ............................................................. 2440 / 6929 ( 35%)
17-Apr-2017 21:35:04 ............................................................. 2501 / 6929 ( 36%)
17-Apr-2017 21:35:04 ............................................................. 2562 / 6929 ( 36%)
17-Apr-2017 21:35:07 ............................................................. 2623 / 6929 ( 37%)
17-Apr-2017 21:35:08 ............................................................. 2684 / 6929 ( 38%)
17-Apr-2017 21:35:08 ......................................SSSSSSSSS.............. 2745 / 6929 ( 39%)
17-Apr-2017 21:35:08 ............................................................. 2806 / 6929 ( 40%)
17-Apr-2017 21:35:19 ............................................................. 2867 / 6929 ( 41%)
17-Apr-2017 21:35:23 ............................................................. 2928 / 6929 ( 42%)
17-Apr-2017 21:35:28 ..............S.............................................. 2989 / 6929 ( 43%)
17-Apr-2017 21:35:28 ............................................................. 3050 / 6929 ( 44%)
17-Apr-2017 21:35:37 ............................................................. 3111 / 6929 ( 44%)
17-Apr-2017 21:35:46 ............................................................. 3172 / 6929 ( 45%)
17-Apr-2017 21:35:53 ............................................................. 3233 / 6929 ( 46%)
17-Apr-2017 21:35:53 ............................................................. 3294 / 6929 ( 47%)
17-Apr-2017 21:35:53 ............................................................. 3355 / 6929 ( 48%)
17-Apr-2017 21:35:54 ............................................................. 3416 / 6929 ( 49%)
17-Apr-2017 21:35:54 ............................................................. 3477 / 6929 ( 50%)
17-Apr-2017 21:35:54 ............................................................. 3538 / 6929 ( 51%)
17-Apr-2017 21:35:54 ............................................................. 3599 / 6929 ( 51%)
17-Apr-2017 21:35:54 ............................................................. 3660 / 6929 ( 52%)
17-Apr-2017 21:35:55 ............................................................. 3721 / 6929 ( 53%)
17-Apr-2017 21:35:58 ............................................................. 3782 / 6929 ( 54%)
17-Apr-2017 21:36:00 ............................................................. 3843 / 6929 ( 55%)
17-Apr-2017 21:36:02 ............................................................. 3904 / 6929 ( 56%)
17-Apr-2017 21:36:03 ............................................................. 3965 / 6929 ( 57%)
17-Apr-2017 21:36:04 ............................................................. 4026 / 6929 ( 58%)
17-Apr-2017 21:36:11 ............................................................. 4087 / 6929 ( 58%)
17-Apr-2017 21:36:15 ............................................................. 4148 / 6929 ( 59%)
17-Apr-2017 21:36:15 ............................................................. 4209 / 6929 ( 60%)
17-Apr-2017 21:36:16 ............................................................. 4270 / 6929 ( 61%)
17-Apr-2017 21:36:16 ............................................................. 4331 / 6929 ( 62%)
17-Apr-2017 21:36:16 ............................................................. 4392 / 6929 ( 63%)
17-Apr-2017 21:36:17 ............................................................. 4453 / 6929 ( 64%)
17-Apr-2017 21:36:17 ............................................................. 4514 / 6929 ( 65%)
17-Apr-2017 21:36:17 ............................................................. 4575 / 6929 ( 66%)
17-Apr-2017 21:36:17 ............................................................. 4636 / 6929 ( 66%)
17-Apr-2017 21:36:17 ............................................................. 4697 / 6929 ( 67%)
17-Apr-2017 21:36:28 ............................................................. 4758 / 6929 ( 68%)
17-Apr-2017 21:36:35 ..............................S.............................. 4819 / 6929 ( 69%)
17-Apr-2017 21:36:42 ............................................................. 4880 / 6929 ( 70%)
17-Apr-2017 21:36:50 ............................................................. 4941 / 6929 ( 71%)
17-Apr-2017 21:36:51 ............................................................. 5002 / 6929 ( 72%)
17-Apr-2017 21:36:51 ............................................................. 5063 / 6929 ( 73%)
17-Apr-2017 21:36:52 ............................................................. 5124 / 6929 ( 73%)
17-Apr-2017 21:36:52 ..........................................SSSSSSSSSSSSSSSSSSS 5185 / 6929 ( 74%)
17-Apr-2017 21:36:52 SSSSSSSSSSSSSSSSSSSSSSSSSSSSSSSSSSSSSSSSSSSSSSSSSSSSSSSSSSSSS 5246 / 6929 ( 75%)
17-Apr-2017 21:36:52 SSSSSSSSSSSSSSSSSSSSSSSSSSSSSSSSSSSSSSSSSSSSSSSSSSSSSSSSSSSSS 5307 / 6929 ( 76%)
17-Apr-2017 21:36:52 SSSSSSSSSSSSSSSSSSSSSSSSSSSSSSSSSSSSSSSSSSSSSSSSSSSSSSSSSSSSS 5368 / 6929 ( 77%)
17-Apr-2017 21:36:53 SSSSSSSSSSSSSSSSSSSSSSSSSSSSSSSSSSSSSSSSSSSSSSSSSSSSSSSSSSS.. 5429 / 6929 ( 78%)
17-Apr-2017 21:36:55 ............................................................. 5490 / 6929 ( 79%)
17-Apr-2017 21:36:57 ............................................................. 5551 / 6929 ( 80%)
17-Apr-2017 21:36:58 ............................................................. 5612 / 6929 ( 80%)
17-Apr-2017 21:37:00 ............................................................. 5673 / 6929 ( 81%)
17-Apr-2017 21:37:02 ............................................................. 5734 / 6929 ( 82%)
17-Apr-2017 21:37:04 ............................................................. 5795 / 6929 ( 83%)
17-Apr-2017 21:37:06 ............................................................. 5856 / 6929 ( 84%)
17-Apr-2017 21:37:08 ............................................................. 5917 / 6929 ( 85%)
17-Apr-2017 21:37:10 ............................................................. 5978 / 6929 ( 86%)
17-Apr-2017 21:37:12 ............................................................. 6039 / 6929 ( 87%)
17-Apr-2017 21:37:14 ............................................................. 6100 / 6929 ( 88%)
17-Apr-2017 21:37:16 ............................................................. 6161 / 6929 ( 88%)
17-Apr-2017 21:37:18 ............................................................. 6222 / 6929 ( 89%)
17-Apr-2017 21:37:20 ............................................................. 6283 / 6929 ( 90%)
17-Apr-2017 21:37:22 ............................................................. 6344 / 6929 ( 91%)
17-Apr-2017 21:37:24 ............................................................. 6405 / 6929 ( 92%)
17-Apr-2017 21:37:26 ............................................................. 6466 / 6929 ( 93%)
17-Apr-2017 21:37:28 ............................................................. 6527 / 6929 ( 94%)
17-Apr-2017 21:37:30 ............................................................. 6588 / 6929 ( 95%)
17-Apr-2017 21:37:32 ............................................................. 6649 / 6929 ( 95%)
17-Apr-2017 21:37:34 ............................................................. 6710 / 6929 ( 96%)
17-Apr-2017 21:37:36 ............................................................. 6771 / 6929 ( 97%)
17-Apr-2017 21:37:38 ............................................................. 6832 / 6929 ( 98%)
17-Apr-2017 21:37:40 ............................................................. 6893 / 6929 ( 99%)
17-Apr-2017 21:37:41 ..................................SS
17-Apr-2017 21:37:41
17-Apr-2017 21:37:41 Time: 3.52 minutes, Memory: 423.50MB
17-Apr-2017 21:37:41
17-Apr-2017 21:37:41 There was 1 failure:
17-Apr-2017 21:37:41
17-Apr-2017 21:37:41 1) phpbb_console_user_add_test::test_add_dialog
17-Apr-2017 21:37:41 Failed asserting that null is not equal to null.
17-Apr-2017 21:37:41
17-Apr-2017 21:37:41 /data/tests/console/user/add_test.php:70
17-Apr-2017 21:37:41
17-Apr-2017 21:37:41 FAILURES!
17-Apr-2017 21:37:41 Tests: 9211, Assertions: 61324, Failures: 1, Skipped: 288, Incomplete: 5.
17-Apr-2017 21:37:42 Failing task since return code of [/usr/bin/docker run --volume /home/bamboo/xml-data/build-dir/PHPBB3-PR-JOB1:/data --workdir /data --rm -u=991 phpbb:php-5.6 /bin/bash -c phpBB/vendor/bin/phpunit --log-junit build/logs/phpunit.xml] was 1 while expected 0
17-Apr-2017 21:37:42 Error occurred while running Task 'Run tests(10)' of type com.atlassian.bamboo.plugins.bamboo-docker-plugin:task.docker.cli.
17-Apr-2017 21:37:42 com.atlassian.bamboo.task.TaskException: Failed to execute task
17-Apr-2017 21:37:42         at com.atlassian.bamboo.plugins.docker.service.RunService.execute(RunService.java:71)
17-Apr-2017 21:37:42         at com.atlassian.bamboo.plugins.docker.tasks.cli.DockerCliTask.execute(DockerCliTask.java:60)
17-Apr-2017 21:37:42         at com.atlassian.bamboo.task.TaskExecutorImpl.lambda$executeTasks$3(TaskExecutorImpl.java:317)
17-Apr-2017 21:37:42         at com.atlassian.bamboo.task.TaskExecutorImpl.executeTaskWithPrePostActions(TaskExecutorImpl.java:246)
17-Apr-2017 21:37:42         at com.atlassian.bamboo.task.TaskExecutorImpl.executeTasks(TaskExecutorImpl.java:317)
17-Apr-2017 21:37:42         at com.atlassian.bamboo.task.TaskExecutorImpl.execute(TaskExecutorImpl.java:118)
17-Apr-2017 21:37:42         at com.atlassian.bamboo.build.pipeline.tasks.ExecuteBuildTask.call(ExecuteBuildTask.java:74)
17-Apr-2017 21:37:42         at com.atlassian.bamboo.v2.build.agent.DefaultBuildAgent.build(DefaultBuildAgent.java:216)
17-Apr-2017 21:37:42         at com.atlassian.bamboo.v2.build.agent.BuildAgentControllerImpl$1.call(BuildAgentControllerImpl.java:139)
17-Apr-2017 21:37:42         at com.atlassian.bamboo.v2.build.agent.BuildAgentControllerImpl$1.call(BuildAgentControllerImpl.java:130)
17-Apr-2017 21:37:42         at com.atlassian.bamboo.variable.CustomVariableContextImpl.withVariableSubstitutor(CustomVariableContextImpl.java:221)
17-Apr-2017 21:37:42         at com.atlassian.bamboo.v2.build.agent.BuildAgentControllerImpl.waitAndPerformBuild(BuildAgentControllerImpl.java:129)
17-Apr-2017 21:37:42         at com.atlassian.bamboo.v2.build.agent.DefaultBuildAgent$1.run(DefaultBuildAgent.java:138)
17-Apr-2017 21:37:42         at com.atlassian.bamboo.utils.BambooRunnables$1.run(BambooRunnables.java:51)
17-Apr-2017 21:37:42         at com.atlassian.bamboo.security.ImpersonationHelper.runWith(ImpersonationHelper.java:31)
17-Apr-2017 21:37:42         at com.atlassian.bamboo.security.ImpersonationHelper.runWithSystemAuthority(ImpersonationHelper.java:20)
17-Apr-2017 21:37:42         at com.atlassian.bamboo.security.ImpersonationHelper$1.run(ImpersonationHelper.java:52)
17-Apr-2017 21:37:42         at java.lang.Thread.run(Thread.java:745)
17-Apr-2017 21:37:42 Caused by: com.atlassian.bamboo.plugins.docker.client.DockerException: Error running Docker run command
17-Apr-2017 21:37:42         at com.atlassian.bamboo.plugins.docker.client.DockerCmd.run(DockerCmd.java:103)
17-Apr-2017 21:37:42         at com.atlassian.bamboo.plugins.docker.service.RunService.execute(RunService.java:60)
17-Apr-2017 21:37:42         ... 17 more
17-Apr-2017 21:37:42 Caused by: com.atlassian.utils.process.ProcessException: Error executing /usr/bin/docker run --volume /home/bamboo/xml-data/build-dir/PHPBB3-PR-JOB1:/data --workdir /data --rm -u=991 phpbb:php-5.6 /bin/bash -c "phpBB/vendor/bin/phpunit --log-junit build/logs/phpunit.xml"
17-Apr-2017 21:37:42         at com.atlassian.bamboo.plugins.docker.process.DockerTaskProcessService.execute(DockerTaskProcessService.java:60)
17-Apr-2017 21:37:42         at com.atlassian.bamboo.plugins.docker.client.DockerCmd.run(DockerCmd.java:99)
17-Apr-2017 21:37:42         ... 18 more
17-Apr-2017 21:37:42 Starting task 'Parsing test results produced by script' of type 'com.atlassian.bamboo.plugins.testresultparser:task.testresultparser.junit'
17-Apr-2017 21:37:42 Parsing test results under /home/bamboo/xml-data/build-dir/PHPBB3-PR-JOB1...
17-Apr-2017 21:37:42 Failing task since 1 failing test cases were found.
17-Apr-2017 21:37:42 Finished task 'Parsing test results produced by script' with result: Failed
17-Apr-2017 21:37:42
Substituting variable: ${bamboo.PRnumber} with 3909
17-Apr-2017 21:37:42
Substituting variable: ${bamboo.buildResultsUrl} with https://bamboo.phpbb.com/browse/PHPBB3-PR-JOB1-6999
17-Apr-2017 21:37:42
Substituting variable: ${bamboo.buildResultsUrl} with https://bamboo.phpbb.com/browse/PHPBB3-PR-JOB1-6999
17-Apr-2017 21:37:42 Starting task 'Set result build status' of type 'com.atlassian.bamboo.plugins.scripttask:task.builder.script'
17-Apr-2017 21:37:42
Beginning to execute external process for build 'phpBB3 - Pull Requests - Build and Test Job #6999 (PHPBB3-PR-JOB1-6999)'
... running command line:
/bin/sh /home/bamboo/temp/PHPBB3-PR-JOB1-6999-ScriptBuildTask-5522856856073289752.sh
... in: /home/bamboo/xml-data/build-dir/PHPBB3-PR-JOB1
... using extra environment variables:
bamboo_planRepository_1_branch=3.1.x
bamboo_planRepository_1_branchDisplayName=3.1.x
bamboo_repository_revision_number=8303058ac613c1699b51a647b29b97f754fdf6a6
bamboo_PRref=master
bamboo_resultsUrl=https://bamboo.phpbb.com/browse/PHPBB3-PR-JOB1-6999
bamboo_capability_system_builder_command_Git=/usr/bin/git
bamboo_repository_75956235_git_username=bantu
bamboo_planRepository_1_name=phpBB Ascraeus
bamboo_build_working_directory=/home/bamboo/xml-data/build-dir/PHPBB3-PR-JOB1
bamboo_buildKey=PHPBB3-PR-JOB1
bamboo_capability_phpbb_tests=true
bamboo_shortPlanName=Pull Requests
bamboo_capability_system_builder_command_fop=/usr/bin/fop
bamboo_capability_dbms_sqlite_2=true
bamboo_planRepository_name=phpBB Ascraeus
bamboo_PRnumber=3909
bamboo_buildNumber=6999
bamboo_repository_75956235_git_repositoryUrl=https://github.com/phpbb/phpbb.git
bamboo_capability_system_builder_phpunit_PHPUnit=/usr/bin/phpunit
bamboo_shortJobName=Build and Test Job
bamboo_buildResultsUrl=https://bamboo.phpbb.com/browse/PHPBB3-PR-JOB1-6999
bamboo_repository_75956235_branch_name=3.1.x
bamboo_planRepository_repositoryUrl=https://github.com/phpbb/phpbb.git
bamboo_agentId=131073
bamboo_planName=phpBB3 - Pull Requests
bamboo_build_commandline_com_atlassian_bamboo_plugins_scripttask_task_builder_script_7=/bin/sh /home/bamboo/temp/PHPBB3-PR-JOB1-6999-ScriptBuildTask-3290725433872607721.sh
bamboo_shortPlanKey=PR
bamboo_shortJobKey=JOB1
bamboo_capability_dbms_mysql_55=true
bamboo_capability_system_jdk_JDK_1_7_0_65=/usr/lib/jvm/java-7-openjdk-amd64
bamboo_planRepository_revision=8303058ac613c1699b51a647b29b97f754fdf6a6
bamboo_repository_previous_revision_number=8303058ac613c1699b51a647b29b97f754fdf6a6
bamboo_buildTimeStamp=2017-04-17T21:30:59.900Z
bamboo_planRepository_previousRevision=8303058ac613c1699b51a647b29b97f754fdf6a6
bamboo_capability_system_builder_mvn2_Maven_2=/usr/share/maven2
bamboo_capability_system_jdk_JDK_1_6_0_16=/usr/lib/jvm/java-6-sun-1.6.0.16
bamboo_build_commandline_com_atlassian_bamboo_plugins_scripttask_task_builder_script_4=/bin/sh /home/bamboo/temp/PHPBB3-PR-JOB1-6999-ScriptBuildTask-3695687921406198300.sh
bamboo_buildResultKey=PHPBB3-PR-JOB1-6999
bamboo_repository_git_branch=3.1.x
bamboo_repository_branch_name=3.1.x
bamboo_buildPlanName=phpBB3 - Pull Requests - Build and Test Job
bamboo_planRepository_1_revision=8303058ac613c1699b51a647b29b97f754fdf6a6
bamboo_repository_name=phpBB Ascraeus
bamboo_capability_system_docker_executable=/usr/bin/docker
bamboo_build_commandline_com_atlassian_bamboo_plugins_bamboo_docker_plugin_task_docker_cli_10=/usr/bin/docker run --volume /home/bamboo/xml-data/build-dir/PHPBB3-PR-JOB1:/data --workdir /data --rm -u=991 phpbb:php-5.6 /bin/bash -c phpBB/vendor/bin/phpunit --log-junit build/logs/phpunit.xml
bamboo_build_commandline_com_atlassian_bamboo_plugins_bamboo_docker_plugin_task_docker_cli_11=/usr/bin/docker run --volume /home/bamboo/xml-data/build-dir/PHPBB3-PR-JOB1:/data --workdir /data/build --rm -u=991 phpbb:php-5.6 ../phpBB/vendor/bin/phing sniff
bamboo_build_commandline_com_atlassian_bamboo_plugins_bamboo_docker_plugin_task_docker_cli_12=/usr/bin/docker run --volume /home/bamboo/xml-data/build-dir/PHPBB3-PR-JOB1:/data --workdir /data/phpBB --rm -e HOME=/home/bamboo -u=991 phpbb:php-5.6 /bin/bash -c php ../composer.phar install --dev; cd ../build; ../phpBB/vendor/bin/phing clean prepare
bamboo_planRepository_branch=3.1.x
bamboo_agentWorkingDirectory=/home/bamboo/xml-data/build-dir
bamboo_capability_system_git_executable=/usr/bin/git
bamboo_planRepository_1_previousRevision=8303058ac613c1699b51a647b29b97f754fdf6a6
bamboo_capability_system_builder_phpunit_PHPUnit_3_4=/usr/bin/phpunit
bamboo_repository_git_username=bantu
bamboo_repository_75956235_revision_number=8303058ac613c1699b51a647b29b97f754fdf6a6
bamboo_planRepository_branchDisplayName=3.1.x
bamboo_planRepository_1_type=gitv2
bamboo_planRepository_branchName=3.1.x
bamboo_repository_75956235_previous_revision_number=8303058ac613c1699b51a647b29b97f754fdf6a6
bamboo_capability_system_jdk_JDK=/usr/lib/jvm/java-6-sun
bamboo_plan_storageTag=PHPBB3-PR
bamboo_planRepository_type=gitv2
bamboo_planRepository_1_username=bantu
bamboo_ManualBuildTriggerReason_userName=Build Robot
bamboo_repository_git_repositoryUrl=https://github.com/phpbb/phpbb.git
bamboo_repository_75956235_git_branch=3.1.x
bamboo_capability_system_builder_ant_Ant=/usr/share/ant
bamboo_repository_75956235_name=phpBB Ascraeus
bamboo_working_directory=/home/bamboo/xml-data/build-dir/PHPBB3-PR-JOB1
bamboo_planKey=PHPBB3-PR
bamboo_planRepository_1_repositoryUrl=https://github.com/phpbb/phpbb.git
bamboo_planRepository_username=bantu
bamboo_capability_local=true
bamboo_capability_system_jdk_JDK_1_6=/usr/lib/jvm/java-6-sun
bamboo_capability_system_jdk_JDK_1_7=/usr/lib/jvm/java-7-openjdk-amd64
bamboo_planRepository_1_branchName=3.1.x
17-Apr-2017 21:37:43 From https://github.com/phpbb/phpbb
17-Apr-2017 21:37:43 * branch            refs/pull/3909/head -> FETCH_HEAD
17-Apr-2017 21:37:43   <testsuite name="" tests="6636" assertions="61321" failures="1" errors="0" time="200.091781">
17-Apr-2017 21:37:43     <testsuite name="phpBB Test Suite" tests="5136" assertions="59821" failures="1" errors="0" time="152.777818">
17-Apr-2017 21:37:43       <testsuite name="phpbb_console_user_add_test" file="/data/tests/console/user/add_test.php" tests="3" assertions="9" failures="1" errors="0" time="0.379423">
17-Apr-2017 21:37:43   % Total    % Received % Xferd  Average Speed   Time    Time     Time  Current
17-Apr-2017 21:37:43                                  Dload  Upload   Total   Spent    Left  Speed
17-Apr-2017 21:37:43
17-Apr-2017 21:37:43   0     0    0     0    0     0      0      0 --:--:-- --:--:-- --:--:--     0
17-Apr-2017 21:37:43 100   267  100    93  100   174    152    284 --:--:-- --:--:-- --:--:--   284
17-Apr-2017 21:37:43 Finished task 'Set result build status' with result: Success
17-Apr-2017 21:37:43 Running post build plugin 'NCover Results Collector'
17-Apr-2017 21:37:43 Running post build plugin 'Artifact Copier'
17-Apr-2017 21:37:43 Running post build plugin 'npm Cache Cleanup'
17-Apr-2017 21:37:43 Running post build plugin 'Clover Results Collector'
17-Apr-2017 21:37:43 Running post build plugin 'Docker Container Cleanup'
17-Apr-2017 21:37:44 Successfully removed working directory at '/home/bamboo/xml-data/build-dir/PHPBB3-PR-JOB1'
17-Apr-2017 21:37:44 Finalising the build...
17-Apr-2017 21:37:44 Stopping timer.
17-Apr-2017 21:37:44 Build PHPBB3-PR-JOB1-6999 completed.
17-Apr-2017 21:37:44 Running on server: post build plugin 'NCover Results Collector'
17-Apr-2017 21:37:44 Running on server: post build plugin 'Build Hanging Detection Configuration'
17-Apr-2017 21:37:44 Running on server: post build plugin 'Clover Delta Calculator'
17-Apr-2017 21:37:44 Running on server: post build plugin 'Maven Dependencies Postprocessor'
17-Apr-2017 21:37:44 All post build plugins have finished
17-Apr-2017 21:37:44 Generating build results summary...
17-Apr-2017 21:37:48 Saving build results to disk...
17-Apr-2017 21:37:48 Logging substituted variables...
17-Apr-2017 21:37:48 Indexing build results...
17-Apr-2017 21:37:48 Finished building PHPBB3-PR-JOB1-6999.
17-Apr-2017 21:37:48
Substituting variable: ${bamboo.PRnumber} with 3909