Tests pending pull requests

Build: #7013 failed

Job: Build and Test Job failed

Stages & jobs

  1. Build and Test

Build log

The build generated 557 lines of output. Download or view full build log

18-Apr-2017 13:06:29 Build phpBB3 - Pull Requests - Build and Test Job #7013 (PHPBB3-PR-JOB1-7013) started building on agent Default Agent
18-Apr-2017 13:06:29
18-Apr-2017 13:06:29 Build working directory is /home/bamboo/xml-data/build-dir/PHPBB3-PR-JOB1
18-Apr-2017 13:06:29 Executing build phpBB3 - Pull Requests - Build and Test Job #7013 (PHPBB3-PR-JOB1-7013)
18-Apr-2017 13:06:29 Starting task 'Checkout develop branch' of type 'com.atlassian.bamboo.plugins.vcs:task.vcs.checkout'
18-Apr-2017 13:06:29 Build always requires a clean checkout
18-Apr-2017 13:06:29 Cleaning build directory '/home/bamboo/xml-data/build-dir/PHPBB3-PR-JOB1'
18-Apr-2017 13:06:29 Updating source code to revision: 8303058ac613c1699b51a647b29b97f754fdf6a6
18-Apr-2017 13:06:29 Fetching 'refs/heads/3.1.x' from 'https://github.com/phpbb/phpbb.git'.
18-Apr-2017 13:06:29 Checking out revision 8303058ac613c1699b51a647b29b97f754fdf6a6.
18-Apr-2017 13:06:29 Creating local git repository in '/home/bamboo/xml-data/build-dir/PHPBB3-PR-JOB1/.git'.
18-Apr-2017 13:06:29 Cloning into '/home/bamboo/xml-data/build-dir/PHPBB3-PR-JOB1'...
18-Apr-2017 13:06:29 done.
18-Apr-2017 13:06:31 Branch 3.1.x set up to track remote branch 3.1.x from origin.
18-Apr-2017 13:06:31 Switched to a new branch '3.1.x'
18-Apr-2017 13:06:31 Updated source code to revision: 8303058ac613c1699b51a647b29b97f754fdf6a6
18-Apr-2017 13:06:31 Finished task 'Checkout develop branch' with result: Success
18-Apr-2017 13:06:31 Running pre-build action: VCS Version Collector
18-Apr-2017 13:06:31
Substituting variable: ${bamboo.PRnumber} with 4789
18-Apr-2017 13:06:31
Substituting variable: ${bamboo.buildResultsUrl} with https://bamboo.phpbb.com/browse/PHPBB3-PR-JOB1-7013
18-Apr-2017 13:06:31 Starting task 'Set pending build status' of type 'com.atlassian.bamboo.plugins.scripttask:task.builder.script'
18-Apr-2017 13:06:31
Beginning to execute external process for build 'phpBB3 - Pull Requests - Build and Test Job #7013 (PHPBB3-PR-JOB1-7013)'
... running command line:
/bin/sh /home/bamboo/temp/PHPBB3-PR-JOB1-7013-ScriptBuildTask-998297896725034292.sh
... in: /home/bamboo/xml-data/build-dir/PHPBB3-PR-JOB1
... using extra environment variables:
bamboo_planRepository_1_branch=3.1.x
bamboo_planRepository_1_branchDisplayName=3.1.x
bamboo_repository_revision_number=8303058ac613c1699b51a647b29b97f754fdf6a6
bamboo_PRref=master
bamboo_resultsUrl=https://bamboo.phpbb.com/browse/PHPBB3-PR-JOB1-7013
bamboo_capability_system_builder_command_Git=/usr/bin/git
bamboo_repository_75956235_git_username=bantu
bamboo_planRepository_1_name=phpBB Ascraeus
bamboo_build_working_directory=/home/bamboo/xml-data/build-dir/PHPBB3-PR-JOB1
bamboo_buildKey=PHPBB3-PR-JOB1
bamboo_capability_phpbb_tests=true
bamboo_shortPlanName=Pull Requests
bamboo_capability_system_builder_command_fop=/usr/bin/fop
bamboo_capability_dbms_sqlite_2=true
bamboo_planRepository_name=phpBB Ascraeus
bamboo_PRnumber=4789
bamboo_buildNumber=7013
bamboo_repository_75956235_git_repositoryUrl=https://github.com/phpbb/phpbb.git
bamboo_capability_system_builder_phpunit_PHPUnit=/usr/bin/phpunit
bamboo_shortJobName=Build and Test Job
bamboo_buildResultsUrl=https://bamboo.phpbb.com/browse/PHPBB3-PR-JOB1-7013
bamboo_repository_75956235_branch_name=3.1.x
bamboo_planRepository_repositoryUrl=https://github.com/phpbb/phpbb.git
bamboo_agentId=131073
bamboo_planName=phpBB3 - Pull Requests
bamboo_shortPlanKey=PR
bamboo_shortJobKey=JOB1
bamboo_capability_dbms_mysql_55=true
bamboo_capability_system_jdk_JDK_1_7_0_65=/usr/lib/jvm/java-7-openjdk-amd64
bamboo_planRepository_revision=8303058ac613c1699b51a647b29b97f754fdf6a6
bamboo_repository_previous_revision_number=8303058ac613c1699b51a647b29b97f754fdf6a6
bamboo_buildTimeStamp=2017-04-18T13:06:29.564Z
bamboo_planRepository_previousRevision=8303058ac613c1699b51a647b29b97f754fdf6a6
bamboo_capability_system_builder_mvn2_Maven_2=/usr/share/maven2
bamboo_capability_system_jdk_JDK_1_6_0_16=/usr/lib/jvm/java-6-sun-1.6.0.16
bamboo_buildResultKey=PHPBB3-PR-JOB1-7013
bamboo_repository_git_branch=3.1.x
bamboo_repository_branch_name=3.1.x
bamboo_buildPlanName=phpBB3 - Pull Requests - Build and Test Job
bamboo_planRepository_1_revision=8303058ac613c1699b51a647b29b97f754fdf6a6
bamboo_repository_name=phpBB Ascraeus
bamboo_capability_system_docker_executable=/usr/bin/docker
bamboo_planRepository_branch=3.1.x
bamboo_agentWorkingDirectory=/home/bamboo/xml-data/build-dir
bamboo_capability_system_git_executable=/usr/bin/git
bamboo_planRepository_1_previousRevision=8303058ac613c1699b51a647b29b97f754fdf6a6
bamboo_capability_system_builder_phpunit_PHPUnit_3_4=/usr/bin/phpunit
bamboo_repository_git_username=bantu
bamboo_repository_75956235_revision_number=8303058ac613c1699b51a647b29b97f754fdf6a6
bamboo_planRepository_branchDisplayName=3.1.x
bamboo_planRepository_1_type=gitv2
bamboo_planRepository_branchName=3.1.x
bamboo_repository_75956235_previous_revision_number=8303058ac613c1699b51a647b29b97f754fdf6a6
bamboo_capability_system_jdk_JDK=/usr/lib/jvm/java-6-sun
bamboo_plan_storageTag=PHPBB3-PR
bamboo_planRepository_type=gitv2
bamboo_planRepository_1_username=bantu
bamboo_ManualBuildTriggerReason_userName=Build Robot
bamboo_repository_git_repositoryUrl=https://github.com/phpbb/phpbb.git
bamboo_repository_75956235_git_branch=3.1.x
bamboo_capability_system_builder_ant_Ant=/usr/share/ant
bamboo_repository_75956235_name=phpBB Ascraeus
bamboo_working_directory=/home/bamboo/xml-data/build-dir/PHPBB3-PR-JOB1
bamboo_planKey=PHPBB3-PR
bamboo_planRepository_1_repositoryUrl=https://github.com/phpbb/phpbb.git
bamboo_planRepository_username=bantu
bamboo_capability_local=true
bamboo_capability_system_jdk_JDK_1_6=/usr/lib/jvm/java-6-sun
bamboo_capability_system_jdk_JDK_1_7=/usr/lib/jvm/java-7-openjdk-amd64
bamboo_planRepository_1_branchName=3.1.x
18-Apr-2017 13:06:32 From https://github.com/phpbb/phpbb
18-Apr-2017 13:06:32 * branch            refs/pull/4789/head -> FETCH_HEAD
18-Apr-2017 13:06:32   % Total    % Received % Xferd  Average Speed   Time    Time     Time  Current
18-Apr-2017 13:06:32                                  Dload  Upload   Total   Spent    Left  Speed
18-Apr-2017 13:06:32
18-Apr-2017 13:06:33   0     0    0     0    0     0      0      0 --:--:-- --:--:-- --:--:--     0
18-Apr-2017 13:06:33   0     0    0     0    0     0      0      0 --:--:-- --:--:-- --:--:--     0
18-Apr-2017 13:06:33 100   275  100    93  100   182    125    245 --:--:-- --:--:-- --:--:--   245
18-Apr-2017 13:06:33 Finished task 'Set pending build status' with result: Success
18-Apr-2017 13:06:33
Substituting variable: ${bamboo.PRnumber} with 4789
18-Apr-2017 13:06:33 Starting task 'Fetch PR' of type 'com.atlassian.bamboo.plugins.scripttask:task.builder.script'
18-Apr-2017 13:06:33
Beginning to execute external process for build 'phpBB3 - Pull Requests - Build and Test Job #7013 (PHPBB3-PR-JOB1-7013)'
... running command line:
/bin/sh /home/bamboo/temp/PHPBB3-PR-JOB1-7013-ScriptBuildTask-1903513713185622801.sh
... in: /home/bamboo/xml-data/build-dir/PHPBB3-PR-JOB1
... using extra environment variables:
bamboo_planRepository_1_branch=3.1.x
bamboo_planRepository_1_branchDisplayName=3.1.x
bamboo_repository_revision_number=8303058ac613c1699b51a647b29b97f754fdf6a6
bamboo_PRref=master
bamboo_resultsUrl=https://bamboo.phpbb.com/browse/PHPBB3-PR-JOB1-7013
bamboo_capability_system_builder_command_Git=/usr/bin/git
bamboo_repository_75956235_git_username=bantu
bamboo_planRepository_1_name=phpBB Ascraeus
bamboo_build_working_directory=/home/bamboo/xml-data/build-dir/PHPBB3-PR-JOB1
bamboo_buildKey=PHPBB3-PR-JOB1
bamboo_capability_phpbb_tests=true
bamboo_shortPlanName=Pull Requests
bamboo_capability_system_builder_command_fop=/usr/bin/fop
bamboo_capability_dbms_sqlite_2=true
bamboo_planRepository_name=phpBB Ascraeus
bamboo_PRnumber=4789
bamboo_buildNumber=7013
bamboo_repository_75956235_git_repositoryUrl=https://github.com/phpbb/phpbb.git
bamboo_capability_system_builder_phpunit_PHPUnit=/usr/bin/phpunit
bamboo_shortJobName=Build and Test Job
bamboo_buildResultsUrl=https://bamboo.phpbb.com/browse/PHPBB3-PR-JOB1-7013
bamboo_repository_75956235_branch_name=3.1.x
bamboo_planRepository_repositoryUrl=https://github.com/phpbb/phpbb.git
bamboo_agentId=131073
bamboo_planName=phpBB3 - Pull Requests
bamboo_build_commandline_com_atlassian_bamboo_plugins_scripttask_task_builder_script_7=/bin/sh /home/bamboo/temp/PHPBB3-PR-JOB1-7013-ScriptBuildTask-998297896725034292.sh
bamboo_shortPlanKey=PR
bamboo_shortJobKey=JOB1
bamboo_capability_dbms_mysql_55=true
bamboo_capability_system_jdk_JDK_1_7_0_65=/usr/lib/jvm/java-7-openjdk-amd64
bamboo_planRepository_revision=8303058ac613c1699b51a647b29b97f754fdf6a6
bamboo_repository_previous_revision_number=8303058ac613c1699b51a647b29b97f754fdf6a6
bamboo_buildTimeStamp=2017-04-18T13:06:29.564Z
bamboo_planRepository_previousRevision=8303058ac613c1699b51a647b29b97f754fdf6a6
bamboo_capability_system_builder_mvn2_Maven_2=/usr/share/maven2
bamboo_capability_system_jdk_JDK_1_6_0_16=/usr/lib/jvm/java-6-sun-1.6.0.16
bamboo_buildResultKey=PHPBB3-PR-JOB1-7013
bamboo_repository_git_branch=3.1.x
bamboo_repository_branch_name=3.1.x
bamboo_buildPlanName=phpBB3 - Pull Requests - Build and Test Job
bamboo_planRepository_1_revision=8303058ac613c1699b51a647b29b97f754fdf6a6
bamboo_repository_name=phpBB Ascraeus
bamboo_capability_system_docker_executable=/usr/bin/docker
bamboo_planRepository_branch=3.1.x
bamboo_agentWorkingDirectory=/home/bamboo/xml-data/build-dir
bamboo_capability_system_git_executable=/usr/bin/git
bamboo_planRepository_1_previousRevision=8303058ac613c1699b51a647b29b97f754fdf6a6
bamboo_capability_system_builder_phpunit_PHPUnit_3_4=/usr/bin/phpunit
bamboo_repository_git_username=bantu
bamboo_repository_75956235_revision_number=8303058ac613c1699b51a647b29b97f754fdf6a6
bamboo_planRepository_branchDisplayName=3.1.x
bamboo_planRepository_1_type=gitv2
bamboo_planRepository_branchName=3.1.x
bamboo_repository_75956235_previous_revision_number=8303058ac613c1699b51a647b29b97f754fdf6a6
bamboo_capability_system_jdk_JDK=/usr/lib/jvm/java-6-sun
bamboo_plan_storageTag=PHPBB3-PR
bamboo_planRepository_type=gitv2
bamboo_planRepository_1_username=bantu
bamboo_ManualBuildTriggerReason_userName=Build Robot
bamboo_repository_git_repositoryUrl=https://github.com/phpbb/phpbb.git
bamboo_repository_75956235_git_branch=3.1.x
bamboo_capability_system_builder_ant_Ant=/usr/share/ant
bamboo_repository_75956235_name=phpBB Ascraeus
bamboo_working_directory=/home/bamboo/xml-data/build-dir/PHPBB3-PR-JOB1
bamboo_planKey=PHPBB3-PR
bamboo_planRepository_1_repositoryUrl=https://github.com/phpbb/phpbb.git
bamboo_planRepository_username=bantu
bamboo_capability_local=true
bamboo_capability_system_jdk_JDK_1_6=/usr/lib/jvm/java-6-sun
bamboo_capability_system_jdk_JDK_1_7=/usr/lib/jvm/java-7-openjdk-amd64
bamboo_planRepository_1_branchName=3.1.x
18-Apr-2017 13:06:34 From https://github.com/phpbb/phpbb
18-Apr-2017 13:06:34 * branch            refs/pull/4789/merge -> FETCH_HEAD
18-Apr-2017 13:06:34 Note: checking out 'FETCH_HEAD'.
18-Apr-2017 13:06:34
18-Apr-2017 13:06:34 You are in 'detached HEAD' state. You can look around, make experimental
18-Apr-2017 13:06:34 changes and commit them, and you can discard any commits you make in this
18-Apr-2017 13:06:34 state without impacting any branches by performing another checkout.
18-Apr-2017 13:06:34
18-Apr-2017 13:06:34 If you want to create a new branch to retain commits you create, you may
18-Apr-2017 13:06:34 do so (now or later) by using -b with the checkout command again. Example:
18-Apr-2017 13:06:34
18-Apr-2017 13:06:34   git checkout -b new_branch_name
18-Apr-2017 13:06:34
18-Apr-2017 13:06:34 HEAD is now at 1a3ad85... Merge e3ca15667721761336ec2d5ba354b37db2160290 into a87727ba4781967bc00fc784c47f94f8fb121789
18-Apr-2017 13:06:34 Finished task 'Fetch PR' with result: Success
18-Apr-2017 13:06:34 Skipping execution of task 'Prepare directory' as it is disabled
18-Apr-2017 13:06:34
Substituting variable: ${bamboo.working.directory} with /home/bamboo/xml-data/build-dir/PHPBB3-PR-JOB1
18-Apr-2017 13:06:34 Starting task 'Prepare directory' of type 'com.atlassian.bamboo.plugins.bamboo-docker-plugin:task.docker.cli'
18-Apr-2017 13:06:34 Running image name (phpbb:php-5.6)
18-Apr-2017 13:06:34
Beginning to execute external process for build 'phpBB3 - Pull Requests - Build and Test Job #7013 (PHPBB3-PR-JOB1-7013)'
... running command line:
/usr/bin/docker run --volume /home/bamboo/xml-data/build-dir/PHPBB3-PR-JOB1:/data --workdir /data/phpBB --rm -e HOME=/home/bamboo -u=991 phpbb:php-5.6 /bin/bash -c php ../composer.phar install --dev; cd ../build; ../phpBB/vendor/bin/phing clean prepare
... in: /home/bamboo/xml-data/build-dir/PHPBB3-PR-JOB1
... using extra environment variables:
bamboo_planRepository_1_branch=3.1.x
bamboo_planRepository_1_branchDisplayName=3.1.x
bamboo_repository_revision_number=8303058ac613c1699b51a647b29b97f754fdf6a6
bamboo_PRref=master
bamboo_resultsUrl=https://bamboo.phpbb.com/browse/PHPBB3-PR-JOB1-7013
bamboo_capability_system_builder_command_Git=/usr/bin/git
bamboo_repository_75956235_git_username=bantu
bamboo_planRepository_1_name=phpBB Ascraeus
bamboo_build_working_directory=/home/bamboo/xml-data/build-dir/PHPBB3-PR-JOB1
bamboo_buildKey=PHPBB3-PR-JOB1
bamboo_capability_phpbb_tests=true
bamboo_shortPlanName=Pull Requests
bamboo_capability_system_builder_command_fop=/usr/bin/fop
bamboo_capability_dbms_sqlite_2=true
bamboo_planRepository_name=phpBB Ascraeus
bamboo_PRnumber=4789
bamboo_buildNumber=7013
bamboo_repository_75956235_git_repositoryUrl=https://github.com/phpbb/phpbb.git
bamboo_capability_system_builder_phpunit_PHPUnit=/usr/bin/phpunit
bamboo_shortJobName=Build and Test Job
bamboo_buildResultsUrl=https://bamboo.phpbb.com/browse/PHPBB3-PR-JOB1-7013
bamboo_repository_75956235_branch_name=3.1.x
bamboo_planRepository_repositoryUrl=https://github.com/phpbb/phpbb.git
bamboo_agentId=131073
bamboo_planName=phpBB3 - Pull Requests
bamboo_build_commandline_com_atlassian_bamboo_plugins_scripttask_task_builder_script_7=/bin/sh /home/bamboo/temp/PHPBB3-PR-JOB1-7013-ScriptBuildTask-998297896725034292.sh
bamboo_shortPlanKey=PR
bamboo_shortJobKey=JOB1
bamboo_capability_dbms_mysql_55=true
bamboo_capability_system_jdk_JDK_1_7_0_65=/usr/lib/jvm/java-7-openjdk-amd64
bamboo_planRepository_revision=8303058ac613c1699b51a647b29b97f754fdf6a6
bamboo_repository_previous_revision_number=8303058ac613c1699b51a647b29b97f754fdf6a6
bamboo_buildTimeStamp=2017-04-18T13:06:29.564Z
bamboo_planRepository_previousRevision=8303058ac613c1699b51a647b29b97f754fdf6a6
bamboo_capability_system_builder_mvn2_Maven_2=/usr/share/maven2
bamboo_capability_system_jdk_JDK_1_6_0_16=/usr/lib/jvm/java-6-sun-1.6.0.16
bamboo_build_commandline_com_atlassian_bamboo_plugins_scripttask_task_builder_script_4=/bin/sh /home/bamboo/temp/PHPBB3-PR-JOB1-7013-ScriptBuildTask-1903513713185622801.sh
bamboo_buildResultKey=PHPBB3-PR-JOB1-7013
bamboo_repository_git_branch=3.1.x
bamboo_repository_branch_name=3.1.x
bamboo_buildPlanName=phpBB3 - Pull Requests - Build and Test Job
bamboo_planRepository_1_revision=8303058ac613c1699b51a647b29b97f754fdf6a6
bamboo_repository_name=phpBB Ascraeus
bamboo_capability_system_docker_executable=/usr/bin/docker
bamboo_planRepository_branch=3.1.x
bamboo_agentWorkingDirectory=/home/bamboo/xml-data/build-dir
bamboo_capability_system_git_executable=/usr/bin/git
bamboo_planRepository_1_previousRevision=8303058ac613c1699b51a647b29b97f754fdf6a6
bamboo_capability_system_builder_phpunit_PHPUnit_3_4=/usr/bin/phpunit
bamboo_repository_git_username=bantu
bamboo_repository_75956235_revision_number=8303058ac613c1699b51a647b29b97f754fdf6a6
bamboo_planRepository_branchDisplayName=3.1.x
bamboo_planRepository_1_type=gitv2
bamboo_planRepository_branchName=3.1.x
bamboo_repository_75956235_previous_revision_number=8303058ac613c1699b51a647b29b97f754fdf6a6
bamboo_capability_system_jdk_JDK=/usr/lib/jvm/java-6-sun
bamboo_plan_storageTag=PHPBB3-PR
bamboo_planRepository_type=gitv2
bamboo_planRepository_1_username=bantu
bamboo_ManualBuildTriggerReason_userName=Build Robot
bamboo_repository_git_repositoryUrl=https://github.com/phpbb/phpbb.git
bamboo_repository_75956235_git_branch=3.1.x
bamboo_capability_system_builder_ant_Ant=/usr/share/ant
bamboo_repository_75956235_name=phpBB Ascraeus
bamboo_working_directory=/home/bamboo/xml-data/build-dir/PHPBB3-PR-JOB1
bamboo_planKey=PHPBB3-PR
bamboo_planRepository_1_repositoryUrl=https://github.com/phpbb/phpbb.git
bamboo_planRepository_username=bantu
bamboo_capability_local=true
bamboo_capability_system_jdk_JDK_1_6=/usr/lib/jvm/java-6-sun
bamboo_capability_system_jdk_JDK_1_7=/usr/lib/jvm/java-7-openjdk-amd64
bamboo_planRepository_1_branchName=3.1.x
18-Apr-2017 13:06:34 You are running composer with xdebug enabled. This has a major impact on runtime performance. See https://getcomposer.org/xdebug
18-Apr-2017 13:06:34 You are using the deprecated option "dev". Dev packages are installed by default now.
18-Apr-2017 13:06:34 Cannot create cache directory /home/bamboo/.composer/cache/repo/https---packagist.org/, or directory is not writable. Proceeding without cache
18-Apr-2017 13:06:34 Cannot create cache directory /home/bamboo/.composer/cache/files/, or directory is not writable. Proceeding without cache
18-Apr-2017 13:06:34 Loading composer repositories with package information
18-Apr-2017 13:06:34 Installing dependencies (including require-dev) from lock file
18-Apr-2017 13:06:35   - Installing bantu/ini-get-wrapper (v1.0.1)
18-Apr-2017 13:06:36     Downloading: Connecting...    Downloading: 0%               Downloading: 100%    Downloading: 100%
18-Apr-2017 13:06:36
18-Apr-2017 13:06:36   - Installing google/recaptcha (1.1.2)
18-Apr-2017 13:06:37     Downloading: Connecting...    Downloading: 0%               Downloading: 30%    Downloading: 55%    Downloading: 65%    Downloading: 70%    Downloading: 95%    Downloading: 100%    Downloading: 100%
18-Apr-2017 13:06:37
18-Apr-2017 13:06:37   - Installing guzzlehttp/promises (1.3.0)
18-Apr-2017 13:06:39     Downloading: Connecting...    Downloading: 0%               Downloading: 15%    Downloading: 35%    Downloading: 60%    Downloading: 70%    Downloading: 80%    Downloading: 95%    Downloading: 100%    Downloading: 100%
18-Apr-2017 13:06:39
18-Apr-2017 13:06:39   - Installing psr/http-message (1.0.1)
18-Apr-2017 13:06:40     Downloading: Connecting...    Downloading: 0%               Downloading: 95%    Downloading: 100%    Downloading: 100%
18-Apr-2017 13:06:40
18-Apr-2017 13:06:40   - Installing guzzlehttp/psr7 (1.3.1)
18-Apr-2017 13:06:41     Downloading: Connecting...    Downloading: 0%               Downloading: 5%    Downloading: 15%    Downloading: 20%    Downloading: 35%    Downloading: 40%    Downloading: 55%    Downloading: 60%    Downloading: 75%    Downloading: 80%    Downloading: 95%    Downloading: 100%
18-Apr-2017 13:06:41
18-Apr-2017 13:06:41   - Installing lusitanian/oauth (v0.8.9)
18-Apr-2017 13:06:42     Downloading: Connecting...    Downloading: 0%               Downloading: 5%    Downloading: 10%    Downloading: 15%    Downloading: 20%    Downloading: 25%    Downloading: 30%    Downloading: 35%    Downloading: 40%    Downloading: 45%    Downloading: 50%    Downloading: 55%    Downloading: 60%    Downloading: 65%    Downloading: 70%    Downloading: 75%    Downloading: 80%    Downloading: 85%    Downloading: 90%    Downloading: 95%    Downloading: 100%    Downloading: 100%
18-Apr-2017 13:06:42
18-Apr-2017 13:06:42   - Installing marc1706/fast-image-size (v1.1.2)
18-Apr-2017 13:06:43     Downloading: Connecting...    Downloading: 0%               Downloading: 35%    Downloading: 55%    Downloading: 90%    Downloading: 100%    Downloading: 100%
18-Apr-2017 13:06:43
18-Apr-2017 13:06:43   - Installing paragonie/random_compat (v1.4.1)
18-Apr-2017 13:06:44     Downloading: Connecting...    Downloading: 0%               Downloading: 20%    Downloading: 35%    Downloading: 60%    Downloading: 80%    Downloading: 95%    Downloading: 100%    Downloading: 100%
18-Apr-2017 13:06:44
18-Apr-2017 13:06:44   - Installing patchwork/utf8 (v1.3.1)
18-Apr-2017 13:06:46     Downloading: Connecting...    Downloading: 0%               Downloading: 5%    Downloading: 10%    Downloading: 15%    Downloading: 20%    Downloading: 25%    Downloading: 30%    Downloading: 35%    Downloading: 40%    Downloading: 45%    Downloading: 50%    Downloading: 55%    Downloading: 60%    Downloading: 65%    Downloading: 70%    Downloading: 75%    Downloading: 80%    Downloading: 85%    Downloading: 90%    Downloading: 95%    Downloading: 100%    Downloading: 100%
18-Apr-2017 13:06:46
18-Apr-2017 13:06:46   - Installing s9e/text-formatter (0.9.1)
18-Apr-2017 13:06:47     Downloading: Connecting...    Downloading: 0%               Downloading: 5%    Downloading: 10%    Downloading: 15%    Downloading: 20%    Downloading: 25%    Downloading: 30%    Downloading: 35%    Downloading: 40%    Downloading: 45%    Downloading: 50%    Downloading: 55%    Downloading: 60%    Downloading: 65%    Downloading: 70%    Downloading: 75%    Downloading: 80%    Downloading: 85%    Downloading: 90%    Downloading: 95%    Downloading: 100%    Downloading: 100%
18-Apr-2017 13:06:47
18-Apr-2017 13:06:47   - Installing symfony/filesystem (v3.2.0)
18-Apr-2017 13:06:48     Downloading: Connecting...    Downloading: 0%               Downloading: 35%    Downloading: 40%    Downloading: 75%    Downloading: 95%    Downloading: 100%    Downloading: 100%
18-Apr-2017 13:06:48
18-Apr-2017 13:06:48   - Installing symfony/config (v3.2.0)
18-Apr-2017 13:06:49     Downloading: Connecting...    Downloading: 0%               Downloading: 5%    Downloading: 10%    Downloading: 15%    Downloading: 20%    Downloading: 25%    Downloading: 30%    Downloading: 35%    Downloading: 40%    Downloading: 45%    Downloading: 50%    Downloading: 55%    Downloading: 60%    Downloading: 65%    Downloading: 70%    Downloading: 75%    Downloading: 80%    Downloading: 85%    Downloading: 90%    Downloading: 95%    Downloading: 100%    Downloading: 100%
18-Apr-2017 13:06:49
18-Apr-2017 13:06:49   - Installing symfony/finder (v3.2.0)
18-Apr-2017 13:06:50     Downloading: Connecting...    Downloading: 0%               Downloading: 5%    Downloading: 10%    Downloading: 15%    Downloading: 20%    Downloading: 25%    Downloading: 35%    Downloading: 40%    Downloading: 45%    Downloading: 100%    Downloading: 100%
18-Apr-2017 13:06:50
18-Apr-2017 13:06:50   - Installing symfony/polyfill-mbstring (v1.3.0)
18-Apr-2017 13:06:51     Downloading: Connecting...    Downloading: 0%               Downloading: 35%    Downloading: 70%    Downloading: 90%    Downloading: 100%
18-Apr-2017 13:06:51
18-Apr-2017 13:06:51   - Installing symfony/http-foundation (v3.2.0)
18-Apr-2017 13:06:53     Downloading: Connecting...    Downloading: 0%               Downloading: 5%    Downloading: 10%    Downloading: 15%    Downloading: 20%    Downloading: 25%    Downloading: 30%    Downloading: 35%    Downloading: 40%    Downloading: 45%    Downloading: 50%    Downloading: 55%    Downloading: 60%    Downloading: 65%    Downloading: 70%    Downloading: 75%    Downloading: 80%    Downloading: 85%    Downloading: 90%    Downloading: 95%    Downloading: 100%    Downloading: 100%
18-Apr-2017 13:06:53
18-Apr-2017 13:06:53   - Installing symfony/event-dispatcher (v3.2.0)
18-Apr-2017 13:06:54     Downloading: Connecting...    Downloading: 0%               Downloading: 5%    Downloading: 10%    Downloading: 15%    Downloading: 100%
18-Apr-2017 13:06:54
18-Apr-2017 13:06:54   - Installing psr/log (1.0.2)
18-Apr-2017 13:06:55     Downloading: Connecting...    Downloading: 0%               Downloading: 15%    Downloading: 100%    Downloading: 100%
18-Apr-2017 13:06:55
18-Apr-2017 13:06:55   - Installing symfony/debug (v3.2.0)
18-Apr-2017 13:06:56     Downloading: Connecting...    Downloading: 0%               Downloading: 5%    Downloading: 25%    Downloading: 30%    Downloading: 35%    Downloading: 40%    Downloading: 45%    Downloading: 70%    Downloading: 75%    Downloading: 95%    Downloading: 100%    Downloading: 100%
18-Apr-2017 13:06:56
18-Apr-2017 13:06:56   - Installing symfony/http-kernel (v3.2.0)
18-Apr-2017 13:06:57     Downloading: Connecting...    Downloading: 0%               Downloading: 5%    Downloading: 10%    Downloading: 15%    Downloading: 20%    Downloading: 25%    Downloading: 30%    Downloading: 35%    Downloading: 40%    Downloading: 45%    Downloading: 50%    Downloading: 55%    Downloading: 60%    Downloading: 65%    Downloading: 70%    Downloading: 75%    Downloading: 80%    Downloading: 85%    Downloading: 90%    Downloading: 95%    Downloading: 100%    Downloading: 100%
18-Apr-2017 13:06:57
18-Apr-2017 13:06:57   - Installing symfony/dependency-injection (v3.2.0)
18-Apr-2017 13:06:58     Downloading: Connecting...    Downloading: 0%               Downloading: 5%    Downloading: 10%    Downloading: 15%    Downloading: 20%    Downloading: 25%    Downloading: 30%    Downloading: 35%    Downloading: 40%    Downloading: 45%    Downloading: 50%    Downloading: 55%    Downloading: 60%    Downloading: 65%    Downloading: 70%    Downloading: 75%    Downloading: 80%    Downloading: 85%    Downloading: 90%    Downloading: 95%    Downloading: 100%    Downloading: 100%
18-Apr-2017 13:06:58
18-Apr-2017 13:06:58   - Installing zendframework/zend-eventmanager (3.0.1)
18-Apr-2017 13:06:59     Downloading: Connecting...    Downloading: 0%               Downloading: 15%    Downloading: 30%    Downloading: 55%    Downloading: 70%    Downloading: 85%    Downloading: 100%
18-Apr-2017 13:06:59
18-Apr-2017 13:06:59   - Installing zendframework/zend-code (2.6.3)
18-Apr-2017 13:07:00     Downloading: Connecting...    Downloading: 0%               Downloading: 5%    Downloading: 10%    Downloading: 15%    Downloading: 20%    Downloading: 25%    Downloading: 30%    Downloading: 35%    Downloading: 40%    Downloading: 45%    Downloading: 50%    Downloading: 55%    Downloading: 60%    Downloading: 65%    Downloading: 70%    Downloading: 75%    Downloading: 80%    Downloading: 85%    Downloading: 90%    Downloading: 95%    Downloading: 100%    Downloading: 100%
18-Apr-2017 13:07:00
18-Apr-2017 13:07:00   - Installing ocramius/proxy-manager (1.0.2)
18-Apr-2017 13:07:02     Downloading: Connecting...    Downloading: 0%               Downloading: 5%    Downloading: 10%    Downloading: 15%    Downloading: 20%    Downloading: 25%    Downloading: 30%    Downloading: 35%    Downloading: 40%    Downloading: 45%    Downloading: 50%    Downloading: 55%    Downloading: 65%    Downloading: 70%    Downloading: 75%    Downloading: 80%    Downloading: 85%    Downloading: 90%    Downloading: 95%    Downloading: 100%    Downloading: 100%
18-Apr-2017 13:07:02
18-Apr-2017 13:07:02   - Installing symfony/proxy-manager-bridge (v3.2.0)
18-Apr-2017 13:07:03     Downloading: Connecting...    Downloading: 0%               Downloading: 25%    Downloading: 65%    Downloading: 100%    Downloading: 100%
18-Apr-2017 13:07:03
18-Apr-2017 13:07:03   - Installing symfony/routing (v3.2.0)
18-Apr-2017 13:07:04     Downloading: Connecting...    Downloading: 0%               Downloading: 5%    Downloading: 10%    Downloading: 15%    Downloading: 20%    Downloading: 25%    Downloading: 30%    Downloading: 35%    Downloading: 40%    Downloading: 45%    Downloading: 50%    Downloading: 55%    Downloading: 60%    Downloading: 65%    Downloading: 70%    Downloading: 75%    Downloading: 80%    Downloading: 85%    Downloading: 90%    Downloading: 95%    Downloading: 100%
18-Apr-2017 13:07:04
18-Apr-2017 13:07:04   - Installing twig/twig (v1.24.2)
18-Apr-2017 13:07:06     Downloading: Connecting...    Downloading: 0%               Downloading: 5%    Downloading: 10%    Downloading: 15%    Downloading: 20%    Downloading: 25%    Downloading: 30%    Downloading: 35%    Downloading: 40%    Downloading: 45%    Downloading: 50%    Downloading: 55%    Downloading: 60%    Downloading: 65%    Downloading: 70%    Downloading: 75%    Downloading: 80%    Downloading: 85%    Downloading: 90%    Downloading: 95%    Downloading: 100%    Downloading: 100%
18-Apr-2017 13:07:06
18-Apr-2017 13:07:06   - Installing symfony/twig-bridge (v3.1.4)
18-Apr-2017 13:07:07     Downloading: Connecting...    Downloading: 0%               Downloading: 10%    Downloading: 15%    Downloading: 20%    Downloading: 25%    Downloading: 30%    Downloading: 35%    Downloading: 45%    Downloading: 55%    Downloading: 60%    Downloading: 65%    Downloading: 70%    Downloading: 80%    Downloading: 90%    Downloading: 100%
18-Apr-2017 13:07:07
18-Apr-2017 13:07:07   - Installing symfony/dom-crawler (v3.2.0)
18-Apr-2017 13:07:08     Downloading: Connecting...    Downloading: 0%               Downloading: 25%    Downloading: 30%    Downloading: 40%    Downloading: 45%    Downloading: 65%    Downloading: 70%    Downloading: 90%    Downloading: 95%    Downloading: 100%    Downloading: 100%
18-Apr-2017 13:07:08
18-Apr-2017 13:07:08   - Installing symfony/css-selector (v3.2.0)
18-Apr-2017 13:07:09     Downloading: Connecting...    Downloading: 0%               Downloading: 5%    Downloading: 10%    Downloading: 15%    Downloading: 20%    Downloading: 25%    Downloading: 30%    Downloading: 35%    Downloading: 40%    Downloading: 45%    Downloading: 50%    Downloading: 55%    Downloading: 60%    Downloading: 65%    Downloading: 70%    Downloading: 75%    Downloading: 100%    Downloading: 100%
18-Apr-2017 13:07:09
18-Apr-2017 13:07:09   - Installing symfony/browser-kit (v3.2.0)
18-Apr-2017 13:07:11     Downloading: Connecting...    Downloading: 0%               Downloading: 65%    Downloading: 100%    Downloading: 100%
18-Apr-2017 13:07:11
18-Apr-2017 13:07:11   - Installing guzzlehttp/guzzle (6.2.2)
18-Apr-2017 13:07:12     Downloading: Connecting...    Downloading: 0%               Downloading: 5%    Downloading: 10%    Downloading: 15%    Downloading: 20%    Downloading: 25%    Downloading: 35%    Downloading: 40%    Downloading: 50%    Downloading: 55%    Downloading: 65%    Downloading: 70%    Downloading: 75%    Downloading: 80%    Downloading: 85%    Downloading: 95%    Downloading: 100%    Downloading: 100%
18-Apr-2017 13:07:12
18-Apr-2017 13:07:12   - Installing fabpot/goutte (v3.2.0)
18-Apr-2017 13:07:13     Downloading: Connecting...    Downloading: 0%               Downloading: 70%    Downloading: 100%
18-Apr-2017 13:07:13
18-Apr-2017 13:07:13   - Installing facebook/webdriver (1.2.0)
18-Apr-2017 13:07:14     Downloading: Connecting...    Downloading: 0%               Downloading: 5%    Downloading: 10%    Downloading: 15%    Downloading: 20%    Downloading: 25%    Downloading: 30%    Downloading: 35%    Downloading: 40%    Downloading: 45%    Downloading: 50%    Downloading: 55%    Downloading: 60%    Downloading: 65%    Downloading: 70%    Downloading: 75%    Downloading: 80%    Downloading: 85%    Downloading: 90%    Downloading: 95%    Downloading: 100%    Downloading: 100%
18-Apr-2017 13:07:14
18-Apr-2017 13:07:14   - Installing symfony/process (v3.2.0)
18-Apr-2017 13:07:15     Downloading: Connecting...    Downloading: 0%               Downloading: 20%    Downloading: 35%    Downloading: 40%    Downloading: 55%    Downloading: 75%    Downloading: 90%    Downloading: 95%    Downloading: 100%    Downloading: 100%
18-Apr-2017 13:07:15
18-Apr-2017 13:07:15   - Installing symfony/console (v3.2.0)
18-Apr-2017 13:07:16     Downloading: Connecting...    Downloading: 0%               Downloading: 5%    Downloading: 10%    Downloading: 15%    Downloading: 20%    Downloading: 25%    Downloading: 30%    Downloading: 35%    Downloading: 40%    Downloading: 45%    Downloading: 50%    Downloading: 55%    Downloading: 60%    Downloading: 65%    Downloading: 70%    Downloading: 75%    Downloading: 80%    Downloading: 85%    Downloading: 90%    Downloading: 95%    Downloading: 100%    Downloading: 100%
18-Apr-2017 13:07:16
18-Apr-2017 13:07:16   - Installing laravel/homestead (v4.0.5)
18-Apr-2017 13:07:17     Downloading: Connecting...    Downloading: 0%               Downloading: 5%    Downloading: 10%    Downloading: 35%    Downloading: 40%    Downloading: 45%    Downloading: 50%    Downloading: 70%    Downloading: 75%    Downloading: 80%    Downloading: 85%    Downloading: 100%    Downloading: 100%
18-Apr-2017 13:07:17
18-Apr-2017 13:07:17   - Installing phing/phing (2.4.14)
18-Apr-2017 13:07:19     Downloading: Connecting...    Downloading: 0%               Downloading: 5%    Downloading: 10%    Downloading: 15%    Downloading: 20%    Downloading: 25%    Downloading: 30%    Downloading: 35%    Downloading: 40%    Downloading: 45%    Downloading: 50%    Downloading: 55%    Downloading: 60%    Downloading: 65%    Downloading: 70%    Downloading: 75%    Downloading: 80%    Downloading: 85%    Downloading: 90%    Downloading: 95%    Downloading: 100%    Downloading: 100%
18-Apr-2017 13:07:19
18-Apr-2017 13:07:19   - Installing phpdocumentor/reflection-docblock (2.0.4)
18-Apr-2017 13:07:20     Downloading: Connecting...    Downloading: 0%               Downloading: 20%    Downloading: 25%    Downloading: 40%    Downloading: 55%    Downloading: 60%    Downloading: 75%    Downloading: 90%    Downloading: 95%    Downloading: 100%
18-Apr-2017 13:07:20
18-Apr-2017 13:07:20   - Installing phpdocumentor/reflection-common (1.0)
18-Apr-2017 13:07:21     Downloading: Connecting...    Downloading: 0%               Downloading: 65%    Downloading: 100%
18-Apr-2017 13:07:21
18-Apr-2017 13:07:21   - Installing phpdocumentor/type-resolver (0.2.1)
18-Apr-2017 13:07:22     Downloading: Connecting...    Downloading: 0%               Downloading: 20%    Downloading: 35%    Downloading: 80%    Downloading: 100%    Downloading: 100%
18-Apr-2017 13:07:22
18-Apr-2017 13:07:22   - Installing symfony/yaml (v3.2.0)
18-Apr-2017 13:07:23     Downloading: Connecting...    Downloading: 0%               Downloading: 10%    Downloading: 15%    Downloading: 25%    Downloading: 40%    Downloading: 50%    Downloading: 65%    Downloading: 75%    Downloading: 85%    Downloading: 90%    Downloading: 100%
18-Apr-2017 13:07:23
18-Apr-2017 13:07:23   - Installing sebastian/version (1.0.6)
18-Apr-2017 13:07:24     Downloading: Connecting...    Downloading: 0%               Downloading: 100%    Downloading: 100%
18-Apr-2017 13:07:24
18-Apr-2017 13:07:24   - Installing sebastian/global-state (1.1.1)
18-Apr-2017 13:07:25     Downloading: Connecting...    Downloading: 0%               Downloading: 40%    Downloading: 50%    Downloading: 90%    Downloading: 100%
18-Apr-2017 13:07:25
18-Apr-2017 13:07:25   - Installing sebastian/recursion-context (1.0.2)
18-Apr-2017 13:07:26     Downloading: Connecting...    Downloading: 0%               Downloading: 35%    Downloading: 70%    Downloading: 100%
18-Apr-2017 13:07:26
18-Apr-2017 13:07:26   - Installing sebastian/exporter (1.2.2)
18-Apr-2017 13:07:27     Downloading: Connecting...    Downloading: 0%               Downloading: 100%
18-Apr-2017 13:07:27
18-Apr-2017 13:07:27   - Installing sebastian/environment (1.3.8)
18-Apr-2017 13:07:28     Downloading: Connecting...    Downloading: 0%               Downloading: 15%    Downloading: 30%    Downloading: 45%    Downloading: 60%    Downloading: 75%    Downloading: 100%    Downloading: 100%
18-Apr-2017 13:07:28
18-Apr-2017 13:07:28   - Installing sebastian/diff (1.4.1)
18-Apr-2017 13:07:29     Downloading: Connecting...    Downloading: 0%               Downloading: 15%    Downloading: 30%    Downloading: 45%    Downloading: 50%    Downloading: 65%    Downloading: 100%    Downloading: 100%
18-Apr-2017 13:07:29
18-Apr-2017 13:07:29   - Installing sebastian/comparator (1.2.2)
18-Apr-2017 13:07:30     Downloading: Connecting...    Downloading: 0%               Downloading: 10%    Downloading: 20%    Downloading: 30%    Downloading: 40%    Downloading: 45%    Downloading: 55%    Downloading: 65%    Downloading: 75%    Downloading: 85%    Downloading: 95%    Downloading: 100%    Downloading: 100%
18-Apr-2017 13:07:30
18-Apr-2017 13:07:30   - Installing phpunit/php-text-template (1.2.1)
18-Apr-2017 13:07:31     Downloading: Connecting...    Downloading: 0%               Downloading: 35%    Downloading: 100%    Downloading: 100%
18-Apr-2017 13:07:31
18-Apr-2017 13:07:31   - Installing doctrine/instantiator (1.0.5)
18-Apr-2017 13:07:32     Downloading: Connecting...    Downloading: 0%               Downloading: 15%    Downloading: 25%    Downloading: 40%    Downloading: 50%    Downloading: 65%    Downloading: 80%    Downloading: 95%    Downloading: 100%    Downloading: 100%
18-Apr-2017 13:07:32
18-Apr-2017 13:07:32   - Installing phpunit/phpunit-mock-objects (2.3.8)
18-Apr-2017 13:07:33     Downloading: Connecting...    Downloading: 0%               Downloading: 5%    Downloading: 20%    Downloading: 25%    Downloading: 30%    Downloading: 35%    Downloading: 40%    Downloading: 50%    Downloading: 55%    Downloading: 60%    Downloading: 65%    Downloading: 75%    Downloading: 80%    Downloading: 85%    Downloading: 90%    Downloading: 100%    Downloading: 100%
18-Apr-2017 13:07:33
18-Apr-2017 13:07:33   - Installing phpunit/php-timer (1.0.8)
18-Apr-2017 13:07:34     Downloading: Connecting...    Downloading: 0%               Downloading: 100%    Downloading: 100%
18-Apr-2017 13:07:34
18-Apr-2017 13:07:34   - Installing phpunit/php-file-iterator (1.4.2)
18-Apr-2017 13:07:35     Downloading: Connecting...    Downloading: 0%               Downloading: 20%    Downloading: 40%    Downloading: 60%    Downloading: 100%    Downloading: 100%
18-Apr-2017 13:07:35
18-Apr-2017 13:07:35   - Installing phpunit/php-token-stream (1.4.9)
18-Apr-2017 13:07:36     Downloading: Connecting...    Downloading: 0%               Downloading: 5%    Downloading: 10%    Downloading: 15%    Downloading: 20%    Downloading: 30%    Downloading: 35%    Downloading: 40%    Downloading: 45%    Downloading: 50%    Downloading: 55%    Downloading: 100%
18-Apr-2017 13:07:36
18-Apr-2017 13:07:36   - Installing phpunit/php-code-coverage (2.2.4)
18-Apr-2017 13:07:38     Downloading: Connecting...    Downloading: 0%               Downloading: 5%    Downloading: 10%    Downloading: 15%    Downloading: 20%    Downloading: 25%    Downloading: 30%    Downloading: 35%    Downloading: 40%    Downloading: 45%    Downloading: 50%    Downloading: 55%    Downloading: 60%    Downloading: 65%    Downloading: 70%    Downloading: 75%    Downloading: 80%    Downloading: 90%    Downloading: 100%    Downloading: 100%
18-Apr-2017 13:07:38
18-Apr-2017 13:07:38   - Installing phpspec/prophecy (v1.6.2)
18-Apr-2017 13:07:39     Downloading: Connecting...    Downloading: 0%               Downloading: 5%    Downloading: 10%    Downloading: 15%    Downloading: 20%    Downloading: 25%    Downloading: 30%    Downloading: 35%    Downloading: 40%    Downloading: 45%    Downloading: 50%    Downloading: 55%    Downloading: 60%    Downloading: 65%    Downloading: 70%    Downloading: 75%    Downloading: 80%    Downloading: 85%    Downloading: 90%    Downloading: 95%    Downloading: 100%    Downloading: 100%
18-Apr-2017 13:07:39
18-Apr-2017 13:07:39   - Installing phpunit/phpunit (4.8.31)
18-Apr-2017 13:07:40     Downloading: Connecting...    Downloading: 0%               Downloading: 5%    Downloading: 10%    Downloading: 15%    Downloading: 20%    Downloading: 25%    Downloading: 30%    Downloading: 35%    Downloading: 40%    Downloading: 45%    Downloading: 50%    Downloading: 55%    Downloading: 60%    Downloading: 65%    Downloading: 70%    Downloading: 75%    Downloading: 90%    Downloading: 100%    Downloading: 100%
18-Apr-2017 13:07:40
18-Apr-2017 13:07:40   - Installing phpunit/dbunit (2.0.3)
18-Apr-2017 13:07:42     Downloading: Connecting...    Downloading: 0%               Downloading: 5%    Downloading: 10%    Downloading: 15%    Downloading: 20%    Downloading: 25%    Downloading: 30%    Downloading: 35%    Downloading: 40%    Downloading: 45%    Downloading: 50%    Downloading: 55%    Downloading: 60%    Downloading: 65%    Downloading: 70%    Downloading: 75%    Downloading: 80%    Downloading: 85%    Downloading: 90%    Downloading: 95%    Downloading: 100%    Downloading: 100%
18-Apr-2017 13:07:42
18-Apr-2017 13:07:42   - Installing squizlabs/php_codesniffer (2.7.1)
18-Apr-2017 13:07:43     Downloading: Connecting...    Downloading: 0%               Downloading: 5%    Downloading: 10%    Downloading: 15%    Downloading: 20%    Downloading: 25%    Downloading: 30%    Downloading: 35%    Downloading: 40%    Downloading: 45%    Downloading: 50%    Downloading: 55%    Downloading: 60%    Downloading: 65%    Downloading: 70%    Downloading: 75%    Downloading: 80%    Downloading: 90%    Downloading: 95%    Downloading: 100%    Downloading: 100%
18-Apr-2017 13:07:43
18-Apr-2017 13:07:43   - Installing webmozart/assert (1.2.0)
18-Apr-2017 13:07:44     Downloading: Connecting...    Downloading: 0%               Downloading: 55%    Downloading: 80%    Downloading: 100%    Downloading: 100%
18-Apr-2017 13:07:44
18-Apr-2017 13:07:46 lusitanian/oauth suggests installing predis/predis (Allows using the Redis storage backend.)
18-Apr-2017 13:07:46 paragonie/random_compat suggests installing ext-libsodium (Provides a modern crypto API that can be used to generate random bytes.)
18-Apr-2017 13:07:46 patchwork/utf8 suggests installing ext-intl (Use Intl for best performance)
18-Apr-2017 13:07:46 patchwork/utf8 suggests installing ext-wfio (Use WFIO for UTF-8 filesystem access on Windows)
18-Apr-2017 13:07:46 s9e/text-formatter suggests installing ext-intl (Allows international URLs to be accepted by the URL filter)
18-Apr-2017 13:07:46 s9e/text-formatter suggests installing ext-xsl (Enables the XSLT renderer)
18-Apr-2017 13:07:46 symfony/http-kernel suggests installing symfony/class-loader ()
18-Apr-2017 13:07:46 symfony/http-kernel suggests installing symfony/var-dumper ()
18-Apr-2017 13:07:46 symfony/dependency-injection suggests installing symfony/expression-language (For using expressions in service container configuration)
18-Apr-2017 13:07:46 zendframework/zend-eventmanager suggests installing container-interop/container-interop (^1.1.0, to use the lazy listeners feature)
18-Apr-2017 13:07:46 zendframework/zend-eventmanager suggests installing zendframework/zend-stdlib (^2.7.3 || ^3.0, to use the FilterChain feature)
18-Apr-2017 13:07:46 zendframework/zend-code suggests installing doctrine/annotations (Doctrine\Common\Annotations >=1.0 for annotation features)
18-Apr-2017 13:07:46 zendframework/zend-code suggests installing zendframework/zend-stdlib (Zend\Stdlib component)
18-Apr-2017 13:07:46 ocramius/proxy-manager suggests installing ocramius/generated-hydrator (To have very fast object to array to object conversion for ghost objects)
18-Apr-2017 13:07:46 ocramius/proxy-manager suggests installing zendframework/zend-json (To have the JsonRpc adapter (Remote Object feature))
18-Apr-2017 13:07:46 ocramius/proxy-manager suggests installing zendframework/zend-soap (To have the Soap adapter (Remote Object feature))
18-Apr-2017 13:07:46 ocramius/proxy-manager suggests installing zendframework/zend-stdlib (To use the hydrator proxy)
18-Apr-2017 13:07:46 ocramius/proxy-manager suggests installing zendframework/zend-xmlrpc (To have the XmlRpc adapter (Remote Object feature))
18-Apr-2017 13:07:46 symfony/routing suggests installing doctrine/annotations (For using the annotation loader)
18-Apr-2017 13:07:46 symfony/routing suggests installing symfony/expression-language (For using expression matching)
18-Apr-2017 13:07:46 symfony/twig-bridge suggests installing symfony/asset (For using the AssetExtension)
18-Apr-2017 13:07:46 symfony/twig-bridge suggests installing symfony/expression-language (For using the ExpressionExtension)
18-Apr-2017 13:07:46 symfony/twig-bridge suggests installing symfony/form (For using the FormExtension)
18-Apr-2017 13:07:46 symfony/twig-bridge suggests installing symfony/security (For using the SecurityExtension)
18-Apr-2017 13:07:46 symfony/twig-bridge suggests installing symfony/stopwatch (For using the StopwatchExtension)
18-Apr-2017 13:07:46 symfony/twig-bridge suggests installing symfony/templating (For using the TwigEngine)
18-Apr-2017 13:07:46 symfony/twig-bridge suggests installing symfony/translation (For using the TranslationExtension)
18-Apr-2017 13:07:46 symfony/twig-bridge suggests installing symfony/var-dumper (For using the DumpExtension)
18-Apr-2017 13:07:46 facebook/webdriver suggests installing phpdocumentor/phpdocumentor (2.*)
18-Apr-2017 13:07:46 phpdocumentor/reflection-docblock suggests installing dflydev/markdown (~1.0)
18-Apr-2017 13:07:46 phpdocumentor/reflection-docblock suggests installing erusev/parsedown (~1.0)
18-Apr-2017 13:07:46 sebastian/global-state suggests installing ext-uopz (*)
18-Apr-2017 13:07:46 phpunit/phpunit-mock-objects suggests installing ext-soap (*)
18-Apr-2017 13:07:46 phpunit/phpunit suggests installing phpunit/php-invoker (~1.1)
18-Apr-2017 13:07:46 Generating autoload files
18-Apr-2017 13:07:46 Buildfile: /data/build/build.xml
18-Apr-2017 13:07:46
18-Apr-2017 13:07:46 phpBB > clean:
18-Apr-2017 13:07:46
18-Apr-2017 13:07:46    [delete] Directory /data/build/logs does not exist or is not a directory.
18-Apr-2017 13:07:46    [delete] Directory /data/build/api does not exist or is not a directory.
18-Apr-2017 13:07:46    [delete] Directory /data/build/codebrowser does not exist or is not a directory.
18-Apr-2017 13:07:46    [delete] Directory /data/build/coverage does not exist or is not a directory.
18-Apr-2017 13:07:46    [delete] Directory /data/build/cpd does not exist or is not a directory.
18-Apr-2017 13:07:46    [delete] Directory /data/build/dependencies does not exist or is not a directory.
18-Apr-2017 13:07:46    [delete] Directory /data/build/new_version does not exist or is not a directory.
18-Apr-2017 13:07:46    [delete] Directory /data/build/old_versions does not exist or is not a directory.
18-Apr-2017 13:07:46    [delete] Directory /data/build/save does not exist or is not a directory.
18-Apr-2017 13:07:46
18-Apr-2017 13:07:46 phpBB > prepare:
18-Apr-2017 13:07:46
18-Apr-2017 13:07:46     [mkdir] Created dir: /data/build/logs
18-Apr-2017 13:07:46     [mkdir] Created dir: /data/build/api
18-Apr-2017 13:07:46     [mkdir] Created dir: /data/build/codebrowser
18-Apr-2017 13:07:46     [mkdir] Created dir: /data/build/coverage
18-Apr-2017 13:07:46     [mkdir] Created dir: /data/build/cpd
18-Apr-2017 13:07:46     [mkdir] Created dir: /data/build/dependencies
18-Apr-2017 13:07:46     [mkdir] Created dir: /data/build/new_version
18-Apr-2017 13:07:46     [mkdir] Created dir: /data/build/new_version/files
18-Apr-2017 13:07:46     [mkdir] Created dir: /data/build/new_version/patches
18-Apr-2017 13:07:46     [mkdir] Created dir: /data/build/new_version/release_files
18-Apr-2017 13:07:46     [mkdir] Created dir: /data/build/new_version/update
18-Apr-2017 13:07:46     [mkdir] Created dir: /data/build/old_versions
18-Apr-2017 13:07:46     [mkdir] Created dir: /data/build/save
18-Apr-2017 13:07:46
18-Apr-2017 13:07:46 BUILD FINISHED
18-Apr-2017 13:07:46
18-Apr-2017 13:07:46 Total time: 0.1160 seconds
18-Apr-2017 13:07:46
18-Apr-2017 13:07:47 Finished task 'Prepare directory' with result: Success
18-Apr-2017 13:07:47 Skipping execution of task 'Run sniffs' as it is disabled
18-Apr-2017 13:07:47
Substituting variable: ${bamboo.working.directory} with /home/bamboo/xml-data/build-dir/PHPBB3-PR-JOB1
18-Apr-2017 13:07:47 Starting task 'Run sniffs' of type 'com.atlassian.bamboo.plugins.bamboo-docker-plugin:task.docker.cli'
18-Apr-2017 13:07:47 Running image name (phpbb:php-5.6)
18-Apr-2017 13:07:47
Beginning to execute external process for build 'phpBB3 - Pull Requests - Build and Test Job #7013 (PHPBB3-PR-JOB1-7013)'
... running command line:
/usr/bin/docker run --volume /home/bamboo/xml-data/build-dir/PHPBB3-PR-JOB1:/data --workdir /data/build --rm -u=991 phpbb:php-5.6 ../phpBB/vendor/bin/phing sniff
... in: /home/bamboo/xml-data/build-dir/PHPBB3-PR-JOB1
... using extra environment variables:
bamboo_planRepository_1_branch=3.1.x
bamboo_planRepository_1_branchDisplayName=3.1.x
bamboo_repository_revision_number=8303058ac613c1699b51a647b29b97f754fdf6a6
bamboo_PRref=master
bamboo_resultsUrl=https://bamboo.phpbb.com/browse/PHPBB3-PR-JOB1-7013
bamboo_capability_system_builder_command_Git=/usr/bin/git
bamboo_repository_75956235_git_username=bantu
bamboo_planRepository_1_name=phpBB Ascraeus
bamboo_build_working_directory=/home/bamboo/xml-data/build-dir/PHPBB3-PR-JOB1
bamboo_buildKey=PHPBB3-PR-JOB1
bamboo_capability_phpbb_tests=true
bamboo_shortPlanName=Pull Requests
bamboo_capability_system_builder_command_fop=/usr/bin/fop
bamboo_capability_dbms_sqlite_2=true
bamboo_planRepository_name=phpBB Ascraeus
bamboo_PRnumber=4789
bamboo_buildNumber=7013
bamboo_repository_75956235_git_repositoryUrl=https://github.com/phpbb/phpbb.git
bamboo_capability_system_builder_phpunit_PHPUnit=/usr/bin/phpunit
bamboo_shortJobName=Build and Test Job
bamboo_buildResultsUrl=https://bamboo.phpbb.com/browse/PHPBB3-PR-JOB1-7013
bamboo_repository_75956235_branch_name=3.1.x
bamboo_planRepository_repositoryUrl=https://github.com/phpbb/phpbb.git
bamboo_agentId=131073
bamboo_planName=phpBB3 - Pull Requests
bamboo_build_commandline_com_atlassian_bamboo_plugins_scripttask_task_builder_script_7=/bin/sh /home/bamboo/temp/PHPBB3-PR-JOB1-7013-ScriptBuildTask-998297896725034292.sh
bamboo_shortPlanKey=PR
bamboo_shortJobKey=JOB1
bamboo_capability_dbms_mysql_55=true
bamboo_capability_system_jdk_JDK_1_7_0_65=/usr/lib/jvm/java-7-openjdk-amd64
bamboo_planRepository_revision=8303058ac613c1699b51a647b29b97f754fdf6a6
bamboo_repository_previous_revision_number=8303058ac613c1699b51a647b29b97f754fdf6a6
bamboo_buildTimeStamp=2017-04-18T13:06:29.564Z
bamboo_planRepository_previousRevision=8303058ac613c1699b51a647b29b97f754fdf6a6
bamboo_capability_system_builder_mvn2_Maven_2=/usr/share/maven2
bamboo_capability_system_jdk_JDK_1_6_0_16=/usr/lib/jvm/java-6-sun-1.6.0.16
bamboo_build_commandline_com_atlassian_bamboo_plugins_scripttask_task_builder_script_4=/bin/sh /home/bamboo/temp/PHPBB3-PR-JOB1-7013-ScriptBuildTask-1903513713185622801.sh
bamboo_buildResultKey=PHPBB3-PR-JOB1-7013
bamboo_repository_git_branch=3.1.x
bamboo_repository_branch_name=3.1.x
bamboo_buildPlanName=phpBB3 - Pull Requests - Build and Test Job
bamboo_planRepository_1_revision=8303058ac613c1699b51a647b29b97f754fdf6a6
bamboo_repository_name=phpBB Ascraeus
bamboo_capability_system_docker_executable=/usr/bin/docker
bamboo_build_commandline_com_atlassian_bamboo_plugins_bamboo_docker_plugin_task_docker_cli_12=/usr/bin/docker run --volume /home/bamboo/xml-data/build-dir/PHPBB3-PR-JOB1:/data --workdir /data/phpBB --rm -e HOME=/home/bamboo -u=991 phpbb:php-5.6 /bin/bash -c php ../composer.phar install --dev; cd ../build; ../phpBB/vendor/bin/phing clean prepare
bamboo_planRepository_branch=3.1.x
bamboo_agentWorkingDirectory=/home/bamboo/xml-data/build-dir
bamboo_capability_system_git_executable=/usr/bin/git
bamboo_planRepository_1_previousRevision=8303058ac613c1699b51a647b29b97f754fdf6a6
bamboo_capability_system_builder_phpunit_PHPUnit_3_4=/usr/bin/phpunit
bamboo_repository_git_username=bantu
bamboo_repository_75956235_revision_number=8303058ac613c1699b51a647b29b97f754fdf6a6
bamboo_planRepository_branchDisplayName=3.1.x
bamboo_planRepository_1_type=gitv2
bamboo_planRepository_branchName=3.1.x
bamboo_repository_75956235_previous_revision_number=8303058ac613c1699b51a647b29b97f754fdf6a6
bamboo_capability_system_jdk_JDK=/usr/lib/jvm/java-6-sun
bamboo_plan_storageTag=PHPBB3-PR
bamboo_planRepository_type=gitv2
bamboo_planRepository_1_username=bantu
bamboo_ManualBuildTriggerReason_userName=Build Robot
bamboo_repository_git_repositoryUrl=https://github.com/phpbb/phpbb.git
bamboo_repository_75956235_git_branch=3.1.x
bamboo_capability_system_builder_ant_Ant=/usr/share/ant
bamboo_repository_75956235_name=phpBB Ascraeus
bamboo_working_directory=/home/bamboo/xml-data/build-dir/PHPBB3-PR-JOB1
bamboo_planKey=PHPBB3-PR
bamboo_planRepository_1_repositoryUrl=https://github.com/phpbb/phpbb.git
bamboo_planRepository_username=bantu
bamboo_capability_local=true
bamboo_capability_system_jdk_JDK_1_6=/usr/lib/jvm/java-6-sun
bamboo_capability_system_jdk_JDK_1_7=/usr/lib/jvm/java-7-openjdk-amd64
bamboo_planRepository_1_branchName=3.1.x
18-Apr-2017 13:07:47 Buildfile: /data/build/build.xml
18-Apr-2017 13:07:47
18-Apr-2017 13:07:47 phpBB > sniff:
18-Apr-2017 13:07:47
18-Apr-2017 13:07:55 ............................................................  60 / 688 (9%)
18-Apr-2017 13:07:56 ............................................................ 120 / 688 (17%)
18-Apr-2017 13:07:58 ............................................................ 180 / 688 (26%)
18-Apr-2017 13:07:59 ............................................................ 240 / 688 (35%)
18-Apr-2017 13:08:04 ............................................................ 300 / 688 (44%)
18-Apr-2017 13:08:09 ............................................................ 360 / 688 (52%)
18-Apr-2017 13:08:16 ............................................................ 420 / 688 (61%)
18-Apr-2017 13:08:19 ............................................................ 480 / 688 (70%)
18-Apr-2017 13:08:23 ............................................................ 540 / 688 (78%)
18-Apr-2017 13:08:28 ............................................................ 600 / 688 (87%)
18-Apr-2017 13:08:30 ............................................................ 660 / 688 (96%)
18-Apr-2017 13:08:31 ............................
18-Apr-2017 13:08:31
18-Apr-2017 13:08:31 Time: 44.41 secs; Memory: 77.5Mb
18-Apr-2017 13:08:31
18-Apr-2017 13:08:40 ............................................................  60 / 206 (29%)
18-Apr-2017 13:09:00 ............................................................ 120 / 206 (58%)
18-Apr-2017 13:09:16 ............................................................ 180 / 206 (87%)
18-Apr-2017 13:09:23 ..........................
18-Apr-2017 13:09:23
18-Apr-2017 13:09:23 Time: 51.64 secs; Memory: 60.25Mb
18-Apr-2017 13:09:23
18-Apr-2017 13:09:23
18-Apr-2017 13:09:23
18-Apr-2017 13:09:23 Time: 17ms; Memory: 3.75Mb
18-Apr-2017 13:09:23
18-Apr-2017 13:09:23
18-Apr-2017 13:09:23 BUILD FINISHED
18-Apr-2017 13:09:23
18-Apr-2017 13:09:23 Total time: 2 minutes  36.46 seconds
18-Apr-2017 13:09:23
18-Apr-2017 13:09:23 Finished task 'Run sniffs' with result: Success
18-Apr-2017 13:09:23 Skipping execution of task 'Run tests' as it is disabled
18-Apr-2017 13:09:23
Substituting variable: ${bamboo.working.directory} with /home/bamboo/xml-data/build-dir/PHPBB3-PR-JOB1
18-Apr-2017 13:09:23 Starting task 'Run tests' of type 'com.atlassian.bamboo.plugins.bamboo-docker-plugin:task.docker.cli'
18-Apr-2017 13:09:23 Running image name (phpbb:php-5.6)
18-Apr-2017 13:09:23
Beginning to execute external process for build 'phpBB3 - Pull Requests - Build and Test Job #7013 (PHPBB3-PR-JOB1-7013)'
... running command line:
/usr/bin/docker run --volume /home/bamboo/xml-data/build-dir/PHPBB3-PR-JOB1:/data --workdir /data --rm -u=991 phpbb:php-5.6 /bin/bash -c phpBB/vendor/bin/phpunit --log-junit build/logs/phpunit.xml
... in: /home/bamboo/xml-data/build-dir/PHPBB3-PR-JOB1
... using extra environment variables:
bamboo_planRepository_1_branch=3.1.x
bamboo_planRepository_1_branchDisplayName=3.1.x
bamboo_repository_revision_number=8303058ac613c1699b51a647b29b97f754fdf6a6
bamboo_PRref=master
bamboo_resultsUrl=https://bamboo.phpbb.com/browse/PHPBB3-PR-JOB1-7013
bamboo_capability_system_builder_command_Git=/usr/bin/git
bamboo_repository_75956235_git_username=bantu
bamboo_planRepository_1_name=phpBB Ascraeus
bamboo_build_working_directory=/home/bamboo/xml-data/build-dir/PHPBB3-PR-JOB1
bamboo_buildKey=PHPBB3-PR-JOB1
bamboo_capability_phpbb_tests=true
bamboo_shortPlanName=Pull Requests
bamboo_capability_system_builder_command_fop=/usr/bin/fop
bamboo_capability_dbms_sqlite_2=true
bamboo_planRepository_name=phpBB Ascraeus
bamboo_PRnumber=4789
bamboo_buildNumber=7013
bamboo_repository_75956235_git_repositoryUrl=https://github.com/phpbb/phpbb.git
bamboo_capability_system_builder_phpunit_PHPUnit=/usr/bin/phpunit
bamboo_shortJobName=Build and Test Job
bamboo_buildResultsUrl=https://bamboo.phpbb.com/browse/PHPBB3-PR-JOB1-7013
bamboo_repository_75956235_branch_name=3.1.x
bamboo_planRepository_repositoryUrl=https://github.com/phpbb/phpbb.git
bamboo_agentId=131073
bamboo_planName=phpBB3 - Pull Requests
bamboo_build_commandline_com_atlassian_bamboo_plugins_scripttask_task_builder_script_7=/bin/sh /home/bamboo/temp/PHPBB3-PR-JOB1-7013-ScriptBuildTask-998297896725034292.sh
bamboo_shortPlanKey=PR
bamboo_shortJobKey=JOB1
bamboo_capability_dbms_mysql_55=true
bamboo_capability_system_jdk_JDK_1_7_0_65=/usr/lib/jvm/java-7-openjdk-amd64
bamboo_planRepository_revision=8303058ac613c1699b51a647b29b97f754fdf6a6
bamboo_repository_previous_revision_number=8303058ac613c1699b51a647b29b97f754fdf6a6
bamboo_buildTimeStamp=2017-04-18T13:06:29.564Z
bamboo_planRepository_previousRevision=8303058ac613c1699b51a647b29b97f754fdf6a6
bamboo_capability_system_builder_mvn2_Maven_2=/usr/share/maven2
bamboo_capability_system_jdk_JDK_1_6_0_16=/usr/lib/jvm/java-6-sun-1.6.0.16
bamboo_build_commandline_com_atlassian_bamboo_plugins_scripttask_task_builder_script_4=/bin/sh /home/bamboo/temp/PHPBB3-PR-JOB1-7013-ScriptBuildTask-1903513713185622801.sh
bamboo_buildResultKey=PHPBB3-PR-JOB1-7013
bamboo_repository_git_branch=3.1.x
bamboo_repository_branch_name=3.1.x
bamboo_buildPlanName=phpBB3 - Pull Requests - Build and Test Job
bamboo_planRepository_1_revision=8303058ac613c1699b51a647b29b97f754fdf6a6
bamboo_repository_name=phpBB Ascraeus
bamboo_capability_system_docker_executable=/usr/bin/docker
bamboo_build_commandline_com_atlassian_bamboo_plugins_bamboo_docker_plugin_task_docker_cli_11=/usr/bin/docker run --volume /home/bamboo/xml-data/build-dir/PHPBB3-PR-JOB1:/data --workdir /data/build --rm -u=991 phpbb:php-5.6 ../phpBB/vendor/bin/phing sniff
bamboo_build_commandline_com_atlassian_bamboo_plugins_bamboo_docker_plugin_task_docker_cli_12=/usr/bin/docker run --volume /home/bamboo/xml-data/build-dir/PHPBB3-PR-JOB1:/data --workdir /data/phpBB --rm -e HOME=/home/bamboo -u=991 phpbb:php-5.6 /bin/bash -c php ../composer.phar install --dev; cd ../build; ../phpBB/vendor/bin/phing clean prepare
bamboo_planRepository_branch=3.1.x
bamboo_agentWorkingDirectory=/home/bamboo/xml-data/build-dir
bamboo_capability_system_git_executable=/usr/bin/git
bamboo_planRepository_1_previousRevision=8303058ac613c1699b51a647b29b97f754fdf6a6
bamboo_capability_system_builder_phpunit_PHPUnit_3_4=/usr/bin/phpunit
bamboo_repository_git_username=bantu
bamboo_repository_75956235_revision_number=8303058ac613c1699b51a647b29b97f754fdf6a6
bamboo_planRepository_branchDisplayName=3.1.x
bamboo_planRepository_1_type=gitv2
bamboo_planRepository_branchName=3.1.x
bamboo_repository_75956235_previous_revision_number=8303058ac613c1699b51a647b29b97f754fdf6a6
bamboo_capability_system_jdk_JDK=/usr/lib/jvm/java-6-sun
bamboo_plan_storageTag=PHPBB3-PR
bamboo_planRepository_type=gitv2
bamboo_planRepository_1_username=bantu
bamboo_ManualBuildTriggerReason_userName=Build Robot
bamboo_repository_git_repositoryUrl=https://github.com/phpbb/phpbb.git
bamboo_repository_75956235_git_branch=3.1.x
bamboo_capability_system_builder_ant_Ant=/usr/share/ant
bamboo_repository_75956235_name=phpBB Ascraeus
bamboo_working_directory=/home/bamboo/xml-data/build-dir/PHPBB3-PR-JOB1
bamboo_planKey=PHPBB3-PR
bamboo_planRepository_1_repositoryUrl=https://github.com/phpbb/phpbb.git
bamboo_planRepository_username=bantu
bamboo_capability_local=true
bamboo_capability_system_jdk_JDK_1_6=/usr/lib/jvm/java-6-sun
bamboo_capability_system_jdk_JDK_1_7=/usr/lib/jvm/java-7-openjdk-amd64
bamboo_planRepository_1_branchName=3.1.x
18-Apr-2017 13:09:26 PHPUnit 4.8.31 by Sebastian Bergmann and contributors.
18-Apr-2017 13:09:26
18-Apr-2017 13:09:33 .............................................................   61 / 6906 (  0%)
18-Apr-2017 13:09:34 .............................................................  122 / 6906 (  1%)
18-Apr-2017 13:09:35 ...I.....SSSS............SSSS.........S...S..................  183 / 6906 (  2%)
18-Apr-2017 13:09:38 ....................................................S........  244 / 6906 (  3%)
18-Apr-2017 13:09:39 stty: standard input: Inappropriate ioctl for device
18-Apr-2017 13:09:39 stty: standard input: Inappropriate ioctl for device
18-Apr-2017 13:09:39 stty: standard input: Inappropriate ioctl for device
18-Apr-2017 13:09:39 stty: standard input: Inappropriate ioctl for device
18-Apr-2017 13:09:45 ....F........................................................  305 / 6906 (  4%)
18-Apr-2017 13:09:45 .............................................................  366 / 6906 (  5%)
18-Apr-2017 13:09:46 .............................................................  427 / 6906 (  6%)
18-Apr-2017 13:09:47 .............................................................  488 / 6906 (  7%)
18-Apr-2017 13:09:47 .............................................................  549 / 6906 (  7%)
18-Apr-2017 13:09:48 .............................................................  610 / 6906 (  8%)
18-Apr-2017 13:09:49 .............................................................  671 / 6906 (  9%)
18-Apr-2017 13:09:50 .............................................................  732 / 6906 ( 10%)
18-Apr-2017 13:09:50 .............................................................  793 / 6906 ( 11%)
18-Apr-2017 13:09:51 .............................................................  854 / 6906 ( 12%)
18-Apr-2017 13:09:52 .............................................................  915 / 6906 ( 13%)
18-Apr-2017 13:09:53 .............................................................  976 / 6906 ( 14%)
18-Apr-2017 13:09:55 ............................................................. 1037 / 6906 ( 15%)
18-Apr-2017 13:09:59 ..................................I.......................... 1098 / 6906 ( 15%)
18-Apr-2017 13:10:07 ............................................................. 1159 / 6906 ( 16%)
18-Apr-2017 13:10:09 ............................................................. 1220 / 6906 ( 17%)
18-Apr-2017 13:10:11 .S.S.S....................................................... 1281 / 6906 ( 18%)
18-Apr-2017 13:10:11 ............................................................. 1342 / 6906 ( 19%)
18-Apr-2017 13:10:11 ............................................................. 1403 / 6906 ( 20%)
18-Apr-2017 13:10:12 ............................................................. 1464 / 6906 ( 21%)
18-Apr-2017 13:10:12 ............................................................. 1525 / 6906 ( 22%)
18-Apr-2017 13:10:12 ............................................................. 1586 / 6906 ( 22%)
18-Apr-2017 13:10:12 ............................................................. 1647 / 6906 ( 23%)
18-Apr-2017 13:10:12 ............................................................. 1708 / 6906 ( 24%)
18-Apr-2017 13:10:12 ............................................................. 1769 / 6906 ( 25%)
18-Apr-2017 13:10:12 ............................................................. 1830 / 6906 ( 26%)
18-Apr-2017 13:10:12 ............................................................. 1891 / 6906 ( 27%)
18-Apr-2017 13:10:13 ............................................................. 1952 / 6906 ( 28%)
18-Apr-2017 13:10:13 ............................................................. 2013 / 6906 ( 29%)
18-Apr-2017 13:10:14 ............................................................. 2074 / 6906 ( 30%)
18-Apr-2017 13:10:15 ............................................................. 2135 / 6906 ( 30%)
18-Apr-2017 13:10:16 ............................................................. 2196 / 6906 ( 31%)
18-Apr-2017 13:10:16 ............................................................. 2257 / 6906 ( 32%)
18-Apr-2017 13:10:18 ...................................................I.II...... 2318 / 6906 ( 33%)
18-Apr-2017 13:10:19 ............................................................. 2379 / 6906 ( 34%)
18-Apr-2017 13:10:20 ............................................................. 2440 / 6906 ( 35%)
18-Apr-2017 13:10:20 ............................................................. 2501 / 6906 ( 36%)
18-Apr-2017 13:10:22 ............................................................. 2562 / 6906 ( 37%)
18-Apr-2017 13:10:23 ............................................................. 2623 / 6906 ( 37%)
18-Apr-2017 13:10:24 ............................................................. 2684 / 6906 ( 38%)
18-Apr-2017 13:10:24 ..........................SSSSSSSSS.......................... 2745 / 6906 ( 39%)
18-Apr-2017 13:10:25 ............................................................. 2806 / 6906 ( 40%)
18-Apr-2017 13:10:36 ............................................................. 2867 / 6906 ( 41%)
18-Apr-2017 13:10:40 ............................................................. 2928 / 6906 ( 42%)
18-Apr-2017 13:10:44 ..S.......................................................... 2989 / 6906 ( 43%)
18-Apr-2017 13:10:49 ............................................................. 3050 / 6906 ( 44%)
18-Apr-2017 13:10:53 ............................................................. 3111 / 6906 ( 45%)
18-Apr-2017 13:11:05 ............................................................. 3172 / 6906 ( 45%)
18-Apr-2017 13:11:09 ............................................................. 3233 / 6906 ( 46%)
18-Apr-2017 13:11:09 ............................................................. 3294 / 6906 ( 47%)
18-Apr-2017 13:11:10 ............................................................. 3355 / 6906 ( 48%)
18-Apr-2017 13:11:10 ............................................................. 3416 / 6906 ( 49%)
18-Apr-2017 13:11:10 ............................................................. 3477 / 6906 ( 50%)
18-Apr-2017 13:11:10 ............................................................. 3538 / 6906 ( 51%)
18-Apr-2017 13:11:10 ............................................................. 3599 / 6906 ( 52%)
18-Apr-2017 13:11:10 ............................................................. 3660 / 6906 ( 52%)
18-Apr-2017 13:11:12 ............................................................. 3721 / 6906 ( 53%)
18-Apr-2017 13:11:15 ............................................................. 3782 / 6906 ( 54%)
18-Apr-2017 13:11:17 ............................................................. 3843 / 6906 ( 55%)
18-Apr-2017 13:11:18 ............................................................. 3904 / 6906 ( 56%)
18-Apr-2017 13:11:20 ............................................................. 3965 / 6906 ( 57%)
18-Apr-2017 13:11:21 ............................................................. 4026 / 6906 ( 58%)
18-Apr-2017 13:11:29 ............................................................. 4087 / 6906 ( 59%)
18-Apr-2017 13:11:31 ............................................................. 4148 / 6906 ( 60%)
18-Apr-2017 13:11:32 ............................................................. 4209 / 6906 ( 60%)
18-Apr-2017 13:11:32 ............................................................. 4270 / 6906 ( 61%)
18-Apr-2017 13:11:32 ............................................................. 4331 / 6906 ( 62%)
18-Apr-2017 13:11:32 ............................................................. 4392 / 6906 ( 63%)
18-Apr-2017 13:11:33 ............................................................. 4453 / 6906 ( 64%)
18-Apr-2017 13:11:33 ............................................................. 4514 / 6906 ( 65%)
18-Apr-2017 13:11:33 ............................................................. 4575 / 6906 ( 66%)
18-Apr-2017 13:11:33 ............................................................. 4636 / 6906 ( 67%)
18-Apr-2017 13:11:33 ............................................................. 4697 / 6906 ( 68%)
18-Apr-2017 13:11:45 ............................................................. 4758 / 6906 ( 68%)
18-Apr-2017 13:11:53 ..................S.......................................... 4819 / 6906 ( 69%)
18-Apr-2017 13:12:01 ............................................................. 4880 / 6906 ( 70%)
18-Apr-2017 13:12:07 ............................................................. 4941 / 6906 ( 71%)
18-Apr-2017 13:12:08 ............................................................. 5002 / 6906 ( 72%)
18-Apr-2017 13:12:08 ............................................................. 5063 / 6906 ( 73%)
18-Apr-2017 13:12:09 ............................................................. 5124 / 6906 ( 74%)
18-Apr-2017 13:12:09 ..............................SSSSSSSSSSSSSSSSSSSSSSSSSSSSSSS 5185 / 6906 ( 75%)
18-Apr-2017 13:12:09 SSSSSSSSSSSSSSSSSSSSSSSSSSSSSSSSSSSSSSSSSSSSSSSSSSSSSSSSSSSSS 5246 / 6906 ( 75%)
18-Apr-2017 13:12:09 SSSSSSSSSSSSSSSSSSSSSSSSSSSSSSSSSSSSSSSSSSSSSSSSSSSSSSSSSSSSS 5307 / 6906 ( 76%)
18-Apr-2017 13:12:09 SSSSSSSSSSSSSSSSSSSSSSSSSSSSSSSSSSSSSSSSSSSSSSSSSSSSSSSSSSSSS 5368 / 6906 ( 77%)
18-Apr-2017 13:12:10 SSSSSSSSSSSSSSSSSSSSSSSSSSSSSSSSSSSSSSSSSSSSSSS.............. 5429 / 6906 ( 78%)
18-Apr-2017 13:12:12 ............................................................. 5490 / 6906 ( 79%)
18-Apr-2017 13:12:13 ............................................................. 5551 / 6906 ( 80%)
18-Apr-2017 13:12:15 ............................................................. 5612 / 6906 ( 81%)
18-Apr-2017 13:12:17 ............................................................. 5673 / 6906 ( 82%)
18-Apr-2017 13:12:19 ............................................................. 5734 / 6906 ( 83%)
18-Apr-2017 13:12:21 ............................................................. 5795 / 6906 ( 83%)
18-Apr-2017 13:12:22 ............................................................. 5856 / 6906 ( 84%)
18-Apr-2017 13:12:24 ............................................................. 5917 / 6906 ( 85%)
18-Apr-2017 13:12:26 ............................................................. 5978 / 6906 ( 86%)
18-Apr-2017 13:12:28 ............................................................. 6039 / 6906 ( 87%)
18-Apr-2017 13:12:29 ............................................................. 6100 / 6906 ( 88%)
18-Apr-2017 13:12:31 ............................................................. 6161 / 6906 ( 89%)
18-Apr-2017 13:12:33 ............................................................. 6222 / 6906 ( 90%)
18-Apr-2017 13:12:35 ............................................................. 6283 / 6906 ( 90%)
18-Apr-2017 13:12:36 ............................................................. 6344 / 6906 ( 91%)
18-Apr-2017 13:12:38 ............................................................. 6405 / 6906 ( 92%)
18-Apr-2017 13:12:40 ............................................................. 6466 / 6906 ( 93%)
18-Apr-2017 13:12:42 ............................................................. 6527 / 6906 ( 94%)
18-Apr-2017 13:12:43 ............................................................. 6588 / 6906 ( 95%)
18-Apr-2017 13:12:45 ............................................................. 6649 / 6906 ( 96%)
18-Apr-2017 13:12:47 ............................................................. 6710 / 6906 ( 97%)
18-Apr-2017 13:12:49 ............................................................. 6771 / 6906 ( 98%)
18-Apr-2017 13:12:50 ............................................................. 6832 / 6906 ( 98%)
18-Apr-2017 13:12:52 ............................................................. 6893 / 6906 ( 99%)
18-Apr-2017 13:12:52 ...........SS
18-Apr-2017 13:12:52
18-Apr-2017 13:12:52 Time: 3.48 minutes, Memory: 423.50MB
18-Apr-2017 13:12:52
18-Apr-2017 13:12:52 There was 1 failure:
18-Apr-2017 13:12:52
18-Apr-2017 13:12:52 1) phpbb_console_user_add_test::test_add_dialog
18-Apr-2017 13:12:52 Failed asserting that null is not equal to null.
18-Apr-2017 13:12:52
18-Apr-2017 13:12:52 /data/tests/console/user/add_test.php:70
18-Apr-2017 13:12:52
18-Apr-2017 13:12:52 FAILURES!
18-Apr-2017 13:12:52 Tests: 9188, Assertions: 60960, Failures: 1, Skipped: 288, Incomplete: 5.
18-Apr-2017 13:12:53 Failing task since return code of [/usr/bin/docker run --volume /home/bamboo/xml-data/build-dir/PHPBB3-PR-JOB1:/data --workdir /data --rm -u=991 phpbb:php-5.6 /bin/bash -c phpBB/vendor/bin/phpunit --log-junit build/logs/phpunit.xml] was 1 while expected 0
18-Apr-2017 13:12:53 Error occurred while running Task 'Run tests(10)' of type com.atlassian.bamboo.plugins.bamboo-docker-plugin:task.docker.cli.
18-Apr-2017 13:12:53 com.atlassian.bamboo.task.TaskException: Failed to execute task
18-Apr-2017 13:12:53         at com.atlassian.bamboo.plugins.docker.service.RunService.execute(RunService.java:71)
18-Apr-2017 13:12:53         at com.atlassian.bamboo.plugins.docker.tasks.cli.DockerCliTask.execute(DockerCliTask.java:60)
18-Apr-2017 13:12:53         at com.atlassian.bamboo.task.TaskExecutorImpl.lambda$executeTasks$3(TaskExecutorImpl.java:317)
18-Apr-2017 13:12:53         at com.atlassian.bamboo.task.TaskExecutorImpl.executeTaskWithPrePostActions(TaskExecutorImpl.java:246)
18-Apr-2017 13:12:53         at com.atlassian.bamboo.task.TaskExecutorImpl.executeTasks(TaskExecutorImpl.java:317)
18-Apr-2017 13:12:53         at com.atlassian.bamboo.task.TaskExecutorImpl.execute(TaskExecutorImpl.java:118)
18-Apr-2017 13:12:53         at com.atlassian.bamboo.build.pipeline.tasks.ExecuteBuildTask.call(ExecuteBuildTask.java:74)
18-Apr-2017 13:12:53         at com.atlassian.bamboo.v2.build.agent.DefaultBuildAgent.build(DefaultBuildAgent.java:216)
18-Apr-2017 13:12:53         at com.atlassian.bamboo.v2.build.agent.BuildAgentControllerImpl$1.call(BuildAgentControllerImpl.java:139)
18-Apr-2017 13:12:53         at com.atlassian.bamboo.v2.build.agent.BuildAgentControllerImpl$1.call(BuildAgentControllerImpl.java:130)
18-Apr-2017 13:12:53         at com.atlassian.bamboo.variable.CustomVariableContextImpl.withVariableSubstitutor(CustomVariableContextImpl.java:221)
18-Apr-2017 13:12:53         at com.atlassian.bamboo.v2.build.agent.BuildAgentControllerImpl.waitAndPerformBuild(BuildAgentControllerImpl.java:129)
18-Apr-2017 13:12:53         at com.atlassian.bamboo.v2.build.agent.DefaultBuildAgent$1.run(DefaultBuildAgent.java:138)
18-Apr-2017 13:12:53         at com.atlassian.bamboo.utils.BambooRunnables$1.run(BambooRunnables.java:51)
18-Apr-2017 13:12:53         at com.atlassian.bamboo.security.ImpersonationHelper.runWith(ImpersonationHelper.java:31)
18-Apr-2017 13:12:53         at com.atlassian.bamboo.security.ImpersonationHelper.runWithSystemAuthority(ImpersonationHelper.java:20)
18-Apr-2017 13:12:53         at com.atlassian.bamboo.security.ImpersonationHelper$1.run(ImpersonationHelper.java:52)
18-Apr-2017 13:12:53         at java.lang.Thread.run(Thread.java:745)
18-Apr-2017 13:12:53 Caused by: com.atlassian.bamboo.plugins.docker.client.DockerException: Error running Docker run command
18-Apr-2017 13:12:53         at com.atlassian.bamboo.plugins.docker.client.DockerCmd.run(DockerCmd.java:103)
18-Apr-2017 13:12:53         at com.atlassian.bamboo.plugins.docker.service.RunService.execute(RunService.java:60)
18-Apr-2017 13:12:53         ... 17 more
18-Apr-2017 13:12:53 Caused by: com.atlassian.utils.process.ProcessException: Error executing /usr/bin/docker run --volume /home/bamboo/xml-data/build-dir/PHPBB3-PR-JOB1:/data --workdir /data --rm -u=991 phpbb:php-5.6 /bin/bash -c "phpBB/vendor/bin/phpunit --log-junit build/logs/phpunit.xml"
18-Apr-2017 13:12:53         at com.atlassian.bamboo.plugins.docker.process.DockerTaskProcessService.execute(DockerTaskProcessService.java:60)
18-Apr-2017 13:12:53         at com.atlassian.bamboo.plugins.docker.client.DockerCmd.run(DockerCmd.java:99)
18-Apr-2017 13:12:53         ... 18 more
18-Apr-2017 13:12:53 Starting task 'Parsing test results produced by script' of type 'com.atlassian.bamboo.plugins.testresultparser:task.testresultparser.junit'
18-Apr-2017 13:12:53 Parsing test results under /home/bamboo/xml-data/build-dir/PHPBB3-PR-JOB1...
18-Apr-2017 13:12:53 Failing task since 1 failing test cases were found.
18-Apr-2017 13:12:53 Finished task 'Parsing test results produced by script' with result: Failed
18-Apr-2017 13:12:53
Substituting variable: ${bamboo.PRnumber} with 4789
18-Apr-2017 13:12:53
Substituting variable: ${bamboo.buildResultsUrl} with https://bamboo.phpbb.com/browse/PHPBB3-PR-JOB1-7013
18-Apr-2017 13:12:53
Substituting variable: ${bamboo.buildResultsUrl} with https://bamboo.phpbb.com/browse/PHPBB3-PR-JOB1-7013
18-Apr-2017 13:12:53 Starting task 'Set result build status' of type 'com.atlassian.bamboo.plugins.scripttask:task.builder.script'
18-Apr-2017 13:12:53
Beginning to execute external process for build 'phpBB3 - Pull Requests - Build and Test Job #7013 (PHPBB3-PR-JOB1-7013)'
... running command line:
/bin/sh /home/bamboo/temp/PHPBB3-PR-JOB1-7013-ScriptBuildTask-4314708483543435328.sh
... in: /home/bamboo/xml-data/build-dir/PHPBB3-PR-JOB1
... using extra environment variables:
bamboo_planRepository_1_branch=3.1.x
bamboo_planRepository_1_branchDisplayName=3.1.x
bamboo_repository_revision_number=8303058ac613c1699b51a647b29b97f754fdf6a6
bamboo_PRref=master
bamboo_resultsUrl=https://bamboo.phpbb.com/browse/PHPBB3-PR-JOB1-7013
bamboo_capability_system_builder_command_Git=/usr/bin/git
bamboo_repository_75956235_git_username=bantu
bamboo_planRepository_1_name=phpBB Ascraeus
bamboo_build_working_directory=/home/bamboo/xml-data/build-dir/PHPBB3-PR-JOB1
bamboo_buildKey=PHPBB3-PR-JOB1
bamboo_capability_phpbb_tests=true
bamboo_shortPlanName=Pull Requests
bamboo_capability_system_builder_command_fop=/usr/bin/fop
bamboo_capability_dbms_sqlite_2=true
bamboo_planRepository_name=phpBB Ascraeus
bamboo_PRnumber=4789
bamboo_buildNumber=7013
bamboo_repository_75956235_git_repositoryUrl=https://github.com/phpbb/phpbb.git
bamboo_capability_system_builder_phpunit_PHPUnit=/usr/bin/phpunit
bamboo_shortJobName=Build and Test Job
bamboo_buildResultsUrl=https://bamboo.phpbb.com/browse/PHPBB3-PR-JOB1-7013
bamboo_repository_75956235_branch_name=3.1.x
bamboo_planRepository_repositoryUrl=https://github.com/phpbb/phpbb.git
bamboo_agentId=131073
bamboo_planName=phpBB3 - Pull Requests
bamboo_build_commandline_com_atlassian_bamboo_plugins_scripttask_task_builder_script_7=/bin/sh /home/bamboo/temp/PHPBB3-PR-JOB1-7013-ScriptBuildTask-998297896725034292.sh
bamboo_shortPlanKey=PR
bamboo_shortJobKey=JOB1
bamboo_capability_dbms_mysql_55=true
bamboo_capability_system_jdk_JDK_1_7_0_65=/usr/lib/jvm/java-7-openjdk-amd64
bamboo_planRepository_revision=8303058ac613c1699b51a647b29b97f754fdf6a6
bamboo_repository_previous_revision_number=8303058ac613c1699b51a647b29b97f754fdf6a6
bamboo_buildTimeStamp=2017-04-18T13:06:29.564Z
bamboo_planRepository_previousRevision=8303058ac613c1699b51a647b29b97f754fdf6a6
bamboo_capability_system_builder_mvn2_Maven_2=/usr/share/maven2
bamboo_capability_system_jdk_JDK_1_6_0_16=/usr/lib/jvm/java-6-sun-1.6.0.16
bamboo_build_commandline_com_atlassian_bamboo_plugins_scripttask_task_builder_script_4=/bin/sh /home/bamboo/temp/PHPBB3-PR-JOB1-7013-ScriptBuildTask-1903513713185622801.sh
bamboo_buildResultKey=PHPBB3-PR-JOB1-7013
bamboo_repository_git_branch=3.1.x
bamboo_repository_branch_name=3.1.x
bamboo_buildPlanName=phpBB3 - Pull Requests - Build and Test Job
bamboo_planRepository_1_revision=8303058ac613c1699b51a647b29b97f754fdf6a6
bamboo_repository_name=phpBB Ascraeus
bamboo_capability_system_docker_executable=/usr/bin/docker
bamboo_build_commandline_com_atlassian_bamboo_plugins_bamboo_docker_plugin_task_docker_cli_10=/usr/bin/docker run --volume /home/bamboo/xml-data/build-dir/PHPBB3-PR-JOB1:/data --workdir /data --rm -u=991 phpbb:php-5.6 /bin/bash -c phpBB/vendor/bin/phpunit --log-junit build/logs/phpunit.xml
bamboo_build_commandline_com_atlassian_bamboo_plugins_bamboo_docker_plugin_task_docker_cli_11=/usr/bin/docker run --volume /home/bamboo/xml-data/build-dir/PHPBB3-PR-JOB1:/data --workdir /data/build --rm -u=991 phpbb:php-5.6 ../phpBB/vendor/bin/phing sniff
bamboo_build_commandline_com_atlassian_bamboo_plugins_bamboo_docker_plugin_task_docker_cli_12=/usr/bin/docker run --volume /home/bamboo/xml-data/build-dir/PHPBB3-PR-JOB1:/data --workdir /data/phpBB --rm -e HOME=/home/bamboo -u=991 phpbb:php-5.6 /bin/bash -c php ../composer.phar install --dev; cd ../build; ../phpBB/vendor/bin/phing clean prepare
bamboo_planRepository_branch=3.1.x
bamboo_agentWorkingDirectory=/home/bamboo/xml-data/build-dir
bamboo_capability_system_git_executable=/usr/bin/git
bamboo_planRepository_1_previousRevision=8303058ac613c1699b51a647b29b97f754fdf6a6
bamboo_capability_system_builder_phpunit_PHPUnit_3_4=/usr/bin/phpunit
bamboo_repository_git_username=bantu
bamboo_repository_75956235_revision_number=8303058ac613c1699b51a647b29b97f754fdf6a6
bamboo_planRepository_branchDisplayName=3.1.x
bamboo_planRepository_1_type=gitv2
bamboo_planRepository_branchName=3.1.x
bamboo_repository_75956235_previous_revision_number=8303058ac613c1699b51a647b29b97f754fdf6a6
bamboo_capability_system_jdk_JDK=/usr/lib/jvm/java-6-sun
bamboo_plan_storageTag=PHPBB3-PR
bamboo_planRepository_type=gitv2
bamboo_planRepository_1_username=bantu
bamboo_ManualBuildTriggerReason_userName=Build Robot
bamboo_repository_git_repositoryUrl=https://github.com/phpbb/phpbb.git
bamboo_repository_75956235_git_branch=3.1.x
bamboo_capability_system_builder_ant_Ant=/usr/share/ant
bamboo_repository_75956235_name=phpBB Ascraeus
bamboo_working_directory=/home/bamboo/xml-data/build-dir/PHPBB3-PR-JOB1
bamboo_planKey=PHPBB3-PR
bamboo_planRepository_1_repositoryUrl=https://github.com/phpbb/phpbb.git
bamboo_planRepository_username=bantu
bamboo_capability_local=true
bamboo_capability_system_jdk_JDK_1_6=/usr/lib/jvm/java-6-sun
bamboo_capability_system_jdk_JDK_1_7=/usr/lib/jvm/java-7-openjdk-amd64
bamboo_planRepository_1_branchName=3.1.x
18-Apr-2017 13:12:54 From https://github.com/phpbb/phpbb
18-Apr-2017 13:12:54 * branch            refs/pull/4789/head -> FETCH_HEAD
18-Apr-2017 13:12:54   <testsuite name="" tests="6613" assertions="60957" failures="1" errors="0" time="197.355785">
18-Apr-2017 13:12:54     <testsuite name="phpBB Test Suite" tests="5124" assertions="59468" failures="1" errors="0" time="155.247370">
18-Apr-2017 13:12:54       <testsuite name="phpbb_console_user_add_test" file="/data/tests/console/user/add_test.php" tests="3" assertions="9" failures="1" errors="0" time="0.407241">
18-Apr-2017 13:12:54   % Total    % Received % Xferd  Average Speed   Time    Time     Time  Current
18-Apr-2017 13:12:54                                  Dload  Upload   Total   Spent    Left  Speed
18-Apr-2017 13:12:54
18-Apr-2017 13:12:55   0     0    0     0    0     0      0      0 --:--:-- --:--:-- --:--:--     0
18-Apr-2017 13:12:55 100   267  100    93  100   174    153    286 --:--:-- --:--:-- --:--:--   286
18-Apr-2017 13:12:55 Finished task 'Set result build status' with result: Success
18-Apr-2017 13:12:55 Running post build plugin 'NCover Results Collector'
18-Apr-2017 13:12:55 Running post build plugin 'Artifact Copier'
18-Apr-2017 13:12:55 Running post build plugin 'npm Cache Cleanup'
18-Apr-2017 13:12:55 Running post build plugin 'Clover Results Collector'
18-Apr-2017 13:12:55 Running post build plugin 'Docker Container Cleanup'
18-Apr-2017 13:12:55 Successfully removed working directory at '/home/bamboo/xml-data/build-dir/PHPBB3-PR-JOB1'
18-Apr-2017 13:12:55 Finalising the build...
18-Apr-2017 13:12:55 Stopping timer.
18-Apr-2017 13:12:55 Build PHPBB3-PR-JOB1-7013 completed.
18-Apr-2017 13:12:55 Running on server: post build plugin 'NCover Results Collector'
18-Apr-2017 13:12:55 Running on server: post build plugin 'Build Hanging Detection Configuration'
18-Apr-2017 13:12:55 Running on server: post build plugin 'Clover Delta Calculator'
18-Apr-2017 13:12:55 Running on server: post build plugin 'Maven Dependencies Postprocessor'
18-Apr-2017 13:12:55 All post build plugins have finished
18-Apr-2017 13:12:55 Generating build results summary...
18-Apr-2017 13:12:59 Saving build results to disk...
18-Apr-2017 13:12:59 Logging substituted variables...
18-Apr-2017 13:12:59 Indexing build results...
18-Apr-2017 13:12:59 Finished building PHPBB3-PR-JOB1-7013.
18-Apr-2017 13:12:59
Substituting variable: ${bamboo.PRnumber} with 4789