Tests pending pull requests

Build: #7040 failed

Job: Build and Test Job failed

Stages & jobs

  1. Build and Test

Build log

The build generated 573 lines of output. Download or view full build log

21-Apr-2017 12:45:05 Build phpBB3 - Pull Requests - Build and Test Job #7040 (PHPBB3-PR-JOB1-7040) started building on agent Default Agent
21-Apr-2017 12:45:05
21-Apr-2017 12:45:05 Build working directory is /home/bamboo/xml-data/build-dir/PHPBB3-PR-JOB1
21-Apr-2017 12:45:05 Executing build phpBB3 - Pull Requests - Build and Test Job #7040 (PHPBB3-PR-JOB1-7040)
21-Apr-2017 12:45:05 Starting task 'Checkout develop branch' of type 'com.atlassian.bamboo.plugins.vcs:task.vcs.checkout'
21-Apr-2017 12:45:05 Build always requires a clean checkout
21-Apr-2017 12:45:05 Cleaning build directory '/home/bamboo/xml-data/build-dir/PHPBB3-PR-JOB1'
21-Apr-2017 12:45:05 Updating source code to revision: ff22d54eae45a79f5bc59d2c04f3e02eed8e4981
21-Apr-2017 12:45:05 Fetching 'refs/heads/3.1.x' from 'https://github.com/phpbb/phpbb.git'.
21-Apr-2017 12:45:05 Checking out revision ff22d54eae45a79f5bc59d2c04f3e02eed8e4981.
21-Apr-2017 12:45:05 Creating local git repository in '/home/bamboo/xml-data/build-dir/PHPBB3-PR-JOB1/.git'.
21-Apr-2017 12:45:05 Cloning into '/home/bamboo/xml-data/build-dir/PHPBB3-PR-JOB1'...
21-Apr-2017 12:45:05 done.
21-Apr-2017 12:45:07 Switched to a new branch '3.1.x'
21-Apr-2017 12:45:07 Branch 3.1.x set up to track remote branch 3.1.x from origin.
21-Apr-2017 12:45:07 Updated source code to revision: ff22d54eae45a79f5bc59d2c04f3e02eed8e4981
21-Apr-2017 12:45:07 Finished task 'Checkout develop branch' with result: Success
21-Apr-2017 12:45:07 Running pre-build action: VCS Version Collector
21-Apr-2017 12:45:07
Substituting variable: ${bamboo.PRnumber} with 4787
21-Apr-2017 12:45:07
Substituting variable: ${bamboo.buildResultsUrl} with https://bamboo.phpbb.com/browse/PHPBB3-PR-JOB1-7040
21-Apr-2017 12:45:07 Starting task 'Set pending build status' of type 'com.atlassian.bamboo.plugins.scripttask:task.builder.script'
21-Apr-2017 12:45:07
Beginning to execute external process for build 'phpBB3 - Pull Requests - Build and Test Job #7040 (PHPBB3-PR-JOB1-7040)'
... running command line:
/bin/sh /home/bamboo/temp/PHPBB3-PR-JOB1-7040-ScriptBuildTask-7131800239093482533.sh
... in: /home/bamboo/xml-data/build-dir/PHPBB3-PR-JOB1
... using extra environment variables:
bamboo_planRepository_1_branch=3.1.x
bamboo_planRepository_1_branchDisplayName=3.1.x
bamboo_repository_revision_number=ff22d54eae45a79f5bc59d2c04f3e02eed8e4981
bamboo_PRref=master
bamboo_resultsUrl=https://bamboo.phpbb.com/browse/PHPBB3-PR-JOB1-7040
bamboo_capability_system_builder_command_Git=/usr/bin/git
bamboo_repository_75956235_git_username=bantu
bamboo_planRepository_1_name=phpBB Ascraeus
bamboo_build_working_directory=/home/bamboo/xml-data/build-dir/PHPBB3-PR-JOB1
bamboo_buildKey=PHPBB3-PR-JOB1
bamboo_capability_phpbb_tests=true
bamboo_shortPlanName=Pull Requests
bamboo_capability_system_builder_command_fop=/usr/bin/fop
bamboo_capability_dbms_sqlite_2=true
bamboo_planRepository_name=phpBB Ascraeus
bamboo_PRnumber=4787
bamboo_buildNumber=7040
bamboo_repository_75956235_git_repositoryUrl=https://github.com/phpbb/phpbb.git
bamboo_capability_system_builder_phpunit_PHPUnit=/usr/bin/phpunit
bamboo_shortJobName=Build and Test Job
bamboo_buildResultsUrl=https://bamboo.phpbb.com/browse/PHPBB3-PR-JOB1-7040
bamboo_repository_75956235_branch_name=3.1.x
bamboo_planRepository_repositoryUrl=https://github.com/phpbb/phpbb.git
bamboo_agentId=131073
bamboo_planName=phpBB3 - Pull Requests
bamboo_shortPlanKey=PR
bamboo_shortJobKey=JOB1
bamboo_capability_dbms_mysql_55=true
bamboo_capability_system_jdk_JDK_1_7_0_65=/usr/lib/jvm/java-7-openjdk-amd64
bamboo_planRepository_revision=ff22d54eae45a79f5bc59d2c04f3e02eed8e4981
bamboo_repository_previous_revision_number=ff22d54eae45a79f5bc59d2c04f3e02eed8e4981
bamboo_buildTimeStamp=2017-04-21T12:45:05.310Z
bamboo_planRepository_previousRevision=ff22d54eae45a79f5bc59d2c04f3e02eed8e4981
bamboo_capability_system_builder_mvn2_Maven_2=/usr/share/maven2
bamboo_capability_system_jdk_JDK_1_6_0_16=/usr/lib/jvm/java-6-sun-1.6.0.16
bamboo_buildResultKey=PHPBB3-PR-JOB1-7040
bamboo_repository_git_branch=3.1.x
bamboo_repository_branch_name=3.1.x
bamboo_buildPlanName=phpBB3 - Pull Requests - Build and Test Job
bamboo_planRepository_1_revision=ff22d54eae45a79f5bc59d2c04f3e02eed8e4981
bamboo_repository_name=phpBB Ascraeus
bamboo_capability_system_docker_executable=/usr/bin/docker
bamboo_planRepository_branch=3.1.x
bamboo_agentWorkingDirectory=/home/bamboo/xml-data/build-dir
bamboo_capability_system_git_executable=/usr/bin/git
bamboo_planRepository_1_previousRevision=ff22d54eae45a79f5bc59d2c04f3e02eed8e4981
bamboo_capability_system_builder_phpunit_PHPUnit_3_4=/usr/bin/phpunit
bamboo_repository_git_username=bantu
bamboo_repository_75956235_revision_number=ff22d54eae45a79f5bc59d2c04f3e02eed8e4981
bamboo_planRepository_branchDisplayName=3.1.x
bamboo_planRepository_1_type=gitv2
bamboo_planRepository_branchName=3.1.x
bamboo_repository_75956235_previous_revision_number=ff22d54eae45a79f5bc59d2c04f3e02eed8e4981
bamboo_capability_system_jdk_JDK=/usr/lib/jvm/java-6-sun
bamboo_plan_storageTag=PHPBB3-PR
bamboo_planRepository_type=gitv2
bamboo_planRepository_1_username=bantu
bamboo_ManualBuildTriggerReason_userName=Build Robot
bamboo_repository_git_repositoryUrl=https://github.com/phpbb/phpbb.git
bamboo_repository_75956235_git_branch=3.1.x
bamboo_capability_system_builder_ant_Ant=/usr/share/ant
bamboo_repository_75956235_name=phpBB Ascraeus
bamboo_working_directory=/home/bamboo/xml-data/build-dir/PHPBB3-PR-JOB1
bamboo_planKey=PHPBB3-PR
bamboo_planRepository_1_repositoryUrl=https://github.com/phpbb/phpbb.git
bamboo_planRepository_username=bantu
bamboo_capability_local=true
bamboo_capability_system_jdk_JDK_1_6=/usr/lib/jvm/java-6-sun
bamboo_capability_system_jdk_JDK_1_7=/usr/lib/jvm/java-7-openjdk-amd64
bamboo_planRepository_1_branchName=3.1.x
21-Apr-2017 12:45:08 From https://github.com/phpbb/phpbb
21-Apr-2017 12:45:08 * branch            refs/pull/4787/head -> FETCH_HEAD
21-Apr-2017 12:45:08   % Total    % Received % Xferd  Average Speed   Time    Time     Time  Current
21-Apr-2017 12:45:08                                  Dload  Upload   Total   Spent    Left  Speed
21-Apr-2017 12:45:08
21-Apr-2017 12:45:09   0     0    0     0    0     0      0      0 --:--:-- --:--:-- --:--:--     0
21-Apr-2017 12:45:09   0     0    0     0    0     0      0      0 --:--:-- --:--:-- --:--:--     0
21-Apr-2017 12:45:09 100   275  100    93  100   182    127    249 --:--:-- --:--:-- --:--:--   248
21-Apr-2017 12:45:09 Finished task 'Set pending build status' with result: Success
21-Apr-2017 12:45:09
Substituting variable: ${bamboo.PRnumber} with 4787
21-Apr-2017 12:45:09 Starting task 'Fetch PR' of type 'com.atlassian.bamboo.plugins.scripttask:task.builder.script'
21-Apr-2017 12:45:09
Beginning to execute external process for build 'phpBB3 - Pull Requests - Build and Test Job #7040 (PHPBB3-PR-JOB1-7040)'
... running command line:
/bin/sh /home/bamboo/temp/PHPBB3-PR-JOB1-7040-ScriptBuildTask-1291798601734097287.sh
... in: /home/bamboo/xml-data/build-dir/PHPBB3-PR-JOB1
... using extra environment variables:
bamboo_planRepository_1_branch=3.1.x
bamboo_planRepository_1_branchDisplayName=3.1.x
bamboo_repository_revision_number=ff22d54eae45a79f5bc59d2c04f3e02eed8e4981
bamboo_PRref=master
bamboo_resultsUrl=https://bamboo.phpbb.com/browse/PHPBB3-PR-JOB1-7040
bamboo_capability_system_builder_command_Git=/usr/bin/git
bamboo_repository_75956235_git_username=bantu
bamboo_planRepository_1_name=phpBB Ascraeus
bamboo_build_working_directory=/home/bamboo/xml-data/build-dir/PHPBB3-PR-JOB1
bamboo_buildKey=PHPBB3-PR-JOB1
bamboo_capability_phpbb_tests=true
bamboo_shortPlanName=Pull Requests
bamboo_capability_system_builder_command_fop=/usr/bin/fop
bamboo_capability_dbms_sqlite_2=true
bamboo_planRepository_name=phpBB Ascraeus
bamboo_PRnumber=4787
bamboo_buildNumber=7040
bamboo_repository_75956235_git_repositoryUrl=https://github.com/phpbb/phpbb.git
bamboo_capability_system_builder_phpunit_PHPUnit=/usr/bin/phpunit
bamboo_shortJobName=Build and Test Job
bamboo_buildResultsUrl=https://bamboo.phpbb.com/browse/PHPBB3-PR-JOB1-7040
bamboo_repository_75956235_branch_name=3.1.x
bamboo_planRepository_repositoryUrl=https://github.com/phpbb/phpbb.git
bamboo_agentId=131073
bamboo_planName=phpBB3 - Pull Requests
bamboo_build_commandline_com_atlassian_bamboo_plugins_scripttask_task_builder_script_7=/bin/sh /home/bamboo/temp/PHPBB3-PR-JOB1-7040-ScriptBuildTask-7131800239093482533.sh
bamboo_shortPlanKey=PR
bamboo_shortJobKey=JOB1
bamboo_capability_dbms_mysql_55=true
bamboo_capability_system_jdk_JDK_1_7_0_65=/usr/lib/jvm/java-7-openjdk-amd64
bamboo_planRepository_revision=ff22d54eae45a79f5bc59d2c04f3e02eed8e4981
bamboo_repository_previous_revision_number=ff22d54eae45a79f5bc59d2c04f3e02eed8e4981
bamboo_buildTimeStamp=2017-04-21T12:45:05.310Z
bamboo_planRepository_previousRevision=ff22d54eae45a79f5bc59d2c04f3e02eed8e4981
bamboo_capability_system_builder_mvn2_Maven_2=/usr/share/maven2
bamboo_capability_system_jdk_JDK_1_6_0_16=/usr/lib/jvm/java-6-sun-1.6.0.16
bamboo_buildResultKey=PHPBB3-PR-JOB1-7040
bamboo_repository_git_branch=3.1.x
bamboo_repository_branch_name=3.1.x
bamboo_buildPlanName=phpBB3 - Pull Requests - Build and Test Job
bamboo_planRepository_1_revision=ff22d54eae45a79f5bc59d2c04f3e02eed8e4981
bamboo_repository_name=phpBB Ascraeus
bamboo_capability_system_docker_executable=/usr/bin/docker
bamboo_planRepository_branch=3.1.x
bamboo_agentWorkingDirectory=/home/bamboo/xml-data/build-dir
bamboo_capability_system_git_executable=/usr/bin/git
bamboo_planRepository_1_previousRevision=ff22d54eae45a79f5bc59d2c04f3e02eed8e4981
bamboo_capability_system_builder_phpunit_PHPUnit_3_4=/usr/bin/phpunit
bamboo_repository_git_username=bantu
bamboo_repository_75956235_revision_number=ff22d54eae45a79f5bc59d2c04f3e02eed8e4981
bamboo_planRepository_branchDisplayName=3.1.x
bamboo_planRepository_1_type=gitv2
bamboo_planRepository_branchName=3.1.x
bamboo_repository_75956235_previous_revision_number=ff22d54eae45a79f5bc59d2c04f3e02eed8e4981
bamboo_capability_system_jdk_JDK=/usr/lib/jvm/java-6-sun
bamboo_plan_storageTag=PHPBB3-PR
bamboo_planRepository_type=gitv2
bamboo_planRepository_1_username=bantu
bamboo_ManualBuildTriggerReason_userName=Build Robot
bamboo_repository_git_repositoryUrl=https://github.com/phpbb/phpbb.git
bamboo_repository_75956235_git_branch=3.1.x
bamboo_capability_system_builder_ant_Ant=/usr/share/ant
bamboo_repository_75956235_name=phpBB Ascraeus
bamboo_working_directory=/home/bamboo/xml-data/build-dir/PHPBB3-PR-JOB1
bamboo_planKey=PHPBB3-PR
bamboo_planRepository_1_repositoryUrl=https://github.com/phpbb/phpbb.git
bamboo_planRepository_username=bantu
bamboo_capability_local=true
bamboo_capability_system_jdk_JDK_1_6=/usr/lib/jvm/java-6-sun
bamboo_capability_system_jdk_JDK_1_7=/usr/lib/jvm/java-7-openjdk-amd64
bamboo_planRepository_1_branchName=3.1.x
21-Apr-2017 12:45:10 From https://github.com/phpbb/phpbb
21-Apr-2017 12:45:10 * branch            refs/pull/4787/merge -> FETCH_HEAD
21-Apr-2017 12:45:10 Note: checking out 'FETCH_HEAD'.
21-Apr-2017 12:45:10
21-Apr-2017 12:45:10 You are in 'detached HEAD' state. You can look around, make experimental
21-Apr-2017 12:45:10 changes and commit them, and you can discard any commits you make in this
21-Apr-2017 12:45:10 state without impacting any branches by performing another checkout.
21-Apr-2017 12:45:10
21-Apr-2017 12:45:10 If you want to create a new branch to retain commits you create, you may
21-Apr-2017 12:45:10 do so (now or later) by using -b with the checkout command again. Example:
21-Apr-2017 12:45:10
21-Apr-2017 12:45:10   git checkout -b new_branch_name
21-Apr-2017 12:45:10
21-Apr-2017 12:45:10 HEAD is now at e308731... Merge 633b771d650ec4be1cdbb2566a52a86f30b8a2a0 into bdbac7b4c90ec2c7ab0ea386a42676e95bbd77c7
21-Apr-2017 12:45:10 Finished task 'Fetch PR' with result: Success
21-Apr-2017 12:45:10 Skipping execution of task 'Prepare directory' as it is disabled
21-Apr-2017 12:45:10
Substituting variable: ${bamboo.working.directory} with /home/bamboo/xml-data/build-dir/PHPBB3-PR-JOB1
21-Apr-2017 12:45:10 Starting task 'Prepare directory' of type 'com.atlassian.bamboo.plugins.bamboo-docker-plugin:task.docker.cli'
21-Apr-2017 12:45:10 Running image name (phpbb:php-5.6)
21-Apr-2017 12:45:10
Beginning to execute external process for build 'phpBB3 - Pull Requests - Build and Test Job #7040 (PHPBB3-PR-JOB1-7040)'
... running command line:
/usr/bin/docker run --volume /home/bamboo/xml-data/build-dir/PHPBB3-PR-JOB1:/data --workdir /data/phpBB --rm -e HOME=/home/bamboo -u=991 phpbb:php-5.6 /bin/bash -c php ../composer.phar install --dev; cd ../build; ../phpBB/vendor/bin/phing clean prepare
... in: /home/bamboo/xml-data/build-dir/PHPBB3-PR-JOB1
... using extra environment variables:
bamboo_planRepository_1_branch=3.1.x
bamboo_planRepository_1_branchDisplayName=3.1.x
bamboo_repository_revision_number=ff22d54eae45a79f5bc59d2c04f3e02eed8e4981
bamboo_PRref=master
bamboo_resultsUrl=https://bamboo.phpbb.com/browse/PHPBB3-PR-JOB1-7040
bamboo_capability_system_builder_command_Git=/usr/bin/git
bamboo_repository_75956235_git_username=bantu
bamboo_planRepository_1_name=phpBB Ascraeus
bamboo_build_working_directory=/home/bamboo/xml-data/build-dir/PHPBB3-PR-JOB1
bamboo_buildKey=PHPBB3-PR-JOB1
bamboo_capability_phpbb_tests=true
bamboo_shortPlanName=Pull Requests
bamboo_capability_system_builder_command_fop=/usr/bin/fop
bamboo_capability_dbms_sqlite_2=true
bamboo_planRepository_name=phpBB Ascraeus
bamboo_PRnumber=4787
bamboo_buildNumber=7040
bamboo_repository_75956235_git_repositoryUrl=https://github.com/phpbb/phpbb.git
bamboo_capability_system_builder_phpunit_PHPUnit=/usr/bin/phpunit
bamboo_shortJobName=Build and Test Job
bamboo_buildResultsUrl=https://bamboo.phpbb.com/browse/PHPBB3-PR-JOB1-7040
bamboo_repository_75956235_branch_name=3.1.x
bamboo_planRepository_repositoryUrl=https://github.com/phpbb/phpbb.git
bamboo_agentId=131073
bamboo_planName=phpBB3 - Pull Requests
bamboo_build_commandline_com_atlassian_bamboo_plugins_scripttask_task_builder_script_7=/bin/sh /home/bamboo/temp/PHPBB3-PR-JOB1-7040-ScriptBuildTask-7131800239093482533.sh
bamboo_shortPlanKey=PR
bamboo_shortJobKey=JOB1
bamboo_capability_dbms_mysql_55=true
bamboo_capability_system_jdk_JDK_1_7_0_65=/usr/lib/jvm/java-7-openjdk-amd64
bamboo_planRepository_revision=ff22d54eae45a79f5bc59d2c04f3e02eed8e4981
bamboo_repository_previous_revision_number=ff22d54eae45a79f5bc59d2c04f3e02eed8e4981
bamboo_buildTimeStamp=2017-04-21T12:45:05.310Z
bamboo_planRepository_previousRevision=ff22d54eae45a79f5bc59d2c04f3e02eed8e4981
bamboo_capability_system_builder_mvn2_Maven_2=/usr/share/maven2
bamboo_capability_system_jdk_JDK_1_6_0_16=/usr/lib/jvm/java-6-sun-1.6.0.16
bamboo_build_commandline_com_atlassian_bamboo_plugins_scripttask_task_builder_script_4=/bin/sh /home/bamboo/temp/PHPBB3-PR-JOB1-7040-ScriptBuildTask-1291798601734097287.sh
bamboo_buildResultKey=PHPBB3-PR-JOB1-7040
bamboo_repository_git_branch=3.1.x
bamboo_repository_branch_name=3.1.x
bamboo_buildPlanName=phpBB3 - Pull Requests - Build and Test Job
bamboo_planRepository_1_revision=ff22d54eae45a79f5bc59d2c04f3e02eed8e4981
bamboo_repository_name=phpBB Ascraeus
bamboo_capability_system_docker_executable=/usr/bin/docker
bamboo_planRepository_branch=3.1.x
bamboo_agentWorkingDirectory=/home/bamboo/xml-data/build-dir
bamboo_capability_system_git_executable=/usr/bin/git
bamboo_planRepository_1_previousRevision=ff22d54eae45a79f5bc59d2c04f3e02eed8e4981
bamboo_capability_system_builder_phpunit_PHPUnit_3_4=/usr/bin/phpunit
bamboo_repository_git_username=bantu
bamboo_repository_75956235_revision_number=ff22d54eae45a79f5bc59d2c04f3e02eed8e4981
bamboo_planRepository_branchDisplayName=3.1.x
bamboo_planRepository_1_type=gitv2
bamboo_planRepository_branchName=3.1.x
bamboo_repository_75956235_previous_revision_number=ff22d54eae45a79f5bc59d2c04f3e02eed8e4981
bamboo_capability_system_jdk_JDK=/usr/lib/jvm/java-6-sun
bamboo_plan_storageTag=PHPBB3-PR
bamboo_planRepository_type=gitv2
bamboo_planRepository_1_username=bantu
bamboo_ManualBuildTriggerReason_userName=Build Robot
bamboo_repository_git_repositoryUrl=https://github.com/phpbb/phpbb.git
bamboo_repository_75956235_git_branch=3.1.x
bamboo_capability_system_builder_ant_Ant=/usr/share/ant
bamboo_repository_75956235_name=phpBB Ascraeus
bamboo_working_directory=/home/bamboo/xml-data/build-dir/PHPBB3-PR-JOB1
bamboo_planKey=PHPBB3-PR
bamboo_planRepository_1_repositoryUrl=https://github.com/phpbb/phpbb.git
bamboo_planRepository_username=bantu
bamboo_capability_local=true
bamboo_capability_system_jdk_JDK_1_6=/usr/lib/jvm/java-6-sun
bamboo_capability_system_jdk_JDK_1_7=/usr/lib/jvm/java-7-openjdk-amd64
bamboo_planRepository_1_branchName=3.1.x
21-Apr-2017 12:45:10 You are running composer with xdebug enabled. This has a major impact on runtime performance. See https://getcomposer.org/xdebug
21-Apr-2017 12:45:10 You are using the deprecated option "dev". Dev packages are installed by default now.
21-Apr-2017 12:45:10 Cannot create cache directory /home/bamboo/.composer/cache/repo/https---packagist.org/, or directory is not writable. Proceeding without cache
21-Apr-2017 12:45:10 Cannot create cache directory /home/bamboo/.composer/cache/files/, or directory is not writable. Proceeding without cache
21-Apr-2017 12:45:10 Loading composer repositories with package information
21-Apr-2017 12:45:10 Installing dependencies (including require-dev) from lock file
21-Apr-2017 12:45:11   - Installing bantu/ini-get-wrapper (v1.0.1)
21-Apr-2017 12:45:13     Downloading: Connecting...    Downloading: 100%         
21-Apr-2017 12:45:13
21-Apr-2017 12:45:13   - Installing google/recaptcha (1.1.2)
21-Apr-2017 12:45:14     Downloading: Connecting...    Downloading: 0%               Downloading: 30%    Downloading: 55%    Downloading: 65%    Downloading: 70%    Downloading: 95%    Downloading: 100%    Downloading: 100%
21-Apr-2017 12:45:14
21-Apr-2017 12:45:14   - Installing guzzlehttp/promises (1.3.0)
21-Apr-2017 12:45:15     Downloading: Connecting...    Downloading: 0%               Downloading: 15%    Downloading: 25%    Downloading: 40%    Downloading: 60%    Downloading: 70%    Downloading: 85%    Downloading: 100%    Downloading: 100%
21-Apr-2017 12:45:15
21-Apr-2017 12:45:15   - Installing psr/http-message (1.0.1)
21-Apr-2017 12:45:16     Downloading: Connecting...    Downloading: 0%               Downloading: 95%    Downloading: 100%    Downloading: 100%
21-Apr-2017 12:45:16
21-Apr-2017 12:45:16   - Installing guzzlehttp/psr7 (1.3.1)
21-Apr-2017 12:45:17     Downloading: Connecting...    Downloading: 0%               Downloading: 5%    Downloading: 15%    Downloading: 20%    Downloading: 30%    Downloading: 35%    Downloading: 45%    Downloading: 50%    Downloading: 65%    Downloading: 70%    Downloading: 85%    Downloading: 90%    Downloading: 100%    Downloading: 100%
21-Apr-2017 12:45:17
21-Apr-2017 12:45:17   - Installing lusitanian/oauth (v0.8.10)
21-Apr-2017 12:45:18     Downloading: Connecting...    Downloading: 0%               Downloading: 5%    Downloading: 10%    Downloading: 15%    Downloading: 20%    Downloading: 30%    Downloading: 35%    Downloading: 45%    Downloading: 50%    Downloading: 55%    Downloading: 60%    Downloading: 65%    Downloading: 75%    Downloading: 80%    Downloading: 90%    Downloading: 95%    Downloading: 100%    Downloading: 100%
21-Apr-2017 12:45:18
21-Apr-2017 12:45:18   - Installing marc1706/fast-image-size (v1.1.3)
21-Apr-2017 12:45:20     Downloading: Connecting...    Downloading: 0%               Downloading: 20%    Downloading: 40%    Downloading: 100%    Downloading: 100%
21-Apr-2017 12:45:20
21-Apr-2017 12:45:20   - Installing paragonie/random_compat (v1.4.1)
21-Apr-2017 12:45:20     Downloading: Connecting...    Downloading: 0%               Downloading: 20%    Downloading: 35%    Downloading: 60%    Downloading: 80%    Downloading: 95%    Downloading: 100%    Downloading: 100%
21-Apr-2017 12:45:20
21-Apr-2017 12:45:21   - Installing patchwork/utf8 (v1.3.1)
21-Apr-2017 12:45:22     Downloading: Connecting...    Downloading: 0%               Downloading: 5%    Downloading: 10%    Downloading: 15%    Downloading: 20%    Downloading: 25%    Downloading: 30%    Downloading: 35%    Downloading: 40%    Downloading: 45%    Downloading: 50%    Downloading: 55%    Downloading: 60%    Downloading: 65%    Downloading: 70%    Downloading: 75%    Downloading: 80%    Downloading: 85%    Downloading: 90%    Downloading: 95%    Downloading: 100%    Downloading: 100%
21-Apr-2017 12:45:22
21-Apr-2017 12:45:22   - Installing s9e/text-formatter (0.9.1)
21-Apr-2017 12:45:23     Downloading: Connecting...    Downloading: 100%         
21-Apr-2017 12:45:23
21-Apr-2017 12:45:23   - Installing symfony/filesystem (v3.2.0)
21-Apr-2017 12:45:24     Downloading: Connecting...    Downloading: 0%               Downloading: 35%    Downloading: 40%    Downloading: 75%    Downloading: 95%    Downloading: 100%    Downloading: 100%
21-Apr-2017 12:45:24
21-Apr-2017 12:45:24   - Installing symfony/config (v3.2.0)
21-Apr-2017 12:45:26     Downloading: Connecting...    Downloading: 100%         
21-Apr-2017 12:45:26
21-Apr-2017 12:45:26   - Installing symfony/finder (v3.2.0)
21-Apr-2017 12:45:27     Downloading: Connecting...    Downloading: 0%               Downloading: 5%    Downloading: 10%    Downloading: 15%    Downloading: 20%    Downloading: 25%    Downloading: 35%    Downloading: 40%    Downloading: 45%    Downloading: 50%    Downloading: 55%    Downloading: 60%    Downloading: 65%    Downloading: 70%    Downloading: 75%    Downloading: 80%    Downloading: 100%    Downloading: 100%
21-Apr-2017 12:45:27
21-Apr-2017 12:45:27   - Installing symfony/polyfill-mbstring (v1.3.0)
21-Apr-2017 12:45:28     Downloading: Connecting...    Downloading: 0%               Downloading: 35%    Downloading: 70%    Downloading: 90%    Downloading: 100%
21-Apr-2017 12:45:28
21-Apr-2017 12:45:28   - Installing symfony/http-foundation (v3.2.0)
21-Apr-2017 12:45:29     Downloading: Connecting...    Downloading: 0%               Downloading: 5%    Downloading: 10%    Downloading: 15%    Downloading: 20%    Downloading: 25%    Downloading: 30%    Downloading: 35%    Downloading: 40%    Downloading: 45%    Downloading: 50%    Downloading: 55%    Downloading: 60%    Downloading: 65%    Downloading: 70%    Downloading: 75%    Downloading: 80%    Downloading: 85%    Downloading: 90%    Downloading: 95%    Downloading: 100%    Downloading: 100%
21-Apr-2017 12:45:29
21-Apr-2017 12:45:29   - Installing symfony/event-dispatcher (v3.2.0)
21-Apr-2017 12:45:30     Downloading: Connecting...    Downloading: 0%               Downloading: 5%    Downloading: 10%    Downloading: 15%    Downloading: 65%    Downloading: 70%    Downloading: 75%    Downloading: 80%    Downloading: 85%    Downloading: 90%    Downloading: 100%    Downloading: 100%
21-Apr-2017 12:45:30
21-Apr-2017 12:45:30   - Installing psr/log (1.0.2)
21-Apr-2017 12:45:31     Downloading: Connecting...    Downloading: 0%               Downloading: 15%    Downloading: 100%    Downloading: 100%
21-Apr-2017 12:45:31
21-Apr-2017 12:45:31   - Installing symfony/debug (v3.2.0)
21-Apr-2017 12:45:32     Downloading: Connecting...    Downloading: 0%               Downloading: 5%    Downloading: 25%    Downloading: 30%    Downloading: 35%    Downloading: 40%    Downloading: 45%    Downloading: 70%    Downloading: 75%    Downloading: 100%    Downloading: 100%
21-Apr-2017 12:45:32
21-Apr-2017 12:45:32   - Installing symfony/http-kernel (v3.2.0)
21-Apr-2017 12:45:33     Downloading: Connecting...    Downloading: 0%               Downloading: 5%    Downloading: 10%    Downloading: 15%    Downloading: 20%    Downloading: 25%    Downloading: 30%    Downloading: 35%    Downloading: 40%    Downloading: 45%    Downloading: 50%    Downloading: 55%    Downloading: 60%    Downloading: 65%    Downloading: 70%    Downloading: 75%    Downloading: 80%    Downloading: 85%    Downloading: 90%    Downloading: 95%    Downloading: 100%    Downloading: 100%
21-Apr-2017 12:45:33
21-Apr-2017 12:45:33   - Installing symfony/dependency-injection (v3.2.0)
21-Apr-2017 12:45:35     Downloading: Connecting...    Downloading: 0%               Downloading: 5%    Downloading: 10%    Downloading: 15%    Downloading: 20%    Downloading: 25%    Downloading: 30%    Downloading: 35%    Downloading: 40%    Downloading: 45%    Downloading: 50%    Downloading: 55%    Downloading: 60%    Downloading: 65%    Downloading: 70%    Downloading: 75%    Downloading: 80%    Downloading: 85%    Downloading: 90%    Downloading: 95%    Downloading: 100%    Downloading: 100%
21-Apr-2017 12:45:35
21-Apr-2017 12:45:35   - Installing zendframework/zend-eventmanager (3.0.1)
21-Apr-2017 12:45:36     Downloading: Connecting...    Downloading: 0%               Downloading: 15%    Downloading: 30%    Downloading: 75%    Downloading: 90%    Downloading: 100%    Downloading: 100%
21-Apr-2017 12:45:36
21-Apr-2017 12:45:36   - Installing zendframework/zend-code (2.6.3)
21-Apr-2017 12:45:37     Downloading: Connecting...    Downloading: 0%               Downloading: 5%    Downloading: 10%    Downloading: 15%    Downloading: 20%    Downloading: 25%    Downloading: 30%    Downloading: 35%    Downloading: 40%    Downloading: 45%    Downloading: 55%    Downloading: 60%    Downloading: 65%    Downloading: 70%    Downloading: 75%    Downloading: 80%    Downloading: 85%    Downloading: 95%    Downloading: 100%    Downloading: 100%
21-Apr-2017 12:45:37
21-Apr-2017 12:45:37   - Installing ocramius/proxy-manager (1.0.2)
21-Apr-2017 12:45:38     Downloading: Connecting...    Downloading: 0%               Downloading: 5%    Downloading: 10%    Downloading: 15%    Downloading: 20%    Downloading: 25%    Downloading: 30%    Downloading: 35%    Downloading: 40%    Downloading: 45%    Downloading: 50%    Downloading: 55%    Downloading: 65%    Downloading: 70%    Downloading: 75%    Downloading: 80%    Downloading: 85%    Downloading: 90%    Downloading: 95%    Downloading: 100%    Downloading: 100%
21-Apr-2017 12:45:38
21-Apr-2017 12:45:38   - Installing symfony/proxy-manager-bridge (v3.2.0)
21-Apr-2017 12:45:40     Downloading: Connecting...    Downloading: 0%               Downloading: 25%    Downloading: 65%    Downloading: 100%    Downloading: 100%
21-Apr-2017 12:45:40
21-Apr-2017 12:45:40   - Installing symfony/routing (v3.2.0)
21-Apr-2017 12:45:41     Downloading: Connecting...    Downloading: 100%         
21-Apr-2017 12:45:41
21-Apr-2017 12:45:41   - Installing twig/twig (v1.24.2)
21-Apr-2017 12:45:42     Downloading: Connecting...    Downloading: 0%               Downloading: 5%    Downloading: 10%    Downloading: 15%    Downloading: 20%    Downloading: 25%    Downloading: 30%    Downloading: 35%    Downloading: 40%    Downloading: 45%    Downloading: 50%    Downloading: 55%    Downloading: 60%    Downloading: 65%    Downloading: 70%    Downloading: 75%    Downloading: 80%    Downloading: 85%    Downloading: 90%    Downloading: 95%    Downloading: 100%    Downloading: 100%
21-Apr-2017 12:45:42
21-Apr-2017 12:45:42   - Installing symfony/twig-bridge (v3.1.4)
21-Apr-2017 12:45:44     Downloading: Connecting...    Downloading: 100%         
21-Apr-2017 12:45:44
21-Apr-2017 12:45:44   - Installing symfony/dom-crawler (v3.2.0)
21-Apr-2017 12:45:45     Downloading: Connecting...    Downloading: 100%         
21-Apr-2017 12:45:45
21-Apr-2017 12:45:45   - Installing symfony/css-selector (v3.2.0)
21-Apr-2017 12:45:46     Downloading: Connecting...    Downloading: 0%               Downloading: 5%    Downloading: 10%    Downloading: 15%    Downloading: 20%    Downloading: 25%    Downloading: 30%    Downloading: 35%    Downloading: 40%    Downloading: 45%    Downloading: 50%    Downloading: 55%    Downloading: 60%    Downloading: 65%    Downloading: 70%    Downloading: 75%    Downloading: 100%    Downloading: 100%
21-Apr-2017 12:45:46
21-Apr-2017 12:45:46   - Installing symfony/browser-kit (v3.2.0)
21-Apr-2017 12:45:47     Downloading: Connecting...    Downloading: 0%               Downloading: 50%    Downloading: 80%    Downloading: 85%    Downloading: 100%    Downloading: 100%
21-Apr-2017 12:45:47
21-Apr-2017 12:45:47   - Installing guzzlehttp/guzzle (6.2.2)
21-Apr-2017 12:45:48     Downloading: Connecting...    Downloading: 0%               Downloading: 5%    Downloading: 10%    Downloading: 15%    Downloading: 25%    Downloading: 30%    Downloading: 40%    Downloading: 45%    Downloading: 55%    Downloading: 60%    Downloading: 70%    Downloading: 75%    Downloading: 85%    Downloading: 90%    Downloading: 100%    Downloading: 100%
21-Apr-2017 12:45:48
21-Apr-2017 12:45:48   - Installing fabpot/goutte (v3.2.0)
21-Apr-2017 12:45:49     Downloading: Connecting...    Downloading: 0%               Downloading: 70%    Downloading: 100%    Downloading: 100%
21-Apr-2017 12:45:49
21-Apr-2017 12:45:49   - Installing facebook/webdriver (1.2.0)
21-Apr-2017 12:45:50     Downloading: Connecting...    Downloading: 0%               Downloading: 5%    Downloading: 10%    Downloading: 15%    Downloading: 20%    Downloading: 25%    Downloading: 30%    Downloading: 35%    Downloading: 40%    Downloading: 45%    Downloading: 50%    Downloading: 55%    Downloading: 60%    Downloading: 65%    Downloading: 70%    Downloading: 75%    Downloading: 80%    Downloading: 85%    Downloading: 90%    Downloading: 95%    Downloading: 100%    Downloading: 100%
21-Apr-2017 12:45:50
21-Apr-2017 12:45:50   - Installing symfony/process (v3.2.0)
21-Apr-2017 12:45:51     Downloading: Connecting...    Downloading: 0%               Downloading: 20%    Downloading: 35%    Downloading: 50%    Downloading: 65%    Downloading: 70%    Downloading: 85%    Downloading: 100%    Downloading: 100%
21-Apr-2017 12:45:51
21-Apr-2017 12:45:51   - Installing symfony/console (v3.2.0)
21-Apr-2017 12:45:52     Downloading: Connecting...    Downloading: 0%               Downloading: 5%    Downloading: 10%    Downloading: 15%    Downloading: 20%    Downloading: 25%    Downloading: 30%    Downloading: 35%    Downloading: 40%    Downloading: 45%    Downloading: 50%    Downloading: 55%    Downloading: 60%    Downloading: 65%    Downloading: 70%    Downloading: 75%    Downloading: 80%    Downloading: 85%    Downloading: 90%    Downloading: 95%    Downloading: 100%    Downloading: 100%
21-Apr-2017 12:45:53
21-Apr-2017 12:45:53   - Installing laravel/homestead (v3.1.0)
21-Apr-2017 12:45:54     Downloading: Connecting...    Downloading: 0%               Downloading: 55%    Downloading: 100%    Downloading: 100%
21-Apr-2017 12:45:54
21-Apr-2017 12:45:54   - Installing phing/phing (2.4.14)
21-Apr-2017 12:45:55     Downloading: Connecting...    Downloading: 100%         
21-Apr-2017 12:45:55
21-Apr-2017 12:45:56   - Installing phpdocumentor/reflection-docblock (2.0.4)
21-Apr-2017 12:45:57     Downloading: Connecting...    Downloading: 0%               Downloading: 15%    Downloading: 20%    Downloading: 30%    Downloading: 35%    Downloading: 50%    Downloading: 55%    Downloading: 70%    Downloading: 85%    Downloading: 90%    Downloading: 100%
21-Apr-2017 12:45:57
21-Apr-2017 12:45:57   - Installing phpdocumentor/reflection-common (1.0)
21-Apr-2017 12:45:57     Downloading: Connecting...    Downloading: 0%               Downloading: 65%    Downloading: 100%    Downloading: 100%
21-Apr-2017 12:45:57
21-Apr-2017 12:45:58   - Installing phpdocumentor/type-resolver (0.2.1)
21-Apr-2017 12:45:59     Downloading: Connecting...    Downloading: 0%               Downloading: 20%    Downloading: 40%    Downloading: 60%    Downloading: 75%    Downloading: 95%    Downloading: 100%
21-Apr-2017 12:45:59
21-Apr-2017 12:45:59   - Installing symfony/yaml (v3.2.0)
21-Apr-2017 12:46:00     Downloading: Connecting...    Downloading: 0%               Downloading: 10%    Downloading: 15%    Downloading: 25%    Downloading: 35%    Downloading: 50%    Downloading: 60%    Downloading: 75%    Downloading: 85%    Downloading: 90%    Downloading: 100%
21-Apr-2017 12:46:00
21-Apr-2017 12:46:00   - Installing sebastian/version (1.0.6)
21-Apr-2017 12:46:01     Downloading: Connecting...    Downloading: 0%               Downloading: 100%    Downloading: 100%
21-Apr-2017 12:46:01
21-Apr-2017 12:46:01   - Installing sebastian/global-state (1.1.1)
21-Apr-2017 12:46:02     Downloading: Connecting...    Downloading: 0%               Downloading: 40%    Downloading: 70%    Downloading: 100%    Downloading: 100%
21-Apr-2017 12:46:02
21-Apr-2017 12:46:02   - Installing sebastian/recursion-context (1.0.2)
21-Apr-2017 12:46:03     Downloading: Connecting...    Downloading: 0%               Downloading: 35%    Downloading: 70%    Downloading: 100%    Downloading: 100%
21-Apr-2017 12:46:03
21-Apr-2017 12:46:03   - Installing sebastian/exporter (1.2.2)
21-Apr-2017 12:46:04     Downloading: Connecting...    Downloading: 0%               Downloading: 100%    Downloading: 100%
21-Apr-2017 12:46:04
21-Apr-2017 12:46:04   - Installing sebastian/environment (1.3.8)
21-Apr-2017 12:46:04     Downloading: Connecting...    Downloading: 0%               Downloading: 15%    Downloading: 30%    Downloading: 45%    Downloading: 60%    Downloading: 75%    Downloading: 100%    Downloading: 100%
21-Apr-2017 12:46:04
21-Apr-2017 12:46:04   - Installing sebastian/diff (1.4.1)
21-Apr-2017 12:46:05     Downloading: Connecting...    Downloading: 0%               Downloading: 15%    Downloading: 30%    Downloading: 45%    Downloading: 100%    Downloading: 100%
21-Apr-2017 12:46:05
21-Apr-2017 12:46:05   - Installing sebastian/comparator (1.2.2)
21-Apr-2017 12:46:07     Downloading: Connecting...    Downloading: 0%               Downloading: 10%    Downloading: 20%    Downloading: 30%    Downloading: 40%    Downloading: 45%    Downloading: 55%    Downloading: 65%    Downloading: 75%    Downloading: 85%    Downloading: 95%    Downloading: 100%    Downloading: 100%
21-Apr-2017 12:46:07
21-Apr-2017 12:46:07   - Installing phpunit/php-text-template (1.2.1)
21-Apr-2017 12:46:07     Downloading: Connecting...    Downloading: 0%               Downloading: 35%    Downloading: 100%    Downloading: 100%
21-Apr-2017 12:46:07
21-Apr-2017 12:46:07   - Installing doctrine/instantiator (1.0.5)
21-Apr-2017 12:46:08     Downloading: Connecting...    Downloading: 0%               Downloading: 15%    Downloading: 30%    Downloading: 45%    Downloading: 50%    Downloading: 65%    Downloading: 80%    Downloading: 95%    Downloading: 100%    Downloading: 100%
21-Apr-2017 12:46:08
21-Apr-2017 12:46:08   - Installing phpunit/phpunit-mock-objects (2.3.8)
21-Apr-2017 12:46:10     Downloading: Connecting...    Downloading: 0%               Downloading: 5%    Downloading: 10%    Downloading: 15%    Downloading: 20%    Downloading: 25%    Downloading: 30%    Downloading: 35%    Downloading: 40%    Downloading: 50%    Downloading: 55%    Downloading: 65%    Downloading: 70%    Downloading: 75%    Downloading: 80%    Downloading: 90%    Downloading: 95%    Downloading: 100%    Downloading: 100%
21-Apr-2017 12:46:10
21-Apr-2017 12:46:10   - Installing phpunit/php-timer (1.0.8)
21-Apr-2017 12:46:11     Downloading: Connecting...    Downloading: 0%               Downloading: 100%
21-Apr-2017 12:46:11
21-Apr-2017 12:46:11   - Installing phpunit/php-file-iterator (1.4.2)
21-Apr-2017 12:46:11     Downloading: Connecting...    Downloading: 0%               Downloading: 20%    Downloading: 40%    Downloading: 60%    Downloading: 100%    Downloading: 100%
21-Apr-2017 12:46:11
21-Apr-2017 12:46:11   - Installing phpunit/php-token-stream (1.4.9)
21-Apr-2017 12:46:13     Downloading: Connecting...    Downloading: 0%               Downloading: 5%    Downloading: 10%    Downloading: 15%    Downloading: 20%    Downloading: 30%    Downloading: 35%    Downloading: 40%    Downloading: 45%    Downloading: 50%    Downloading: 55%    Downloading: 100%
21-Apr-2017 12:46:13
21-Apr-2017 12:46:13   - Installing phpunit/php-code-coverage (2.2.4)
21-Apr-2017 12:46:14     Downloading: Connecting...    Downloading: 0%               Downloading: 5%    Downloading: 10%    Downloading: 15%    Downloading: 20%    Downloading: 25%    Downloading: 30%    Downloading: 35%    Downloading: 40%    Downloading: 45%    Downloading: 50%    Downloading: 55%    Downloading: 60%    Downloading: 65%    Downloading: 70%    Downloading: 75%    Downloading: 85%    Downloading: 90%    Downloading: 95%    Downloading: 100%    Downloading: 100%
21-Apr-2017 12:46:14
21-Apr-2017 12:46:14   - Installing phpspec/prophecy (v1.6.2)
21-Apr-2017 12:46:15     Downloading: Connecting...    Downloading: 0%               Downloading: 5%    Downloading: 10%    Downloading: 15%    Downloading: 20%    Downloading: 25%    Downloading: 30%    Downloading: 35%    Downloading: 40%    Downloading: 45%    Downloading: 50%    Downloading: 55%    Downloading: 60%    Downloading: 65%    Downloading: 70%    Downloading: 75%    Downloading: 80%    Downloading: 85%    Downloading: 90%    Downloading: 95%    Downloading: 100%    Downloading: 100%
21-Apr-2017 12:46:15
21-Apr-2017 12:46:15   - Installing phpunit/phpunit (4.8.31)
21-Apr-2017 12:46:17     Downloading: Connecting...    Downloading: 0%               Downloading: 5%    Downloading: 10%    Downloading: 15%    Downloading: 20%    Downloading: 25%    Downloading: 30%    Downloading: 35%    Downloading: 40%    Downloading: 45%    Downloading: 50%    Downloading: 55%    Downloading: 60%    Downloading: 65%    Downloading: 75%    Downloading: 85%    Downloading: 90%    Downloading: 95%    Downloading: 100%    Downloading: 100%
21-Apr-2017 12:46:17
21-Apr-2017 12:46:17   - Installing phpunit/dbunit (2.0.3)
21-Apr-2017 12:46:18     Downloading: Connecting...    Downloading: 0%               Downloading: 5%    Downloading: 10%    Downloading: 15%    Downloading: 20%    Downloading: 25%    Downloading: 30%    Downloading: 35%    Downloading: 40%    Downloading: 45%    Downloading: 50%    Downloading: 55%    Downloading: 60%    Downloading: 65%    Downloading: 70%    Downloading: 75%    Downloading: 80%    Downloading: 85%    Downloading: 90%    Downloading: 95%    Downloading: 100%    Downloading: 100%
21-Apr-2017 12:46:18
21-Apr-2017 12:46:18   - Installing squizlabs/php_codesniffer (2.7.1)
21-Apr-2017 12:46:19     Downloading: Connecting...    Downloading: 0%               Downloading: 5%    Downloading: 10%    Downloading: 15%    Downloading: 20%    Downloading: 25%    Downloading: 30%    Downloading: 35%    Downloading: 40%    Downloading: 45%    Downloading: 50%    Downloading: 60%    Downloading: 65%    Downloading: 70%    Downloading: 75%    Downloading: 80%    Downloading: 85%    Downloading: 90%    Downloading: 95%    Downloading: 100%    Downloading: 100%
21-Apr-2017 12:46:19
21-Apr-2017 12:46:19   - Installing webmozart/assert (1.2.0)
21-Apr-2017 12:46:21     Downloading: Connecting...    Downloading: 0%               Downloading: 55%    Downloading: 80%    Downloading: 100%    Downloading: 100%
21-Apr-2017 12:46:21
21-Apr-2017 12:46:23 lusitanian/oauth suggests installing predis/predis (Allows using the Redis storage backend.)
21-Apr-2017 12:46:23 paragonie/random_compat suggests installing ext-libsodium (Provides a modern crypto API that can be used to generate random bytes.)
21-Apr-2017 12:46:23 patchwork/utf8 suggests installing ext-intl (Use Intl for best performance)
21-Apr-2017 12:46:23 patchwork/utf8 suggests installing ext-wfio (Use WFIO for UTF-8 filesystem access on Windows)
21-Apr-2017 12:46:23 s9e/text-formatter suggests installing ext-intl (Allows international URLs to be accepted by the URL filter)
21-Apr-2017 12:46:23 s9e/text-formatter suggests installing ext-xsl (Enables the XSLT renderer)
21-Apr-2017 12:46:23 symfony/http-kernel suggests installing symfony/class-loader ()
21-Apr-2017 12:46:23 symfony/http-kernel suggests installing symfony/var-dumper ()
21-Apr-2017 12:46:23 symfony/dependency-injection suggests installing symfony/expression-language (For using expressions in service container configuration)
21-Apr-2017 12:46:23 zendframework/zend-eventmanager suggests installing container-interop/container-interop (^1.1.0, to use the lazy listeners feature)
21-Apr-2017 12:46:23 zendframework/zend-eventmanager suggests installing zendframework/zend-stdlib (^2.7.3 || ^3.0, to use the FilterChain feature)
21-Apr-2017 12:46:23 zendframework/zend-code suggests installing doctrine/annotations (Doctrine\Common\Annotations >=1.0 for annotation features)
21-Apr-2017 12:46:23 zendframework/zend-code suggests installing zendframework/zend-stdlib (Zend\Stdlib component)
21-Apr-2017 12:46:23 ocramius/proxy-manager suggests installing ocramius/generated-hydrator (To have very fast object to array to object conversion for ghost objects)
21-Apr-2017 12:46:23 ocramius/proxy-manager suggests installing zendframework/zend-json (To have the JsonRpc adapter (Remote Object feature))
21-Apr-2017 12:46:23 ocramius/proxy-manager suggests installing zendframework/zend-soap (To have the Soap adapter (Remote Object feature))
21-Apr-2017 12:46:23 ocramius/proxy-manager suggests installing zendframework/zend-stdlib (To use the hydrator proxy)
21-Apr-2017 12:46:23 ocramius/proxy-manager suggests installing zendframework/zend-xmlrpc (To have the XmlRpc adapter (Remote Object feature))
21-Apr-2017 12:46:23 symfony/routing suggests installing doctrine/annotations (For using the annotation loader)
21-Apr-2017 12:46:23 symfony/routing suggests installing symfony/expression-language (For using expression matching)
21-Apr-2017 12:46:23 symfony/twig-bridge suggests installing symfony/asset (For using the AssetExtension)
21-Apr-2017 12:46:23 symfony/twig-bridge suggests installing symfony/expression-language (For using the ExpressionExtension)
21-Apr-2017 12:46:23 symfony/twig-bridge suggests installing symfony/form (For using the FormExtension)
21-Apr-2017 12:46:23 symfony/twig-bridge suggests installing symfony/security (For using the SecurityExtension)
21-Apr-2017 12:46:23 symfony/twig-bridge suggests installing symfony/stopwatch (For using the StopwatchExtension)
21-Apr-2017 12:46:23 symfony/twig-bridge suggests installing symfony/templating (For using the TwigEngine)
21-Apr-2017 12:46:23 symfony/twig-bridge suggests installing symfony/translation (For using the TranslationExtension)
21-Apr-2017 12:46:23 symfony/twig-bridge suggests installing symfony/var-dumper (For using the DumpExtension)
21-Apr-2017 12:46:23 facebook/webdriver suggests installing phpdocumentor/phpdocumentor (2.*)
21-Apr-2017 12:46:23 phpdocumentor/reflection-docblock suggests installing dflydev/markdown (~1.0)
21-Apr-2017 12:46:23 phpdocumentor/reflection-docblock suggests installing erusev/parsedown (~1.0)
21-Apr-2017 12:46:23 sebastian/global-state suggests installing ext-uopz (*)
21-Apr-2017 12:46:23 phpunit/phpunit-mock-objects suggests installing ext-soap (*)
21-Apr-2017 12:46:23 phpunit/phpunit suggests installing phpunit/php-invoker (~1.1)
21-Apr-2017 12:46:23 Generating autoload files
21-Apr-2017 12:46:24 Buildfile: /data/build/build.xml
21-Apr-2017 12:46:24
21-Apr-2017 12:46:24 phpBB > clean:
21-Apr-2017 12:46:24
21-Apr-2017 12:46:24    [delete] Directory /data/build/logs does not exist or is not a directory.
21-Apr-2017 12:46:24    [delete] Directory /data/build/api does not exist or is not a directory.
21-Apr-2017 12:46:24    [delete] Directory /data/build/codebrowser does not exist or is not a directory.
21-Apr-2017 12:46:24    [delete] Directory /data/build/coverage does not exist or is not a directory.
21-Apr-2017 12:46:24    [delete] Directory /data/build/cpd does not exist or is not a directory.
21-Apr-2017 12:46:24    [delete] Directory /data/build/dependencies does not exist or is not a directory.
21-Apr-2017 12:46:24    [delete] Directory /data/build/new_version does not exist or is not a directory.
21-Apr-2017 12:46:24    [delete] Directory /data/build/old_versions does not exist or is not a directory.
21-Apr-2017 12:46:24    [delete] Directory /data/build/save does not exist or is not a directory.
21-Apr-2017 12:46:24
21-Apr-2017 12:46:24 phpBB > prepare:
21-Apr-2017 12:46:24
21-Apr-2017 12:46:24     [mkdir] Created dir: /data/build/logs
21-Apr-2017 12:46:24     [mkdir] Created dir: /data/build/api
21-Apr-2017 12:46:24     [mkdir] Created dir: /data/build/codebrowser
21-Apr-2017 12:46:24     [mkdir] Created dir: /data/build/coverage
21-Apr-2017 12:46:24     [mkdir] Created dir: /data/build/cpd
21-Apr-2017 12:46:24     [mkdir] Created dir: /data/build/dependencies
21-Apr-2017 12:46:24     [mkdir] Created dir: /data/build/new_version
21-Apr-2017 12:46:24     [mkdir] Created dir: /data/build/new_version/files
21-Apr-2017 12:46:24     [mkdir] Created dir: /data/build/new_version/patches
21-Apr-2017 12:46:24     [mkdir] Created dir: /data/build/new_version/release_files
21-Apr-2017 12:46:24     [mkdir] Created dir: /data/build/new_version/update
21-Apr-2017 12:46:24     [mkdir] Created dir: /data/build/old_versions
21-Apr-2017 12:46:24     [mkdir] Created dir: /data/build/save
21-Apr-2017 12:46:24
21-Apr-2017 12:46:24 BUILD FINISHED
21-Apr-2017 12:46:24
21-Apr-2017 12:46:24 Total time: 0.1146 seconds
21-Apr-2017 12:46:24
21-Apr-2017 12:46:24 Finished task 'Prepare directory' with result: Success
21-Apr-2017 12:46:24 Skipping execution of task 'Run sniffs' as it is disabled
21-Apr-2017 12:46:24
Substituting variable: ${bamboo.working.directory} with /home/bamboo/xml-data/build-dir/PHPBB3-PR-JOB1
21-Apr-2017 12:46:24 Starting task 'Run sniffs' of type 'com.atlassian.bamboo.plugins.bamboo-docker-plugin:task.docker.cli'
21-Apr-2017 12:46:24 Running image name (phpbb:php-5.6)
21-Apr-2017 12:46:24
Beginning to execute external process for build 'phpBB3 - Pull Requests - Build and Test Job #7040 (PHPBB3-PR-JOB1-7040)'
... running command line:
/usr/bin/docker run --volume /home/bamboo/xml-data/build-dir/PHPBB3-PR-JOB1:/data --workdir /data/build --rm -u=991 phpbb:php-5.6 ../phpBB/vendor/bin/phing sniff
... in: /home/bamboo/xml-data/build-dir/PHPBB3-PR-JOB1
... using extra environment variables:
bamboo_planRepository_1_branch=3.1.x
bamboo_planRepository_1_branchDisplayName=3.1.x
bamboo_repository_revision_number=ff22d54eae45a79f5bc59d2c04f3e02eed8e4981
bamboo_PRref=master
bamboo_resultsUrl=https://bamboo.phpbb.com/browse/PHPBB3-PR-JOB1-7040
bamboo_capability_system_builder_command_Git=/usr/bin/git
bamboo_repository_75956235_git_username=bantu
bamboo_planRepository_1_name=phpBB Ascraeus
bamboo_build_working_directory=/home/bamboo/xml-data/build-dir/PHPBB3-PR-JOB1
bamboo_buildKey=PHPBB3-PR-JOB1
bamboo_capability_phpbb_tests=true
bamboo_shortPlanName=Pull Requests
bamboo_capability_system_builder_command_fop=/usr/bin/fop
bamboo_capability_dbms_sqlite_2=true
bamboo_planRepository_name=phpBB Ascraeus
bamboo_PRnumber=4787
bamboo_buildNumber=7040
bamboo_repository_75956235_git_repositoryUrl=https://github.com/phpbb/phpbb.git
bamboo_capability_system_builder_phpunit_PHPUnit=/usr/bin/phpunit
bamboo_shortJobName=Build and Test Job
bamboo_buildResultsUrl=https://bamboo.phpbb.com/browse/PHPBB3-PR-JOB1-7040
bamboo_repository_75956235_branch_name=3.1.x
bamboo_planRepository_repositoryUrl=https://github.com/phpbb/phpbb.git
bamboo_agentId=131073
bamboo_planName=phpBB3 - Pull Requests
bamboo_build_commandline_com_atlassian_bamboo_plugins_scripttask_task_builder_script_7=/bin/sh /home/bamboo/temp/PHPBB3-PR-JOB1-7040-ScriptBuildTask-7131800239093482533.sh
bamboo_shortPlanKey=PR
bamboo_shortJobKey=JOB1
bamboo_capability_dbms_mysql_55=true
bamboo_capability_system_jdk_JDK_1_7_0_65=/usr/lib/jvm/java-7-openjdk-amd64
bamboo_planRepository_revision=ff22d54eae45a79f5bc59d2c04f3e02eed8e4981
bamboo_repository_previous_revision_number=ff22d54eae45a79f5bc59d2c04f3e02eed8e4981
bamboo_buildTimeStamp=2017-04-21T12:45:05.310Z
bamboo_planRepository_previousRevision=ff22d54eae45a79f5bc59d2c04f3e02eed8e4981
bamboo_capability_system_builder_mvn2_Maven_2=/usr/share/maven2
bamboo_capability_system_jdk_JDK_1_6_0_16=/usr/lib/jvm/java-6-sun-1.6.0.16
bamboo_build_commandline_com_atlassian_bamboo_plugins_scripttask_task_builder_script_4=/bin/sh /home/bamboo/temp/PHPBB3-PR-JOB1-7040-ScriptBuildTask-1291798601734097287.sh
bamboo_buildResultKey=PHPBB3-PR-JOB1-7040
bamboo_repository_git_branch=3.1.x
bamboo_repository_branch_name=3.1.x
bamboo_buildPlanName=phpBB3 - Pull Requests - Build and Test Job
bamboo_planRepository_1_revision=ff22d54eae45a79f5bc59d2c04f3e02eed8e4981
bamboo_repository_name=phpBB Ascraeus
bamboo_capability_system_docker_executable=/usr/bin/docker
bamboo_build_commandline_com_atlassian_bamboo_plugins_bamboo_docker_plugin_task_docker_cli_12=/usr/bin/docker run --volume /home/bamboo/xml-data/build-dir/PHPBB3-PR-JOB1:/data --workdir /data/phpBB --rm -e HOME=/home/bamboo -u=991 phpbb:php-5.6 /bin/bash -c php ../composer.phar install --dev; cd ../build; ../phpBB/vendor/bin/phing clean prepare
bamboo_planRepository_branch=3.1.x
bamboo_agentWorkingDirectory=/home/bamboo/xml-data/build-dir
bamboo_capability_system_git_executable=/usr/bin/git
bamboo_planRepository_1_previousRevision=ff22d54eae45a79f5bc59d2c04f3e02eed8e4981
bamboo_capability_system_builder_phpunit_PHPUnit_3_4=/usr/bin/phpunit
bamboo_repository_git_username=bantu
bamboo_repository_75956235_revision_number=ff22d54eae45a79f5bc59d2c04f3e02eed8e4981
bamboo_planRepository_branchDisplayName=3.1.x
bamboo_planRepository_1_type=gitv2
bamboo_planRepository_branchName=3.1.x
bamboo_repository_75956235_previous_revision_number=ff22d54eae45a79f5bc59d2c04f3e02eed8e4981
bamboo_capability_system_jdk_JDK=/usr/lib/jvm/java-6-sun
bamboo_plan_storageTag=PHPBB3-PR
bamboo_planRepository_type=gitv2
bamboo_planRepository_1_username=bantu
bamboo_ManualBuildTriggerReason_userName=Build Robot
bamboo_repository_git_repositoryUrl=https://github.com/phpbb/phpbb.git
bamboo_repository_75956235_git_branch=3.1.x
bamboo_capability_system_builder_ant_Ant=/usr/share/ant
bamboo_repository_75956235_name=phpBB Ascraeus
bamboo_working_directory=/home/bamboo/xml-data/build-dir/PHPBB3-PR-JOB1
bamboo_planKey=PHPBB3-PR
bamboo_planRepository_1_repositoryUrl=https://github.com/phpbb/phpbb.git
bamboo_planRepository_username=bantu
bamboo_capability_local=true
bamboo_capability_system_jdk_JDK_1_6=/usr/lib/jvm/java-6-sun
bamboo_capability_system_jdk_JDK_1_7=/usr/lib/jvm/java-7-openjdk-amd64
bamboo_planRepository_1_branchName=3.1.x
21-Apr-2017 12:46:24 Buildfile: /data/build/build.xml
21-Apr-2017 12:46:25
21-Apr-2017 12:46:25 phpBB > sniff:
21-Apr-2017 12:46:25
21-Apr-2017 12:46:32 ............................................................  60 / 677 (9%)
21-Apr-2017 12:46:34 ............................................................ 120 / 677 (18%)
21-Apr-2017 12:46:35 ............................................................ 180 / 677 (27%)
21-Apr-2017 12:46:36 ............................................................ 240 / 677 (35%)
21-Apr-2017 12:46:42 ............................................................ 300 / 677 (44%)
21-Apr-2017 12:46:46 ............................................................ 360 / 677 (53%)
21-Apr-2017 12:46:52 ............................................................ 420 / 677 (62%)
21-Apr-2017 12:46:55 ............................................................ 480 / 677 (71%)
21-Apr-2017 12:46:59 ............................................................ 540 / 677 (80%)
21-Apr-2017 12:47:04 ............................................................ 600 / 677 (89%)
21-Apr-2017 12:47:06 ............................................................ 660 / 677 (97%)
21-Apr-2017 12:47:07 .................
21-Apr-2017 12:47:07
21-Apr-2017 12:47:07 Time: 42.27 secs; Memory: 76.75Mb
21-Apr-2017 12:47:07
21-Apr-2017 12:47:15 ............................................................  60 / 206 (29%)
21-Apr-2017 12:47:34 ............................................................ 120 / 206 (58%)
21-Apr-2017 12:47:49 ............................................................ 180 / 206 (87%)
21-Apr-2017 12:47:56 ..........................
21-Apr-2017 12:47:56
21-Apr-2017 12:47:56 Time: 48.52 secs; Memory: 60.5Mb
21-Apr-2017 12:47:56
21-Apr-2017 12:47:56
21-Apr-2017 12:47:56
21-Apr-2017 12:47:56 Time: 17ms; Memory: 3.75Mb
21-Apr-2017 12:47:56
21-Apr-2017 12:47:56
21-Apr-2017 12:47:56 BUILD FINISHED
21-Apr-2017 12:47:56
21-Apr-2017 12:47:56 Total time: 2 minutes  31.20 seconds
21-Apr-2017 12:47:56
21-Apr-2017 12:47:56 Finished task 'Run sniffs' with result: Success
21-Apr-2017 12:47:56 Skipping execution of task 'Run tests' as it is disabled
21-Apr-2017 12:47:56
Substituting variable: ${bamboo.working.directory} with /home/bamboo/xml-data/build-dir/PHPBB3-PR-JOB1
21-Apr-2017 12:47:56 Starting task 'Run tests' of type 'com.atlassian.bamboo.plugins.bamboo-docker-plugin:task.docker.cli'
21-Apr-2017 12:47:56 Running image name (phpbb:php-5.6)
21-Apr-2017 12:47:56
Beginning to execute external process for build 'phpBB3 - Pull Requests - Build and Test Job #7040 (PHPBB3-PR-JOB1-7040)'
... running command line:
/usr/bin/docker run --volume /home/bamboo/xml-data/build-dir/PHPBB3-PR-JOB1:/data --workdir /data --rm -u=991 phpbb:php-5.6 /bin/bash -c phpBB/vendor/bin/phpunit --log-junit build/logs/phpunit.xml
... in: /home/bamboo/xml-data/build-dir/PHPBB3-PR-JOB1
... using extra environment variables:
bamboo_planRepository_1_branch=3.1.x
bamboo_planRepository_1_branchDisplayName=3.1.x
bamboo_repository_revision_number=ff22d54eae45a79f5bc59d2c04f3e02eed8e4981
bamboo_PRref=master
bamboo_resultsUrl=https://bamboo.phpbb.com/browse/PHPBB3-PR-JOB1-7040
bamboo_capability_system_builder_command_Git=/usr/bin/git
bamboo_repository_75956235_git_username=bantu
bamboo_planRepository_1_name=phpBB Ascraeus
bamboo_build_working_directory=/home/bamboo/xml-data/build-dir/PHPBB3-PR-JOB1
bamboo_buildKey=PHPBB3-PR-JOB1
bamboo_capability_phpbb_tests=true
bamboo_shortPlanName=Pull Requests
bamboo_capability_system_builder_command_fop=/usr/bin/fop
bamboo_capability_dbms_sqlite_2=true
bamboo_planRepository_name=phpBB Ascraeus
bamboo_PRnumber=4787
bamboo_buildNumber=7040
bamboo_repository_75956235_git_repositoryUrl=https://github.com/phpbb/phpbb.git
bamboo_capability_system_builder_phpunit_PHPUnit=/usr/bin/phpunit
bamboo_shortJobName=Build and Test Job
bamboo_buildResultsUrl=https://bamboo.phpbb.com/browse/PHPBB3-PR-JOB1-7040
bamboo_repository_75956235_branch_name=3.1.x
bamboo_planRepository_repositoryUrl=https://github.com/phpbb/phpbb.git
bamboo_agentId=131073
bamboo_planName=phpBB3 - Pull Requests
bamboo_build_commandline_com_atlassian_bamboo_plugins_scripttask_task_builder_script_7=/bin/sh /home/bamboo/temp/PHPBB3-PR-JOB1-7040-ScriptBuildTask-7131800239093482533.sh
bamboo_shortPlanKey=PR
bamboo_shortJobKey=JOB1
bamboo_capability_dbms_mysql_55=true
bamboo_capability_system_jdk_JDK_1_7_0_65=/usr/lib/jvm/java-7-openjdk-amd64
bamboo_planRepository_revision=ff22d54eae45a79f5bc59d2c04f3e02eed8e4981
bamboo_repository_previous_revision_number=ff22d54eae45a79f5bc59d2c04f3e02eed8e4981
bamboo_buildTimeStamp=2017-04-21T12:45:05.310Z
bamboo_planRepository_previousRevision=ff22d54eae45a79f5bc59d2c04f3e02eed8e4981
bamboo_capability_system_builder_mvn2_Maven_2=/usr/share/maven2
bamboo_capability_system_jdk_JDK_1_6_0_16=/usr/lib/jvm/java-6-sun-1.6.0.16
bamboo_build_commandline_com_atlassian_bamboo_plugins_scripttask_task_builder_script_4=/bin/sh /home/bamboo/temp/PHPBB3-PR-JOB1-7040-ScriptBuildTask-1291798601734097287.sh
bamboo_buildResultKey=PHPBB3-PR-JOB1-7040
bamboo_repository_git_branch=3.1.x
bamboo_repository_branch_name=3.1.x
bamboo_buildPlanName=phpBB3 - Pull Requests - Build and Test Job
bamboo_planRepository_1_revision=ff22d54eae45a79f5bc59d2c04f3e02eed8e4981
bamboo_repository_name=phpBB Ascraeus
bamboo_capability_system_docker_executable=/usr/bin/docker
bamboo_build_commandline_com_atlassian_bamboo_plugins_bamboo_docker_plugin_task_docker_cli_11=/usr/bin/docker run --volume /home/bamboo/xml-data/build-dir/PHPBB3-PR-JOB1:/data --workdir /data/build --rm -u=991 phpbb:php-5.6 ../phpBB/vendor/bin/phing sniff
bamboo_build_commandline_com_atlassian_bamboo_plugins_bamboo_docker_plugin_task_docker_cli_12=/usr/bin/docker run --volume /home/bamboo/xml-data/build-dir/PHPBB3-PR-JOB1:/data --workdir /data/phpBB --rm -e HOME=/home/bamboo -u=991 phpbb:php-5.6 /bin/bash -c php ../composer.phar install --dev; cd ../build; ../phpBB/vendor/bin/phing clean prepare
bamboo_planRepository_branch=3.1.x
bamboo_agentWorkingDirectory=/home/bamboo/xml-data/build-dir
bamboo_capability_system_git_executable=/usr/bin/git
bamboo_planRepository_1_previousRevision=ff22d54eae45a79f5bc59d2c04f3e02eed8e4981
bamboo_capability_system_builder_phpunit_PHPUnit_3_4=/usr/bin/phpunit
bamboo_repository_git_username=bantu
bamboo_repository_75956235_revision_number=ff22d54eae45a79f5bc59d2c04f3e02eed8e4981
bamboo_planRepository_branchDisplayName=3.1.x
bamboo_planRepository_1_type=gitv2
bamboo_planRepository_branchName=3.1.x
bamboo_repository_75956235_previous_revision_number=ff22d54eae45a79f5bc59d2c04f3e02eed8e4981
bamboo_capability_system_jdk_JDK=/usr/lib/jvm/java-6-sun
bamboo_plan_storageTag=PHPBB3-PR
bamboo_planRepository_type=gitv2
bamboo_planRepository_1_username=bantu
bamboo_ManualBuildTriggerReason_userName=Build Robot
bamboo_repository_git_repositoryUrl=https://github.com/phpbb/phpbb.git
bamboo_repository_75956235_git_branch=3.1.x
bamboo_capability_system_builder_ant_Ant=/usr/share/ant
bamboo_repository_75956235_name=phpBB Ascraeus
bamboo_working_directory=/home/bamboo/xml-data/build-dir/PHPBB3-PR-JOB1
bamboo_planKey=PHPBB3-PR
bamboo_planRepository_1_repositoryUrl=https://github.com/phpbb/phpbb.git
bamboo_planRepository_username=bantu
bamboo_capability_local=true
bamboo_capability_system_jdk_JDK_1_6=/usr/lib/jvm/java-6-sun
bamboo_capability_system_jdk_JDK_1_7=/usr/lib/jvm/java-7-openjdk-amd64
bamboo_planRepository_1_branchName=3.1.x
21-Apr-2017 12:47:59 PHPUnit 4.8.31 by Sebastian Bergmann and contributors.
21-Apr-2017 12:47:59
21-Apr-2017 12:48:06 .............................................................   61 / 6861 (  0%)
21-Apr-2017 12:48:06 .............................................................  122 / 6861 (  1%)
21-Apr-2017 12:48:07 ....I.....SSSS............SSSS.........S...S.................  183 / 6861 (  2%)
21-Apr-2017 12:48:11 .....................................................S.......  244 / 6861 (  3%)
21-Apr-2017 12:48:11 stty: standard input: Inappropriate ioctl for device
21-Apr-2017 12:48:11 stty: standard input: Inappropriate ioctl for device
21-Apr-2017 12:48:11 stty: standard input: Inappropriate ioctl for device
21-Apr-2017 12:48:11 stty: standard input: Inappropriate ioctl for device
21-Apr-2017 12:48:18 .....F.......................................................  305 / 6861 (  4%)
21-Apr-2017 12:48:18 .............................................................  366 / 6861 (  5%)
21-Apr-2017 12:48:19 .............................................................  427 / 6861 (  6%)
21-Apr-2017 12:48:19 .............................................................  488 / 6861 (  7%)
21-Apr-2017 12:48:20 .............................................................  549 / 6861 (  8%)
21-Apr-2017 12:48:21 .............................................................  610 / 6861 (  8%)
21-Apr-2017 12:48:22 .............................................................  671 / 6861 (  9%)
21-Apr-2017 12:48:22 .............................................................  732 / 6861 ( 10%)
21-Apr-2017 12:48:23 .............................................................  793 / 6861 ( 11%)
21-Apr-2017 12:48:24 .............................................................  854 / 6861 ( 12%)
21-Apr-2017 12:48:25 .............................................................  915 / 6861 ( 13%)
21-Apr-2017 12:48:25 .............................................................  976 / 6861 ( 14%)
21-Apr-2017 12:48:27 ............................................................. 1037 / 6861 ( 15%)
21-Apr-2017 12:48:32 ...................................I......................... 1098 / 6861 ( 16%)
21-Apr-2017 12:48:37 ............................................................. 1159 / 6861 ( 16%)
21-Apr-2017 12:48:40 ............................................................. 1220 / 6861 ( 17%)
21-Apr-2017 12:48:41 ..S.S.S...................................................... 1281 / 6861 ( 18%)
21-Apr-2017 12:48:41 ............................................................. 1342 / 6861 ( 19%)
21-Apr-2017 12:48:41 ............................................................. 1403 / 6861 ( 20%)
21-Apr-2017 12:48:42 ............................................................. 1464 / 6861 ( 21%)
21-Apr-2017 12:48:42 ............................................................. 1525 / 6861 ( 22%)
21-Apr-2017 12:48:42 ............................................................. 1586 / 6861 ( 23%)
21-Apr-2017 12:48:42 ............................................................. 1647 / 6861 ( 24%)
21-Apr-2017 12:48:42 ............................................................. 1708 / 6861 ( 24%)
21-Apr-2017 12:48:42 ............................................................. 1769 / 6861 ( 25%)
21-Apr-2017 12:48:43 ............................................................. 1830 / 6861 ( 26%)
21-Apr-2017 12:48:43 ............................................................. 1891 / 6861 ( 27%)
21-Apr-2017 12:48:43 ............................................................. 1952 / 6861 ( 28%)
21-Apr-2017 12:48:43 ............................................................. 2013 / 6861 ( 29%)
21-Apr-2017 12:48:44 ............................................................. 2074 / 6861 ( 30%)
21-Apr-2017 12:48:45 .................................E.................E......... 2135 / 6861 ( 31%)
21-Apr-2017 12:48:46 ............................................................. 2196 / 6861 ( 32%)
21-Apr-2017 12:48:46 ............................................................. 2257 / 6861 ( 32%)
21-Apr-2017 12:48:48 ...........................................I.II.............. 2318 / 6861 ( 33%)
21-Apr-2017 12:48:50 ............................................................. 2379 / 6861 ( 34%)
21-Apr-2017 12:48:50 ............................................................. 2440 / 6861 ( 35%)
21-Apr-2017 12:48:50 ............................................................. 2501 / 6861 ( 36%)
21-Apr-2017 12:48:53 ............................................................. 2562 / 6861 ( 37%)
21-Apr-2017 12:48:53 ............................................................. 2623 / 6861 ( 38%)
21-Apr-2017 12:48:54 ............................................................. 2684 / 6861 ( 39%)
21-Apr-2017 12:48:55 ..................SSSSSSSSS.................................. 2745 / 6861 ( 40%)
21-Apr-2017 12:48:56 ............................................................. 2806 / 6861 ( 40%)
21-Apr-2017 12:49:07 ............................................................. 2867 / 6861 ( 41%)
21-Apr-2017 12:49:10 .......................................................S..... 2928 / 6861 ( 42%)
21-Apr-2017 12:49:13 ............................................................. 2989 / 6861 ( 43%)
21-Apr-2017 12:49:20 ............................................................. 3050 / 6861 ( 44%)
21-Apr-2017 12:49:23 ............................................................. 3111 / 6861 ( 45%)
21-Apr-2017 12:49:38 ............................................................. 3172 / 6861 ( 46%)
21-Apr-2017 12:49:38 ............................................................. 3233 / 6861 ( 47%)
21-Apr-2017 12:49:39 ............................................................. 3294 / 6861 ( 48%)
21-Apr-2017 12:49:39 ............................................................. 3355 / 6861 ( 48%)
21-Apr-2017 12:49:40 ............................................................. 3416 / 6861 ( 49%)
21-Apr-2017 12:49:40 ............................................................. 3477 / 6861 ( 50%)
21-Apr-2017 12:49:40 ............................................................. 3538 / 6861 ( 51%)
21-Apr-2017 12:49:40 ............................................................. 3599 / 6861 ( 52%)
21-Apr-2017 12:49:40 ............................................................. 3660 / 6861 ( 53%)
21-Apr-2017 12:49:42 ............................................................. 3721 / 6861 ( 54%)
21-Apr-2017 12:49:44 ............................................................. 3782 / 6861 ( 55%)
21-Apr-2017 12:49:47 ............................................................. 3843 / 6861 ( 56%)
21-Apr-2017 12:49:48 ............................................................. 3904 / 6861 ( 56%)
21-Apr-2017 12:49:50 ............................................................. 3965 / 6861 ( 57%)
21-Apr-2017 12:49:52 ............................................................. 4026 / 6861 ( 58%)
21-Apr-2017 12:50:00 ............................................................. 4087 / 6861 ( 59%)
21-Apr-2017 12:50:00 ............................................................. 4148 / 6861 ( 60%)
21-Apr-2017 12:50:01 ............................................................. 4209 / 6861 ( 61%)
21-Apr-2017 12:50:01 ............................................................. 4270 / 6861 ( 62%)
21-Apr-2017 12:50:02 ............................................................. 4331 / 6861 ( 63%)
21-Apr-2017 12:50:02 ............................................................. 4392 / 6861 ( 64%)
21-Apr-2017 12:50:02 ............................................................. 4453 / 6861 ( 64%)
21-Apr-2017 12:50:02 ............................................................. 4514 / 6861 ( 65%)
21-Apr-2017 12:50:02 ............................................................. 4575 / 6861 ( 66%)
21-Apr-2017 12:50:02 ............................................................. 4636 / 6861 ( 67%)
21-Apr-2017 12:50:03 ............................................................. 4697 / 6861 ( 68%)
21-Apr-2017 12:50:16 ............................................................. 4758 / 6861 ( 69%)
21-Apr-2017 12:50:24 ....S........................................................ 4819 / 6861 ( 70%)
21-Apr-2017 12:50:32 ............................................................. 4880 / 6861 ( 71%)
21-Apr-2017 12:50:36 ............................................................. 4941 / 6861 ( 72%)
21-Apr-2017 12:50:37 ............................................................. 5002 / 6861 ( 72%)
21-Apr-2017 12:50:38 ............................................................. 5063 / 6861 ( 73%)
21-Apr-2017 12:50:38 .........................................................SSSS 5124 / 6861 ( 74%)
21-Apr-2017 12:50:38 SSSSSSSSSSSSSSSSSSSSSSSSSSSSSSSSSSSSSSSSSSSSSSSSSSSSSSSSSSSSS 5185 / 6861 ( 75%)
21-Apr-2017 12:50:38 SSSSSSSSSSSSSSSSSSSSSSSSSSSSSSSSSSSSSSSSSSSSSSSSSSSSSSSSSSSSS 5246 / 6861 ( 76%)
21-Apr-2017 12:50:38 SSSSSSSSSSSSSSSSSSSSSSSSSSSSSSSSSSSSSSSSSSSSSSSSSSSSSSSSSSSSS 5307 / 6861 ( 77%)
21-Apr-2017 12:50:38 SSSSSSSSSSSSSSSSSSSSSSSSSSSSSSSSSSSSSSSSSSSSSSSSSSSSSSSSSSSSS 5368 / 6861 ( 78%)
21-Apr-2017 12:50:40 SSSSSSSSSSSSS................................................ 5429 / 6861 ( 79%)
21-Apr-2017 12:50:42 ............................................................. 5490 / 6861 ( 80%)
21-Apr-2017 12:50:44 ............................................................. 5551 / 6861 ( 80%)
21-Apr-2017 12:50:46 ............................................................. 5612 / 6861 ( 81%)
21-Apr-2017 12:50:48 ............................................................. 5673 / 6861 ( 82%)
21-Apr-2017 12:50:49 ............................................................. 5734 / 6861 ( 83%)
21-Apr-2017 12:50:51 ............................................................. 5795 / 6861 ( 84%)
21-Apr-2017 12:50:53 ............................................................. 5856 / 6861 ( 85%)
21-Apr-2017 12:50:55 ............................................................. 5917 / 6861 ( 86%)
21-Apr-2017 12:50:57 ............................................................. 5978 / 6861 ( 87%)
21-Apr-2017 12:50:59 ............................................................. 6039 / 6861 ( 88%)
21-Apr-2017 12:51:01 ............................................................. 6100 / 6861 ( 88%)
21-Apr-2017 12:51:03 ............................................................. 6161 / 6861 ( 89%)
21-Apr-2017 12:51:04 ............................................................. 6222 / 6861 ( 90%)
21-Apr-2017 12:51:06 ............................................................. 6283 / 6861 ( 91%)
21-Apr-2017 12:51:08 ............................................................. 6344 / 6861 ( 92%)
21-Apr-2017 12:51:10 ............................................................. 6405 / 6861 ( 93%)
21-Apr-2017 12:51:12 ............................................................. 6466 / 6861 ( 94%)
21-Apr-2017 12:51:13 ............................................................. 6527 / 6861 ( 95%)
21-Apr-2017 12:51:15 ............................................................. 6588 / 6861 ( 96%)
21-Apr-2017 12:51:17 ............................................................. 6649 / 6861 ( 96%)
21-Apr-2017 12:51:19 ............................................................. 6710 / 6861 ( 97%)
21-Apr-2017 12:51:21 ............................................................. 6771 / 6861 ( 98%)
21-Apr-2017 12:51:23 ............................................................. 6832 / 6861 ( 99%)
21-Apr-2017 12:51:24 ...........................SS
21-Apr-2017 12:51:24
21-Apr-2017 12:51:24 Time: 3.45 minutes, Memory: 419.25MB
21-Apr-2017 12:51:24
21-Apr-2017 12:51:24 There were 2 errors:
21-Apr-2017 12:51:24
21-Apr-2017 12:51:24 1) phpbb_event_md_exporter_test::test_crawl_template_file with data set #135 ('styles', 'styles/prosilver/template/smi...n.html')
21-Apr-2017 12:51:24 LogicException: File 'styles/prosilver/template/smiley_dropdown.html' should not contain events, but contains: 'posting_editor_smilies_before', 'posting_editor_smilies_after', 'posting_editor_bbcode_status_after'
21-Apr-2017 12:51:24
21-Apr-2017 12:51:24 /data/phpBB/phpbb/event/md_exporter.php:471
21-Apr-2017 12:51:24 /data/tests/event/md_exporter_test.php:150
21-Apr-2017 12:51:24
21-Apr-2017 12:51:24 2) phpbb_event_md_exporter_test::test_crawl_template_file with data set #153 ('styles', 'styles/prosilver/template/pos...r.html')
21-Apr-2017 12:51:24 LogicException: File 'styles/prosilver/template/posting_editor.html' does not contain events: 'posting_editor_bbcode_status_after', 'posting_editor_smilies_after', 'posting_editor_smilies_before'
21-Apr-2017 12:51:24
21-Apr-2017 12:51:24 /data/phpBB/phpbb/event/md_exporter.php:493
21-Apr-2017 12:51:24 /data/tests/event/md_exporter_test.php:150
21-Apr-2017 12:51:24
21-Apr-2017 12:51:24 --
21-Apr-2017 12:51:24
21-Apr-2017 12:51:24 There was 1 failure:
21-Apr-2017 12:51:24
21-Apr-2017 12:51:24 1) phpbb_console_user_add_test::test_add_dialog
21-Apr-2017 12:51:24 Failed asserting that null is not equal to null.
21-Apr-2017 12:51:24
21-Apr-2017 12:51:24 /data/tests/console/user/add_test.php:70
21-Apr-2017 12:51:24
21-Apr-2017 12:51:24 FAILURES!
21-Apr-2017 12:51:24 Tests: 9143, Assertions: 60238, Errors: 2, Failures: 1, Skipped: 288, Incomplete: 5.
21-Apr-2017 12:51:25 Failing task since return code of [/usr/bin/docker run --volume /home/bamboo/xml-data/build-dir/PHPBB3-PR-JOB1:/data --workdir /data --rm -u=991 phpbb:php-5.6 /bin/bash -c phpBB/vendor/bin/phpunit --log-junit build/logs/phpunit.xml] was 2 while expected 0
21-Apr-2017 12:51:25 Error occurred while running Task 'Run tests(10)' of type com.atlassian.bamboo.plugins.bamboo-docker-plugin:task.docker.cli.
21-Apr-2017 12:51:25 com.atlassian.bamboo.task.TaskException: Failed to execute task
21-Apr-2017 12:51:25         at com.atlassian.bamboo.plugins.docker.service.RunService.execute(RunService.java:71)
21-Apr-2017 12:51:25         at com.atlassian.bamboo.plugins.docker.tasks.cli.DockerCliTask.execute(DockerCliTask.java:60)
21-Apr-2017 12:51:25         at com.atlassian.bamboo.task.TaskExecutorImpl.lambda$executeTasks$3(TaskExecutorImpl.java:317)
21-Apr-2017 12:51:25         at com.atlassian.bamboo.task.TaskExecutorImpl.executeTaskWithPrePostActions(TaskExecutorImpl.java:246)
21-Apr-2017 12:51:25         at com.atlassian.bamboo.task.TaskExecutorImpl.executeTasks(TaskExecutorImpl.java:317)
21-Apr-2017 12:51:25         at com.atlassian.bamboo.task.TaskExecutorImpl.execute(TaskExecutorImpl.java:118)
21-Apr-2017 12:51:25         at com.atlassian.bamboo.build.pipeline.tasks.ExecuteBuildTask.call(ExecuteBuildTask.java:74)
21-Apr-2017 12:51:25         at com.atlassian.bamboo.v2.build.agent.DefaultBuildAgent.build(DefaultBuildAgent.java:216)
21-Apr-2017 12:51:25         at com.atlassian.bamboo.v2.build.agent.BuildAgentControllerImpl$1.call(BuildAgentControllerImpl.java:139)
21-Apr-2017 12:51:25         at com.atlassian.bamboo.v2.build.agent.BuildAgentControllerImpl$1.call(BuildAgentControllerImpl.java:130)
21-Apr-2017 12:51:25         at com.atlassian.bamboo.variable.CustomVariableContextImpl.withVariableSubstitutor(CustomVariableContextImpl.java:221)
21-Apr-2017 12:51:25         at com.atlassian.bamboo.v2.build.agent.BuildAgentControllerImpl.waitAndPerformBuild(BuildAgentControllerImpl.java:129)
21-Apr-2017 12:51:25         at com.atlassian.bamboo.v2.build.agent.DefaultBuildAgent$1.run(DefaultBuildAgent.java:138)
21-Apr-2017 12:51:25         at com.atlassian.bamboo.utils.BambooRunnables$1.run(BambooRunnables.java:51)
21-Apr-2017 12:51:25         at com.atlassian.bamboo.security.ImpersonationHelper.runWith(ImpersonationHelper.java:31)
21-Apr-2017 12:51:25         at com.atlassian.bamboo.security.ImpersonationHelper.runWithSystemAuthority(ImpersonationHelper.java:20)
21-Apr-2017 12:51:25         at com.atlassian.bamboo.security.ImpersonationHelper$1.run(ImpersonationHelper.java:52)
21-Apr-2017 12:51:25         at java.lang.Thread.run(Thread.java:745)
21-Apr-2017 12:51:25 Caused by: com.atlassian.bamboo.plugins.docker.client.DockerException: Error running Docker run command
21-Apr-2017 12:51:25         at com.atlassian.bamboo.plugins.docker.client.DockerCmd.run(DockerCmd.java:103)
21-Apr-2017 12:51:25         at com.atlassian.bamboo.plugins.docker.service.RunService.execute(RunService.java:60)
21-Apr-2017 12:51:25         ... 17 more
21-Apr-2017 12:51:25 Caused by: com.atlassian.utils.process.ProcessException: Error executing /usr/bin/docker run --volume /home/bamboo/xml-data/build-dir/PHPBB3-PR-JOB1:/data --workdir /data --rm -u=991 phpbb:php-5.6 /bin/bash -c "phpBB/vendor/bin/phpunit --log-junit build/logs/phpunit.xml"
21-Apr-2017 12:51:25         at com.atlassian.bamboo.plugins.docker.process.DockerTaskProcessService.execute(DockerTaskProcessService.java:60)
21-Apr-2017 12:51:25         at com.atlassian.bamboo.plugins.docker.client.DockerCmd.run(DockerCmd.java:99)
21-Apr-2017 12:51:25         ... 18 more
21-Apr-2017 12:51:25 Starting task 'Parsing test results produced by script' of type 'com.atlassian.bamboo.plugins.testresultparser:task.testresultparser.junit'
21-Apr-2017 12:51:25 Parsing test results under /home/bamboo/xml-data/build-dir/PHPBB3-PR-JOB1...
21-Apr-2017 12:51:25 Failing task since 3 failing test cases were found.
21-Apr-2017 12:51:25 Finished task 'Parsing test results produced by script' with result: Failed
21-Apr-2017 12:51:25
Substituting variable: ${bamboo.PRnumber} with 4787
21-Apr-2017 12:51:25
Substituting variable: ${bamboo.buildResultsUrl} with https://bamboo.phpbb.com/browse/PHPBB3-PR-JOB1-7040
21-Apr-2017 12:51:25
Substituting variable: ${bamboo.buildResultsUrl} with https://bamboo.phpbb.com/browse/PHPBB3-PR-JOB1-7040
21-Apr-2017 12:51:25 Starting task 'Set result build status' of type 'com.atlassian.bamboo.plugins.scripttask:task.builder.script'
21-Apr-2017 12:51:25
Beginning to execute external process for build 'phpBB3 - Pull Requests - Build and Test Job #7040 (PHPBB3-PR-JOB1-7040)'
... running command line:
/bin/sh /home/bamboo/temp/PHPBB3-PR-JOB1-7040-ScriptBuildTask-5338425884535406904.sh
... in: /home/bamboo/xml-data/build-dir/PHPBB3-PR-JOB1
... using extra environment variables:
bamboo_planRepository_1_branch=3.1.x
bamboo_planRepository_1_branchDisplayName=3.1.x
bamboo_repository_revision_number=ff22d54eae45a79f5bc59d2c04f3e02eed8e4981
bamboo_PRref=master
bamboo_resultsUrl=https://bamboo.phpbb.com/browse/PHPBB3-PR-JOB1-7040
bamboo_capability_system_builder_command_Git=/usr/bin/git
bamboo_repository_75956235_git_username=bantu
bamboo_planRepository_1_name=phpBB Ascraeus
bamboo_build_working_directory=/home/bamboo/xml-data/build-dir/PHPBB3-PR-JOB1
bamboo_buildKey=PHPBB3-PR-JOB1
bamboo_capability_phpbb_tests=true
bamboo_shortPlanName=Pull Requests
bamboo_capability_system_builder_command_fop=/usr/bin/fop
bamboo_capability_dbms_sqlite_2=true
bamboo_planRepository_name=phpBB Ascraeus
bamboo_PRnumber=4787
bamboo_buildNumber=7040
bamboo_repository_75956235_git_repositoryUrl=https://github.com/phpbb/phpbb.git
bamboo_capability_system_builder_phpunit_PHPUnit=/usr/bin/phpunit
bamboo_shortJobName=Build and Test Job
bamboo_buildResultsUrl=https://bamboo.phpbb.com/browse/PHPBB3-PR-JOB1-7040
bamboo_repository_75956235_branch_name=3.1.x
bamboo_planRepository_repositoryUrl=https://github.com/phpbb/phpbb.git
bamboo_agentId=131073
bamboo_planName=phpBB3 - Pull Requests
bamboo_build_commandline_com_atlassian_bamboo_plugins_scripttask_task_builder_script_7=/bin/sh /home/bamboo/temp/PHPBB3-PR-JOB1-7040-ScriptBuildTask-7131800239093482533.sh
bamboo_shortPlanKey=PR
bamboo_shortJobKey=JOB1
bamboo_capability_dbms_mysql_55=true
bamboo_capability_system_jdk_JDK_1_7_0_65=/usr/lib/jvm/java-7-openjdk-amd64
bamboo_planRepository_revision=ff22d54eae45a79f5bc59d2c04f3e02eed8e4981
bamboo_repository_previous_revision_number=ff22d54eae45a79f5bc59d2c04f3e02eed8e4981
bamboo_buildTimeStamp=2017-04-21T12:45:05.310Z
bamboo_planRepository_previousRevision=ff22d54eae45a79f5bc59d2c04f3e02eed8e4981
bamboo_capability_system_builder_mvn2_Maven_2=/usr/share/maven2
bamboo_capability_system_jdk_JDK_1_6_0_16=/usr/lib/jvm/java-6-sun-1.6.0.16
bamboo_build_commandline_com_atlassian_bamboo_plugins_scripttask_task_builder_script_4=/bin/sh /home/bamboo/temp/PHPBB3-PR-JOB1-7040-ScriptBuildTask-1291798601734097287.sh
bamboo_buildResultKey=PHPBB3-PR-JOB1-7040
bamboo_repository_git_branch=3.1.x
bamboo_repository_branch_name=3.1.x
bamboo_buildPlanName=phpBB3 - Pull Requests - Build and Test Job
bamboo_planRepository_1_revision=ff22d54eae45a79f5bc59d2c04f3e02eed8e4981
bamboo_repository_name=phpBB Ascraeus
bamboo_capability_system_docker_executable=/usr/bin/docker
bamboo_build_commandline_com_atlassian_bamboo_plugins_bamboo_docker_plugin_task_docker_cli_10=/usr/bin/docker run --volume /home/bamboo/xml-data/build-dir/PHPBB3-PR-JOB1:/data --workdir /data --rm -u=991 phpbb:php-5.6 /bin/bash -c phpBB/vendor/bin/phpunit --log-junit build/logs/phpunit.xml
bamboo_build_commandline_com_atlassian_bamboo_plugins_bamboo_docker_plugin_task_docker_cli_11=/usr/bin/docker run --volume /home/bamboo/xml-data/build-dir/PHPBB3-PR-JOB1:/data --workdir /data/build --rm -u=991 phpbb:php-5.6 ../phpBB/vendor/bin/phing sniff
bamboo_build_commandline_com_atlassian_bamboo_plugins_bamboo_docker_plugin_task_docker_cli_12=/usr/bin/docker run --volume /home/bamboo/xml-data/build-dir/PHPBB3-PR-JOB1:/data --workdir /data/phpBB --rm -e HOME=/home/bamboo -u=991 phpbb:php-5.6 /bin/bash -c php ../composer.phar install --dev; cd ../build; ../phpBB/vendor/bin/phing clean prepare
bamboo_planRepository_branch=3.1.x
bamboo_agentWorkingDirectory=/home/bamboo/xml-data/build-dir
bamboo_capability_system_git_executable=/usr/bin/git
bamboo_planRepository_1_previousRevision=ff22d54eae45a79f5bc59d2c04f3e02eed8e4981
bamboo_capability_system_builder_phpunit_PHPUnit_3_4=/usr/bin/phpunit
bamboo_repository_git_username=bantu
bamboo_repository_75956235_revision_number=ff22d54eae45a79f5bc59d2c04f3e02eed8e4981
bamboo_planRepository_branchDisplayName=3.1.x
bamboo_planRepository_1_type=gitv2
bamboo_planRepository_branchName=3.1.x
bamboo_repository_75956235_previous_revision_number=ff22d54eae45a79f5bc59d2c04f3e02eed8e4981
bamboo_capability_system_jdk_JDK=/usr/lib/jvm/java-6-sun
bamboo_plan_storageTag=PHPBB3-PR
bamboo_planRepository_type=gitv2
bamboo_planRepository_1_username=bantu
bamboo_ManualBuildTriggerReason_userName=Build Robot
bamboo_repository_git_repositoryUrl=https://github.com/phpbb/phpbb.git
bamboo_repository_75956235_git_branch=3.1.x
bamboo_capability_system_builder_ant_Ant=/usr/share/ant
bamboo_repository_75956235_name=phpBB Ascraeus
bamboo_working_directory=/home/bamboo/xml-data/build-dir/PHPBB3-PR-JOB1
bamboo_planKey=PHPBB3-PR
bamboo_planRepository_1_repositoryUrl=https://github.com/phpbb/phpbb.git
bamboo_planRepository_username=bantu
bamboo_capability_local=true
bamboo_capability_system_jdk_JDK_1_6=/usr/lib/jvm/java-6-sun
bamboo_capability_system_jdk_JDK_1_7=/usr/lib/jvm/java-7-openjdk-amd64
bamboo_planRepository_1_branchName=3.1.x
21-Apr-2017 12:51:25 From https://github.com/phpbb/phpbb
21-Apr-2017 12:51:25 * branch            refs/pull/4787/head -> FETCH_HEAD
21-Apr-2017 12:51:25   <testsuite name="" tests="6568" assertions="60235" failures="1" errors="2" time="196.350995">
21-Apr-2017 12:51:25     <testsuite name="phpBB Test Suite" tests="5090" assertions="58757" failures="1" errors="2" time="152.254660">
21-Apr-2017 12:51:25       <testsuite name="phpbb_console_user_add_test" file="/data/tests/console/user/add_test.php" tests="3" assertions="9" failures="1" errors="0" time="0.409148">
21-Apr-2017 12:51:25   % Total    % Received % Xferd  Average Speed   Time    Time     Time  Current
21-Apr-2017 12:51:25                                  Dload  Upload   Total   Spent    Left  Speed
21-Apr-2017 12:51:25
21-Apr-2017 12:51:26   0     0    0     0    0     0      0      0 --:--:-- --:--:-- --:--:--     0
21-Apr-2017 12:51:26   0     0    0     0    0     0      0      0 --:--:-- --:--:-- --:--:--     0
21-Apr-2017 12:51:26 100   267  100    93  100   174    128    241 --:--:-- --:--:-- --:--:--   240
21-Apr-2017 12:51:26 Finished task 'Set result build status' with result: Success
21-Apr-2017 12:51:26 Running post build plugin 'NCover Results Collector'
21-Apr-2017 12:51:26 Running post build plugin 'Artifact Copier'
21-Apr-2017 12:51:26 Running post build plugin 'npm Cache Cleanup'
21-Apr-2017 12:51:26 Running post build plugin 'Clover Results Collector'
21-Apr-2017 12:51:26 Running post build plugin 'Docker Container Cleanup'
21-Apr-2017 12:51:26 Successfully removed working directory at '/home/bamboo/xml-data/build-dir/PHPBB3-PR-JOB1'
21-Apr-2017 12:51:26 Finalising the build...
21-Apr-2017 12:51:26 Stopping timer.
21-Apr-2017 12:51:26 Build PHPBB3-PR-JOB1-7040 completed.
21-Apr-2017 12:51:26 Running on server: post build plugin 'NCover Results Collector'
21-Apr-2017 12:51:26 Running on server: post build plugin 'Build Hanging Detection Configuration'
21-Apr-2017 12:51:26 Running on server: post build plugin 'Clover Delta Calculator'
21-Apr-2017 12:51:26 Running on server: post build plugin 'Maven Dependencies Postprocessor'
21-Apr-2017 12:51:26 All post build plugins have finished
21-Apr-2017 12:51:26 Generating build results summary...
21-Apr-2017 12:51:31 Saving build results to disk...
21-Apr-2017 12:51:31 Logging substituted variables...
21-Apr-2017 12:51:31 Indexing build results...
21-Apr-2017 12:51:31 Finished building PHPBB3-PR-JOB1-7040.
21-Apr-2017 12:51:31
Substituting variable: ${bamboo.PRnumber} with 4787