Tests pending pull requests

Build: #7043 failed

Job: Build and Test Job failed

Stages & jobs

  1. Build and Test

Build log

The build generated 453 lines of output. Download or view full build log

21-Apr-2017 21:43:28 Build phpBB3 - Pull Requests - Build and Test Job #7043 (PHPBB3-PR-JOB1-7043) started building on agent Default Agent
21-Apr-2017 21:43:28
21-Apr-2017 21:43:28 Build working directory is /home/bamboo/xml-data/build-dir/PHPBB3-PR-JOB1
21-Apr-2017 21:43:28 Executing build phpBB3 - Pull Requests - Build and Test Job #7043 (PHPBB3-PR-JOB1-7043)
21-Apr-2017 21:43:28 Starting task 'Checkout develop branch' of type 'com.atlassian.bamboo.plugins.vcs:task.vcs.checkout'
21-Apr-2017 21:43:28 Build always requires a clean checkout
21-Apr-2017 21:43:28 Cleaning build directory '/home/bamboo/xml-data/build-dir/PHPBB3-PR-JOB1'
21-Apr-2017 21:43:28 Updating source code to revision: ff22d54eae45a79f5bc59d2c04f3e02eed8e4981
21-Apr-2017 21:43:28 Fetching 'refs/heads/3.1.x' from 'https://github.com/phpbb/phpbb.git'.
21-Apr-2017 21:43:28 Checking out revision ff22d54eae45a79f5bc59d2c04f3e02eed8e4981.
21-Apr-2017 21:43:28 Creating local git repository in '/home/bamboo/xml-data/build-dir/PHPBB3-PR-JOB1/.git'.
21-Apr-2017 21:43:28 Cloning into '/home/bamboo/xml-data/build-dir/PHPBB3-PR-JOB1'...
21-Apr-2017 21:43:28 done.
21-Apr-2017 21:43:30 Branch 3.1.x set up to track remote branch 3.1.x from origin.
21-Apr-2017 21:43:30 Switched to a new branch '3.1.x'
21-Apr-2017 21:43:30 Updated source code to revision: ff22d54eae45a79f5bc59d2c04f3e02eed8e4981
21-Apr-2017 21:43:30 Finished task 'Checkout develop branch' with result: Success
21-Apr-2017 21:43:30 Running pre-build action: VCS Version Collector
21-Apr-2017 21:43:30
Substituting variable: ${bamboo.PRnumber} with 3909
21-Apr-2017 21:43:30
Substituting variable: ${bamboo.buildResultsUrl} with https://bamboo.phpbb.com/browse/PHPBB3-PR-JOB1-7043
21-Apr-2017 21:43:30 Starting task 'Set pending build status' of type 'com.atlassian.bamboo.plugins.scripttask:task.builder.script'
21-Apr-2017 21:43:30
Beginning to execute external process for build 'phpBB3 - Pull Requests - Build and Test Job #7043 (PHPBB3-PR-JOB1-7043)'
... running command line:
/bin/sh /home/bamboo/temp/PHPBB3-PR-JOB1-7043-ScriptBuildTask-7909767124295626700.sh
... in: /home/bamboo/xml-data/build-dir/PHPBB3-PR-JOB1
... using extra environment variables:
bamboo_planRepository_1_branch=3.1.x
bamboo_planRepository_1_branchDisplayName=3.1.x
bamboo_repository_revision_number=ff22d54eae45a79f5bc59d2c04f3e02eed8e4981
bamboo_PRref=master
bamboo_resultsUrl=https://bamboo.phpbb.com/browse/PHPBB3-PR-JOB1-7043
bamboo_capability_system_builder_command_Git=/usr/bin/git
bamboo_repository_75956235_git_username=bantu
bamboo_planRepository_1_name=phpBB Ascraeus
bamboo_build_working_directory=/home/bamboo/xml-data/build-dir/PHPBB3-PR-JOB1
bamboo_buildKey=PHPBB3-PR-JOB1
bamboo_capability_phpbb_tests=true
bamboo_shortPlanName=Pull Requests
bamboo_capability_system_builder_command_fop=/usr/bin/fop
bamboo_capability_dbms_sqlite_2=true
bamboo_planRepository_name=phpBB Ascraeus
bamboo_PRnumber=3909
bamboo_buildNumber=7043
bamboo_repository_75956235_git_repositoryUrl=https://github.com/phpbb/phpbb.git
bamboo_capability_system_builder_phpunit_PHPUnit=/usr/bin/phpunit
bamboo_shortJobName=Build and Test Job
bamboo_buildResultsUrl=https://bamboo.phpbb.com/browse/PHPBB3-PR-JOB1-7043
bamboo_repository_75956235_branch_name=3.1.x
bamboo_planRepository_repositoryUrl=https://github.com/phpbb/phpbb.git
bamboo_agentId=131073
bamboo_planName=phpBB3 - Pull Requests
bamboo_shortPlanKey=PR
bamboo_shortJobKey=JOB1
bamboo_capability_dbms_mysql_55=true
bamboo_capability_system_jdk_JDK_1_7_0_65=/usr/lib/jvm/java-7-openjdk-amd64
bamboo_planRepository_revision=ff22d54eae45a79f5bc59d2c04f3e02eed8e4981
bamboo_repository_previous_revision_number=ff22d54eae45a79f5bc59d2c04f3e02eed8e4981
bamboo_buildTimeStamp=2017-04-21T21:43:28.299Z
bamboo_planRepository_previousRevision=ff22d54eae45a79f5bc59d2c04f3e02eed8e4981
bamboo_capability_system_builder_mvn2_Maven_2=/usr/share/maven2
bamboo_capability_system_jdk_JDK_1_6_0_16=/usr/lib/jvm/java-6-sun-1.6.0.16
bamboo_buildResultKey=PHPBB3-PR-JOB1-7043
bamboo_repository_git_branch=3.1.x
bamboo_repository_branch_name=3.1.x
bamboo_buildPlanName=phpBB3 - Pull Requests - Build and Test Job
bamboo_planRepository_1_revision=ff22d54eae45a79f5bc59d2c04f3e02eed8e4981
bamboo_repository_name=phpBB Ascraeus
bamboo_capability_system_docker_executable=/usr/bin/docker
bamboo_planRepository_branch=3.1.x
bamboo_agentWorkingDirectory=/home/bamboo/xml-data/build-dir
bamboo_capability_system_git_executable=/usr/bin/git
bamboo_planRepository_1_previousRevision=ff22d54eae45a79f5bc59d2c04f3e02eed8e4981
bamboo_capability_system_builder_phpunit_PHPUnit_3_4=/usr/bin/phpunit
bamboo_repository_git_username=bantu
bamboo_repository_75956235_revision_number=ff22d54eae45a79f5bc59d2c04f3e02eed8e4981
bamboo_planRepository_branchDisplayName=3.1.x
bamboo_planRepository_1_type=gitv2
bamboo_planRepository_branchName=3.1.x
bamboo_repository_75956235_previous_revision_number=ff22d54eae45a79f5bc59d2c04f3e02eed8e4981
bamboo_capability_system_jdk_JDK=/usr/lib/jvm/java-6-sun
bamboo_plan_storageTag=PHPBB3-PR
bamboo_planRepository_type=gitv2
bamboo_planRepository_1_username=bantu
bamboo_ManualBuildTriggerReason_userName=Build Robot
bamboo_repository_git_repositoryUrl=https://github.com/phpbb/phpbb.git
bamboo_repository_75956235_git_branch=3.1.x
bamboo_capability_system_builder_ant_Ant=/usr/share/ant
bamboo_repository_75956235_name=phpBB Ascraeus
bamboo_working_directory=/home/bamboo/xml-data/build-dir/PHPBB3-PR-JOB1
bamboo_planKey=PHPBB3-PR
bamboo_planRepository_1_repositoryUrl=https://github.com/phpbb/phpbb.git
bamboo_planRepository_username=bantu
bamboo_capability_local=true
bamboo_capability_system_jdk_JDK_1_6=/usr/lib/jvm/java-6-sun
bamboo_capability_system_jdk_JDK_1_7=/usr/lib/jvm/java-7-openjdk-amd64
bamboo_planRepository_1_branchName=3.1.x
21-Apr-2017 21:43:31 From https://github.com/phpbb/phpbb
21-Apr-2017 21:43:31 * branch            refs/pull/3909/head -> FETCH_HEAD
21-Apr-2017 21:43:31   % Total    % Received % Xferd  Average Speed   Time    Time     Time  Current
21-Apr-2017 21:43:31                                  Dload  Upload   Total   Spent    Left  Speed
21-Apr-2017 21:43:31
21-Apr-2017 21:43:31   0     0    0     0    0     0      0      0 --:--:-- --:--:-- --:--:--     0
21-Apr-2017 21:43:31 100   275  100    93  100   182    127    249 --:--:-- --:--:-- --:--:--   249
21-Apr-2017 21:43:31 Finished task 'Set pending build status' with result: Success
21-Apr-2017 21:43:31
Substituting variable: ${bamboo.PRnumber} with 3909
21-Apr-2017 21:43:31 Starting task 'Fetch PR' of type 'com.atlassian.bamboo.plugins.scripttask:task.builder.script'
21-Apr-2017 21:43:31
Beginning to execute external process for build 'phpBB3 - Pull Requests - Build and Test Job #7043 (PHPBB3-PR-JOB1-7043)'
... running command line:
/bin/sh /home/bamboo/temp/PHPBB3-PR-JOB1-7043-ScriptBuildTask-6326850728795392458.sh
... in: /home/bamboo/xml-data/build-dir/PHPBB3-PR-JOB1
... using extra environment variables:
bamboo_planRepository_1_branch=3.1.x
bamboo_planRepository_1_branchDisplayName=3.1.x
bamboo_repository_revision_number=ff22d54eae45a79f5bc59d2c04f3e02eed8e4981
bamboo_PRref=master
bamboo_resultsUrl=https://bamboo.phpbb.com/browse/PHPBB3-PR-JOB1-7043
bamboo_capability_system_builder_command_Git=/usr/bin/git
bamboo_repository_75956235_git_username=bantu
bamboo_planRepository_1_name=phpBB Ascraeus
bamboo_build_working_directory=/home/bamboo/xml-data/build-dir/PHPBB3-PR-JOB1
bamboo_buildKey=PHPBB3-PR-JOB1
bamboo_capability_phpbb_tests=true
bamboo_shortPlanName=Pull Requests
bamboo_capability_system_builder_command_fop=/usr/bin/fop
bamboo_capability_dbms_sqlite_2=true
bamboo_planRepository_name=phpBB Ascraeus
bamboo_PRnumber=3909
bamboo_buildNumber=7043
bamboo_repository_75956235_git_repositoryUrl=https://github.com/phpbb/phpbb.git
bamboo_capability_system_builder_phpunit_PHPUnit=/usr/bin/phpunit
bamboo_shortJobName=Build and Test Job
bamboo_buildResultsUrl=https://bamboo.phpbb.com/browse/PHPBB3-PR-JOB1-7043
bamboo_repository_75956235_branch_name=3.1.x
bamboo_planRepository_repositoryUrl=https://github.com/phpbb/phpbb.git
bamboo_agentId=131073
bamboo_planName=phpBB3 - Pull Requests
bamboo_build_commandline_com_atlassian_bamboo_plugins_scripttask_task_builder_script_7=/bin/sh /home/bamboo/temp/PHPBB3-PR-JOB1-7043-ScriptBuildTask-7909767124295626700.sh
bamboo_shortPlanKey=PR
bamboo_shortJobKey=JOB1
bamboo_capability_dbms_mysql_55=true
bamboo_capability_system_jdk_JDK_1_7_0_65=/usr/lib/jvm/java-7-openjdk-amd64
bamboo_planRepository_revision=ff22d54eae45a79f5bc59d2c04f3e02eed8e4981
bamboo_repository_previous_revision_number=ff22d54eae45a79f5bc59d2c04f3e02eed8e4981
bamboo_buildTimeStamp=2017-04-21T21:43:28.299Z
bamboo_planRepository_previousRevision=ff22d54eae45a79f5bc59d2c04f3e02eed8e4981
bamboo_capability_system_builder_mvn2_Maven_2=/usr/share/maven2
bamboo_capability_system_jdk_JDK_1_6_0_16=/usr/lib/jvm/java-6-sun-1.6.0.16
bamboo_buildResultKey=PHPBB3-PR-JOB1-7043
bamboo_repository_git_branch=3.1.x
bamboo_repository_branch_name=3.1.x
bamboo_buildPlanName=phpBB3 - Pull Requests - Build and Test Job
bamboo_planRepository_1_revision=ff22d54eae45a79f5bc59d2c04f3e02eed8e4981
bamboo_repository_name=phpBB Ascraeus
bamboo_capability_system_docker_executable=/usr/bin/docker
bamboo_planRepository_branch=3.1.x
bamboo_agentWorkingDirectory=/home/bamboo/xml-data/build-dir
bamboo_capability_system_git_executable=/usr/bin/git
bamboo_planRepository_1_previousRevision=ff22d54eae45a79f5bc59d2c04f3e02eed8e4981
bamboo_capability_system_builder_phpunit_PHPUnit_3_4=/usr/bin/phpunit
bamboo_repository_git_username=bantu
bamboo_repository_75956235_revision_number=ff22d54eae45a79f5bc59d2c04f3e02eed8e4981
bamboo_planRepository_branchDisplayName=3.1.x
bamboo_planRepository_1_type=gitv2
bamboo_planRepository_branchName=3.1.x
bamboo_repository_75956235_previous_revision_number=ff22d54eae45a79f5bc59d2c04f3e02eed8e4981
bamboo_capability_system_jdk_JDK=/usr/lib/jvm/java-6-sun
bamboo_plan_storageTag=PHPBB3-PR
bamboo_planRepository_type=gitv2
bamboo_planRepository_1_username=bantu
bamboo_ManualBuildTriggerReason_userName=Build Robot
bamboo_repository_git_repositoryUrl=https://github.com/phpbb/phpbb.git
bamboo_repository_75956235_git_branch=3.1.x
bamboo_capability_system_builder_ant_Ant=/usr/share/ant
bamboo_repository_75956235_name=phpBB Ascraeus
bamboo_working_directory=/home/bamboo/xml-data/build-dir/PHPBB3-PR-JOB1
bamboo_planKey=PHPBB3-PR
bamboo_planRepository_1_repositoryUrl=https://github.com/phpbb/phpbb.git
bamboo_planRepository_username=bantu
bamboo_capability_local=true
bamboo_capability_system_jdk_JDK_1_6=/usr/lib/jvm/java-6-sun
bamboo_capability_system_jdk_JDK_1_7=/usr/lib/jvm/java-7-openjdk-amd64
bamboo_planRepository_1_branchName=3.1.x
21-Apr-2017 21:43:32 From https://github.com/phpbb/phpbb
21-Apr-2017 21:43:32 * branch            refs/pull/3909/merge -> FETCH_HEAD
21-Apr-2017 21:43:33 Note: checking out 'FETCH_HEAD'.
21-Apr-2017 21:43:33
21-Apr-2017 21:43:33 You are in 'detached HEAD' state. You can look around, make experimental
21-Apr-2017 21:43:33 changes and commit them, and you can discard any commits you make in this
21-Apr-2017 21:43:33 state without impacting any branches by performing another checkout.
21-Apr-2017 21:43:33
21-Apr-2017 21:43:33 If you want to create a new branch to retain commits you create, you may
21-Apr-2017 21:43:33 do so (now or later) by using -b with the checkout command again. Example:
21-Apr-2017 21:43:33
21-Apr-2017 21:43:33   git checkout -b new_branch_name
21-Apr-2017 21:43:33
21-Apr-2017 21:43:33 HEAD is now at 4362201... Merge 00a8af68c36fa0d38559036455230df03602ee68 into bdbac7b4c90ec2c7ab0ea386a42676e95bbd77c7
21-Apr-2017 21:43:33 Finished task 'Fetch PR' with result: Success
21-Apr-2017 21:43:33 Skipping execution of task 'Prepare directory' as it is disabled
21-Apr-2017 21:43:33
Substituting variable: ${bamboo.working.directory} with /home/bamboo/xml-data/build-dir/PHPBB3-PR-JOB1
21-Apr-2017 21:43:33 Starting task 'Prepare directory' of type 'com.atlassian.bamboo.plugins.bamboo-docker-plugin:task.docker.cli'
21-Apr-2017 21:43:33 Running image name (phpbb:php-5.6)
21-Apr-2017 21:43:33
Beginning to execute external process for build 'phpBB3 - Pull Requests - Build and Test Job #7043 (PHPBB3-PR-JOB1-7043)'
... running command line:
/usr/bin/docker run --volume /home/bamboo/xml-data/build-dir/PHPBB3-PR-JOB1:/data --workdir /data/phpBB --rm -e HOME=/home/bamboo -u=991 phpbb:php-5.6 /bin/bash -c php ../composer.phar install --dev; cd ../build; ../phpBB/vendor/bin/phing clean prepare
... in: /home/bamboo/xml-data/build-dir/PHPBB3-PR-JOB1
... using extra environment variables:
bamboo_planRepository_1_branch=3.1.x
bamboo_planRepository_1_branchDisplayName=3.1.x
bamboo_repository_revision_number=ff22d54eae45a79f5bc59d2c04f3e02eed8e4981
bamboo_PRref=master
bamboo_resultsUrl=https://bamboo.phpbb.com/browse/PHPBB3-PR-JOB1-7043
bamboo_capability_system_builder_command_Git=/usr/bin/git
bamboo_repository_75956235_git_username=bantu
bamboo_planRepository_1_name=phpBB Ascraeus
bamboo_build_working_directory=/home/bamboo/xml-data/build-dir/PHPBB3-PR-JOB1
bamboo_buildKey=PHPBB3-PR-JOB1
bamboo_capability_phpbb_tests=true
bamboo_shortPlanName=Pull Requests
bamboo_capability_system_builder_command_fop=/usr/bin/fop
bamboo_capability_dbms_sqlite_2=true
bamboo_planRepository_name=phpBB Ascraeus
bamboo_PRnumber=3909
bamboo_buildNumber=7043
bamboo_repository_75956235_git_repositoryUrl=https://github.com/phpbb/phpbb.git
bamboo_capability_system_builder_phpunit_PHPUnit=/usr/bin/phpunit
bamboo_shortJobName=Build and Test Job
bamboo_buildResultsUrl=https://bamboo.phpbb.com/browse/PHPBB3-PR-JOB1-7043
bamboo_repository_75956235_branch_name=3.1.x
bamboo_planRepository_repositoryUrl=https://github.com/phpbb/phpbb.git
bamboo_agentId=131073
bamboo_planName=phpBB3 - Pull Requests
bamboo_build_commandline_com_atlassian_bamboo_plugins_scripttask_task_builder_script_7=/bin/sh /home/bamboo/temp/PHPBB3-PR-JOB1-7043-ScriptBuildTask-7909767124295626700.sh
bamboo_shortPlanKey=PR
bamboo_shortJobKey=JOB1
bamboo_capability_dbms_mysql_55=true
bamboo_capability_system_jdk_JDK_1_7_0_65=/usr/lib/jvm/java-7-openjdk-amd64
bamboo_planRepository_revision=ff22d54eae45a79f5bc59d2c04f3e02eed8e4981
bamboo_repository_previous_revision_number=ff22d54eae45a79f5bc59d2c04f3e02eed8e4981
bamboo_buildTimeStamp=2017-04-21T21:43:28.299Z
bamboo_planRepository_previousRevision=ff22d54eae45a79f5bc59d2c04f3e02eed8e4981
bamboo_capability_system_builder_mvn2_Maven_2=/usr/share/maven2
bamboo_capability_system_jdk_JDK_1_6_0_16=/usr/lib/jvm/java-6-sun-1.6.0.16
bamboo_build_commandline_com_atlassian_bamboo_plugins_scripttask_task_builder_script_4=/bin/sh /home/bamboo/temp/PHPBB3-PR-JOB1-7043-ScriptBuildTask-6326850728795392458.sh
bamboo_buildResultKey=PHPBB3-PR-JOB1-7043
bamboo_repository_git_branch=3.1.x
bamboo_repository_branch_name=3.1.x
bamboo_buildPlanName=phpBB3 - Pull Requests - Build and Test Job
bamboo_planRepository_1_revision=ff22d54eae45a79f5bc59d2c04f3e02eed8e4981
bamboo_repository_name=phpBB Ascraeus
bamboo_capability_system_docker_executable=/usr/bin/docker
bamboo_planRepository_branch=3.1.x
bamboo_agentWorkingDirectory=/home/bamboo/xml-data/build-dir
bamboo_capability_system_git_executable=/usr/bin/git
bamboo_planRepository_1_previousRevision=ff22d54eae45a79f5bc59d2c04f3e02eed8e4981
bamboo_capability_system_builder_phpunit_PHPUnit_3_4=/usr/bin/phpunit
bamboo_repository_git_username=bantu
bamboo_repository_75956235_revision_number=ff22d54eae45a79f5bc59d2c04f3e02eed8e4981
bamboo_planRepository_branchDisplayName=3.1.x
bamboo_planRepository_1_type=gitv2
bamboo_planRepository_branchName=3.1.x
bamboo_repository_75956235_previous_revision_number=ff22d54eae45a79f5bc59d2c04f3e02eed8e4981
bamboo_capability_system_jdk_JDK=/usr/lib/jvm/java-6-sun
bamboo_plan_storageTag=PHPBB3-PR
bamboo_planRepository_type=gitv2
bamboo_planRepository_1_username=bantu
bamboo_ManualBuildTriggerReason_userName=Build Robot
bamboo_repository_git_repositoryUrl=https://github.com/phpbb/phpbb.git
bamboo_repository_75956235_git_branch=3.1.x
bamboo_capability_system_builder_ant_Ant=/usr/share/ant
bamboo_repository_75956235_name=phpBB Ascraeus
bamboo_working_directory=/home/bamboo/xml-data/build-dir/PHPBB3-PR-JOB1
bamboo_planKey=PHPBB3-PR
bamboo_planRepository_1_repositoryUrl=https://github.com/phpbb/phpbb.git
bamboo_planRepository_username=bantu
bamboo_capability_local=true
bamboo_capability_system_jdk_JDK_1_6=/usr/lib/jvm/java-6-sun
bamboo_capability_system_jdk_JDK_1_7=/usr/lib/jvm/java-7-openjdk-amd64
bamboo_planRepository_1_branchName=3.1.x
21-Apr-2017 21:43:33 You are running composer with xdebug enabled. This has a major impact on runtime performance. See https://getcomposer.org/xdebug
21-Apr-2017 21:43:33 You are using the deprecated option "dev". Dev packages are installed by default now.
21-Apr-2017 21:43:33 Cannot create cache directory /home/bamboo/.composer/cache/repo/https---packagist.org/, or directory is not writable. Proceeding without cache
21-Apr-2017 21:43:33 Cannot create cache directory /home/bamboo/.composer/cache/files/, or directory is not writable. Proceeding without cache
21-Apr-2017 21:43:33 Loading composer repositories with package information
21-Apr-2017 21:43:33 Installing dependencies (including require-dev) from lock file
21-Apr-2017 21:43:33   - Installing bantu/ini-get-wrapper (v1.0.1)
21-Apr-2017 21:43:35     Downloading: Connecting...    Downloading: 0%               Downloading: 100%    Downloading: 100%
21-Apr-2017 21:43:35
21-Apr-2017 21:43:35   - Installing symfony/process (v3.1.3)
21-Apr-2017 21:43:36     Downloading: Connecting...    Downloading: 0%               Downloading: 15%    Downloading: 20%    Downloading: 35%    Downloading: 45%    Downloading: 70%    Downloading: 85%    Downloading: 100%    Downloading: 100%
21-Apr-2017 21:43:36
21-Apr-2017 21:43:36   - Installing symfony/finder (v3.2.0)
21-Apr-2017 21:43:38     Downloading: Connecting...    Downloading: 0%               Downloading: 5%    Downloading: 10%    Downloading: 15%    Downloading: 20%    Downloading: 25%    Downloading: 35%    Downloading: 40%    Downloading: 45%    Downloading: 80%    Downloading: 85%    Downloading: 90%    Downloading: 95%    Downloading: 100%    Downloading: 100%
21-Apr-2017 21:43:38
21-Apr-2017 21:43:38   - Installing symfony/filesystem (v3.2.0)
21-Apr-2017 21:43:39     Downloading: Connecting...    Downloading: 0%               Downloading: 35%    Downloading: 40%    Downloading: 80%    Downloading: 100%
21-Apr-2017 21:43:39
21-Apr-2017 21:43:39   - Installing symfony/polyfill-mbstring (v1.3.0)
21-Apr-2017 21:43:40     Downloading: Connecting...    Downloading: 0%               Downloading: 35%    Downloading: 95%    Downloading: 100%    Downloading: 100%
21-Apr-2017 21:43:40
21-Apr-2017 21:43:40   - Installing psr/log (1.0.2)
21-Apr-2017 21:43:41     Downloading: Connecting...    Downloading: 0%               Downloading: 15%    Downloading: 100%    Downloading: 100%
21-Apr-2017 21:43:41
21-Apr-2017 21:43:41   - Installing symfony/debug (v3.2.0)
21-Apr-2017 21:43:42     Downloading: Connecting...    Downloading: 0%               Downloading: 5%    Downloading: 25%    Downloading: 30%    Downloading: 50%    Downloading: 55%    Downloading: 60%    Downloading: 80%    Downloading: 85%    Downloading: 90%    Downloading: 100%
21-Apr-2017 21:43:42
21-Apr-2017 21:43:42   - Installing symfony/console (v3.2.0)
21-Apr-2017 21:43:43     Downloading: Connecting...    Downloading: 0%               Downloading: 5%    Downloading: 10%    Downloading: 15%    Downloading: 20%    Downloading: 25%    Downloading: 30%    Downloading: 35%    Downloading: 40%    Downloading: 45%    Downloading: 50%    Downloading: 55%    Downloading: 60%    Downloading: 65%    Downloading: 70%    Downloading: 75%    Downloading: 80%    Downloading: 85%    Downloading: 90%    Downloading: 95%    Downloading: 100%    Downloading: 100%
21-Apr-2017 21:43:43
21-Apr-2017 21:43:43   - Installing seld/phar-utils (1.0.1)
21-Apr-2017 21:43:44     Downloading: Connecting...    Downloading: 0%               Downloading: 30%    Downloading: 60%    Downloading: 90%    Downloading: 100%    Downloading: 100%
21-Apr-2017 21:43:44
21-Apr-2017 21:43:44   - Installing seld/jsonlint (1.4.0)
21-Apr-2017 21:43:45     Downloading: Connecting...    Downloading: 0%               Downloading: 25%    Downloading: 55%    Downloading: 100%    Downloading: 100%
21-Apr-2017 21:43:45
21-Apr-2017 21:43:45   - Installing seld/cli-prompt (1.0.2)
21-Apr-2017 21:43:46     Downloading: Connecting...    Downloading: 0%               Downloading: 15%    Downloading: 30%    Downloading: 100%
21-Apr-2017 21:43:46
21-Apr-2017 21:43:46   - Installing justinrainbow/json-schema (2.0.5)
21-Apr-2017 21:43:47     Downloading: Connecting...    Downloading: 0%               Downloading: 10%    Downloading: 35%    Downloading: 60%    Downloading: 70%    Downloading: 95%    Downloading: 100%
21-Apr-2017 21:43:47
21-Apr-2017 21:43:47   - Installing composer/spdx-licenses (1.1.4)
21-Apr-2017 21:43:48     Downloading: Connecting...    Downloading: 0%               Downloading: 35%    Downloading: 70%    Downloading: 100%
21-Apr-2017 21:43:48
21-Apr-2017 21:43:48   - Installing composer/semver (1.4.2)
21-Apr-2017 21:43:49     Downloading: Connecting...    Downloading: 0%               Downloading: 35%    Downloading: 85%    Downloading: 100%    Downloading: 100%
21-Apr-2017 21:43:49
21-Apr-2017 21:43:49   - Installing composer/ca-bundle (1.0.3)
21-Apr-2017 21:43:51     Downloading: Connecting...    Downloading: 0%               Downloading: 5%    Downloading: 10%    Downloading: 15%    Downloading: 20%    Downloading: 25%    Downloading: 30%    Downloading: 35%    Downloading: 40%    Downloading: 45%    Downloading: 50%    Downloading: 55%    Downloading: 60%    Downloading: 65%    Downloading: 70%    Downloading: 75%    Downloading: 80%    Downloading: 85%    Downloading: 90%    Downloading: 95%    Downloading: 100%    Downloading: 100%
21-Apr-2017 21:43:51
21-Apr-2017 21:43:51   - Installing composer/composer (1.2.0)
21-Apr-2017 21:43:52     Downloading: Connecting...    Downloading: 0%               Downloading: 5%    Downloading: 10%    Downloading: 15%    Downloading: 20%    Downloading: 25%    Downloading: 30%    Downloading: 35%    Downloading: 40%    Downloading: 45%    Downloading: 50%    Downloading: 55%    Downloading: 60%    Downloading: 65%    Downloading: 70%    Downloading: 75%    Downloading: 80%    Downloading: 85%    Downloading: 90%    Downloading: 95%    Downloading: 100%    Downloading: 100%
21-Apr-2017 21:43:52
21-Apr-2017 21:43:52   - Installing google/recaptcha (1.1.2)
21-Apr-2017 21:43:53     Downloading: Connecting...    Downloading: 0%               Downloading: 30%    Downloading: 55%    Downloading: 65%    Downloading: 70%    Downloading: 95%    Downloading: 100%    Downloading: 100%
21-Apr-2017 21:43:53
21-Apr-2017 21:43:53   - Installing guzzlehttp/promises (1.3.0)
21-Apr-2017 21:43:54     Downloading: Connecting...    Downloading: 0%               Downloading: 15%    Downloading: 25%    Downloading: 40%    Downloading: 50%    Downloading: 65%    Downloading: 90%    Downloading: 100%
21-Apr-2017 21:43:54
21-Apr-2017 21:43:54   - Installing psr/http-message (1.0.1)
21-Apr-2017 21:43:55     Downloading: Connecting...    Downloading: 0%               Downloading: 95%    Downloading: 100%    Downloading: 100%
21-Apr-2017 21:43:55
21-Apr-2017 21:43:55   - Installing guzzlehttp/psr7 (1.3.1)
21-Apr-2017 21:43:56     Downloading: Connecting...    Downloading: 0%               Downloading: 5%    Downloading: 20%    Downloading: 30%    Downloading: 35%    Downloading: 45%    Downloading: 50%    Downloading: 65%    Downloading: 70%    Downloading: 85%    Downloading: 90%    Downloading: 100%    Downloading: 100%
21-Apr-2017 21:43:56
21-Apr-2017 21:43:56   - Installing lusitanian/oauth (v0.8.10)
21-Apr-2017 21:43:58     Downloading: Connecting...    Downloading: 0%               Downloading: 5%    Downloading: 10%    Downloading: 15%    Downloading: 20%    Downloading: 25%    Downloading: 35%    Downloading: 40%    Downloading: 50%    Downloading: 55%    Downloading: 60%    Downloading: 65%    Downloading: 70%    Downloading: 80%    Downloading: 85%    Downloading: 90%    Downloading: 95%    Downloading: 100%    Downloading: 100%
21-Apr-2017 21:43:58
21-Apr-2017 21:43:58   - Installing marc1706/fast-image-size (v1.1.3)
21-Apr-2017 21:43:59     Downloading: Connecting...    Downloading: 0%               Downloading: 20%    Downloading: 40%    Downloading: 100%    Downloading: 100%
21-Apr-2017 21:43:59
21-Apr-2017 21:43:59   - Installing paragonie/random_compat (v1.4.1)
21-Apr-2017 21:44:00     Downloading: Connecting...    Downloading: 0%               Downloading: 20%    Downloading: 35%    Downloading: 60%    Downloading: 80%    Downloading: 95%    Downloading: 100%    Downloading: 100%
21-Apr-2017 21:44:00
21-Apr-2017 21:44:00   - Installing patchwork/utf8 (v1.3.1)
21-Apr-2017 21:44:01     Downloading: Connecting...    Downloading: 0%               Downloading: 5%    Downloading: 10%    Downloading: 15%    Downloading: 20%    Downloading: 25%    Downloading: 30%    Downloading: 35%    Downloading: 40%    Downloading: 45%    Downloading: 50%    Downloading: 55%    Downloading: 60%    Downloading: 65%    Downloading: 70%    Downloading: 75%    Downloading: 80%    Downloading: 85%    Downloading: 90%    Downloading: 95%    Downloading: 100%    Downloading: 100%
21-Apr-2017 21:44:01
21-Apr-2017 21:44:01   - Installing s9e/text-formatter (0.9.1)
21-Apr-2017 21:44:02     Downloading: Connecting...    Downloading: 0%               Downloading: 5%    Downloading: 10%    Downloading: 15%    Downloading: 20%    Downloading: 25%    Downloading: 30%    Downloading: 35%    Downloading: 40%    Downloading: 45%    Downloading: 50%    Downloading: 55%    Downloading: 60%    Downloading: 65%    Downloading: 70%    Downloading: 75%    Downloading: 95%    Downloading: 100%    Downloading: 100%
21-Apr-2017 21:44:02
21-Apr-2017 21:44:02   - Installing symfony/config (v3.2.0)
21-Apr-2017 21:44:04     Downloading: Connecting...    Downloading: 0%               Downloading: 5%    Downloading: 15%    Downloading: 20%    Downloading: 25%    Downloading: 30%    Downloading: 35%    Downloading: 40%    Downloading: 45%    Downloading: 50%    Downloading: 55%    Downloading: 60%    Downloading: 65%    Downloading: 70%    Downloading: 75%    Downloading: 80%    Downloading: 85%    Downloading: 90%    Downloading: 95%    Downloading: 100%    Downloading: 100%
21-Apr-2017 21:44:04
21-Apr-2017 21:44:04   - Installing symfony/http-foundation (v3.2.0)
21-Apr-2017 21:44:05     Downloading: Connecting...    Downloading: 0%               Downloading: 5%    Downloading: 10%    Downloading: 15%    Downloading: 20%    Downloading: 25%    Downloading: 30%    Downloading: 35%    Downloading: 40%    Downloading: 45%    Downloading: 50%    Downloading: 55%    Downloading: 60%    Downloading: 65%    Downloading: 70%    Downloading: 75%    Downloading: 80%    Downloading: 85%    Downloading: 90%    Downloading: 95%    Downloading: 100%    Downloading: 100%
21-Apr-2017 21:44:05
21-Apr-2017 21:44:05   - Installing symfony/event-dispatcher (v3.2.0)
21-Apr-2017 21:44:06     Downloading: Connecting...    Downloading: 0%               Downloading: 5%    Downloading: 10%    Downloading: 15%    Downloading: 100%
21-Apr-2017 21:44:06
21-Apr-2017 21:44:06   - Installing symfony/http-kernel (v3.2.0)
21-Apr-2017 21:44:07     Downloading: Connecting...    Downloading: 0%               Downloading: 5%    Downloading: 10%    Downloading: 15%    Downloading: 20%    Downloading: 25%    Downloading: 30%    Downloading: 35%    Downloading: 40%    Downloading: 45%    Downloading: 50%    Downloading: 55%    Downloading: 60%    Downloading: 65%    Downloading: 70%    Downloading: 75%    Downloading: 80%    Downloading: 85%    Downloading: 90%    Downloading: 95%    Downloading: 100%    Downloading: 100%
21-Apr-2017 21:44:07
21-Apr-2017 21:44:08   - Installing symfony/dependency-injection (v3.2.0)
21-Apr-2017 21:44:09     Downloading: Connecting...    Downloading: 0%               Downloading: 5%    Downloading: 10%    Downloading: 15%    Downloading: 20%    Downloading: 25%    Downloading: 30%    Downloading: 35%    Downloading: 40%    Downloading: 45%    Downloading: 50%    Downloading: 55%    Downloading: 60%    Downloading: 65%    Downloading: 70%    Downloading: 75%    Downloading: 80%    Downloading: 85%    Downloading: 90%    Downloading: 95%    Downloading: 100%    Downloading: 100%
21-Apr-2017 21:44:09
21-Apr-2017 21:44:09   - Installing zendframework/zend-eventmanager (3.0.1)
21-Apr-2017 21:44:10     Downloading: Connecting...    Downloading: 0%               Downloading: 15%    Downloading: 30%    Downloading: 75%    Downloading: 90%    Downloading: 100%    Downloading: 100%
21-Apr-2017 21:44:10
21-Apr-2017 21:44:10   - Installing zendframework/zend-code (2.6.3)
21-Apr-2017 21:44:11     Downloading: Connecting...    Downloading: 0%               Downloading: 5%    Downloading: 10%    Downloading: 15%    Downloading: 20%    Downloading: 25%    Downloading: 30%    Downloading: 35%    Downloading: 40%    Downloading: 45%    Downloading: 50%    Downloading: 55%    Downloading: 60%    Downloading: 65%    Downloading: 70%    Downloading: 75%    Downloading: 80%    Downloading: 85%    Downloading: 90%    Downloading: 95%    Downloading: 100%    Downloading: 100%
21-Apr-2017 21:44:11
21-Apr-2017 21:44:11   - Installing ocramius/proxy-manager (1.0.2)
21-Apr-2017 21:44:13     Downloading: Connecting...    Downloading: 0%               Downloading: 5%    Downloading: 10%    Downloading: 15%    Downloading: 20%    Downloading: 25%    Downloading: 30%    Downloading: 35%    Downloading: 40%    Downloading: 45%    Downloading: 50%    Downloading: 55%    Downloading: 60%    Downloading: 65%    Downloading: 70%    Downloading: 75%    Downloading: 80%    Downloading: 95%    Downloading: 100%    Downloading: 100%
21-Apr-2017 21:44:13
21-Apr-2017 21:44:13   - Installing symfony/proxy-manager-bridge (v3.2.0)
21-Apr-2017 21:44:14     Downloading: Connecting...    Downloading: 0%               Downloading: 25%    Downloading: 65%    Downloading: 100%    Downloading: 100%
21-Apr-2017 21:44:14
21-Apr-2017 21:44:14   - Installing symfony/routing (v3.2.0)
21-Apr-2017 21:44:15     Downloading: Connecting...    Downloading: 0%               Downloading: 5%    Downloading: 10%    Downloading: 15%    Downloading: 20%    Downloading: 25%    Downloading: 30%    Downloading: 35%    Downloading: 40%    Downloading: 45%    Downloading: 50%    Downloading: 55%    Downloading: 60%    Downloading: 65%    Downloading: 70%    Downloading: 75%    Downloading: 80%    Downloading: 85%    Downloading: 90%    Downloading: 95%    Downloading: 100%    Downloading: 100%
21-Apr-2017 21:44:15
21-Apr-2017 21:44:15   - Installing twig/twig (v1.24.2)
21-Apr-2017 21:44:16     Downloading: Connecting...    Downloading: 0%               Downloading: 5%    Downloading: 10%    Downloading: 15%    Downloading: 20%    Downloading: 25%    Downloading: 30%    Downloading: 35%    Downloading: 40%    Downloading: 45%    Downloading: 50%    Downloading: 55%    Downloading: 60%    Downloading: 65%    Downloading: 70%    Downloading: 75%    Downloading: 80%    Downloading: 85%    Downloading: 90%    Downloading: 95%    Downloading: 100%    Downloading: 100%
21-Apr-2017 21:44:17
21-Apr-2017 21:44:17   - Installing symfony/twig-bridge (v3.1.4)
21-Apr-2017 21:44:18     Downloading: Connecting...    Downloading: 0%               Downloading: 10%    Downloading: 25%    Downloading: 30%    Downloading: 40%    Downloading: 45%    Downloading: 55%    Downloading: 60%    Downloading: 70%    Downloading: 75%    Downloading: 80%    Downloading: 85%    Downloading: 95%    Downloading: 100%    Downloading: 100%
21-Apr-2017 21:44:18
21-Apr-2017 21:44:18   - Installing symfony/dom-crawler (v3.2.0)
21-Apr-2017 21:44:19     Downloading: Connecting...    Downloading: 0%               Downloading: 25%    Downloading: 30%    Downloading: 40%    Downloading: 45%    Downloading: 65%    Downloading: 70%    Downloading: 90%    Downloading: 95%    Downloading: 100%    Downloading: 100%
21-Apr-2017 21:44:19
21-Apr-2017 21:44:19   - Installing symfony/css-selector (v3.2.0)
21-Apr-2017 21:44:20     Downloading: Connecting...    Downloading: 0%               Downloading: 5%    Downloading: 10%    Downloading: 55%    Downloading: 60%    Downloading: 65%    Downloading: 70%    Downloading: 75%    Downloading: 80%    Downloading: 85%    Downloading: 90%    Downloading: 95%    Downloading: 100%    Downloading: 100%
21-Apr-2017 21:44:20
21-Apr-2017 21:44:20   - Installing symfony/browser-kit (v3.2.0)
21-Apr-2017 21:44:21     Downloading: Connecting...    Downloading: 0%               Downloading: 50%    Downloading: 80%    Downloading: 85%    Downloading: 100%    Downloading: 100%
21-Apr-2017 21:44:21
21-Apr-2017 21:44:21   - Installing guzzlehttp/guzzle (6.2.2)
21-Apr-2017 21:44:22     Downloading: Connecting...    Downloading: 0%               Downloading: 5%    Downloading: 10%    Downloading: 15%    Downloading: 20%    Downloading: 30%    Downloading: 35%    Downloading: 40%    Downloading: 45%    Downloading: 50%    Downloading: 55%    Downloading: 60%    Downloading: 70%    Downloading: 75%    Downloading: 85%    Downloading: 90%    Downloading: 95%    Downloading: 100%
21-Apr-2017 21:44:22
21-Apr-2017 21:44:22   - Installing fabpot/goutte (v3.2.0)
21-Apr-2017 21:44:23     Downloading: Connecting...    Downloading: 0%               Downloading: 70%    Downloading: 100%    Downloading: 100%
21-Apr-2017 21:44:23
21-Apr-2017 21:44:23   - Installing facebook/webdriver (1.2.0)
21-Apr-2017 21:44:24     Downloading: Connecting...    Downloading: 0%               Downloading: 5%    Downloading: 10%    Downloading: 15%    Downloading: 20%    Downloading: 25%    Downloading: 30%    Downloading: 35%    Downloading: 40%    Downloading: 45%    Downloading: 50%    Downloading: 55%    Downloading: 60%    Downloading: 65%    Downloading: 70%    Downloading: 75%    Downloading: 80%    Downloading: 85%    Downloading: 90%    Downloading: 95%    Downloading: 100%    Downloading: 100%
21-Apr-2017 21:44:24
21-Apr-2017 21:44:24   - Installing laravel/homestead (v4.0.5)
21-Apr-2017 21:44:25     Downloading: Connecting...    Downloading: 0%               Downloading: 5%    Downloading: 10%    Downloading: 70%    Downloading: 75%    Downloading: 80%    Downloading: 85%    Downloading: 100%    Downloading: 100%
21-Apr-2017 21:44:25
21-Apr-2017 21:44:25   - Installing phing/phing (2.4.14)
21-Apr-2017 21:44:27     Downloading: Connecting...    Downloading: 0%               Downloading: 5%    Downloading: 10%    Downloading: 15%    Downloading: 20%    Downloading: 25%    Downloading: 30%    Downloading: 35%    Downloading: 40%    Downloading: 45%    Downloading: 50%    Downloading: 55%    Downloading: 60%    Downloading: 65%    Downloading: 70%    Downloading: 75%    Downloading: 80%    Downloading: 85%    Downloading: 90%    Downloading: 95%    Downloading: 100%    Downloading: 100%
21-Apr-2017 21:44:27
21-Apr-2017 21:44:27   - Installing phpdocumentor/reflection-docblock (2.0.4)
21-Apr-2017 21:44:28     Downloading: Connecting...    Downloading: 0%               Downloading: 15%    Downloading: 20%    Downloading: 30%    Downloading: 35%    Downloading: 50%    Downloading: 55%    Downloading: 70%    Downloading: 85%    Downloading: 90%    Downloading: 100%
21-Apr-2017 21:44:28
21-Apr-2017 21:44:28   - Installing phpdocumentor/reflection-common (1.0)
21-Apr-2017 21:44:29     Downloading: Connecting...    Downloading: 0%               Downloading: 65%    Downloading: 100%    Downloading: 100%
21-Apr-2017 21:44:29
21-Apr-2017 21:44:29   - Installing phpdocumentor/type-resolver (0.2.1)
21-Apr-2017 21:44:30     Downloading: Connecting...    Downloading: 0%               Downloading: 20%    Downloading: 35%    Downloading: 80%    Downloading: 100%    Downloading: 100%
21-Apr-2017 21:44:30
21-Apr-2017 21:44:30   - Installing symfony/yaml (v3.2.0)
21-Apr-2017 21:44:31     Downloading: Connecting...    Downloading: 0%               Downloading: 10%    Downloading: 20%    Downloading: 25%    Downloading: 40%    Downloading: 45%    Downloading: 55%    Downloading: 65%    Downloading: 70%    Downloading: 80%    Downloading: 90%    Downloading: 100%
21-Apr-2017 21:44:31
21-Apr-2017 21:44:31   - Installing sebastian/version (1.0.6)
21-Apr-2017 21:44:32     Downloading: Connecting...    Downloading: 0%               Downloading: 100%    Downloading: 100%
21-Apr-2017 21:44:32
21-Apr-2017 21:44:32   - Installing sebastian/global-state (1.1.1)
21-Apr-2017 21:44:33     Downloading: Connecting...    Downloading: 0%               Downloading: 40%    Downloading: 70%    Downloading: 100%    Downloading: 100%
21-Apr-2017 21:44:33
21-Apr-2017 21:44:33   - Installing sebastian/recursion-context (1.0.2)
21-Apr-2017 21:44:34     Downloading: Connecting...    Downloading: 0%               Downloading: 35%    Downloading: 70%    Downloading: 100%    Downloading: 100%
21-Apr-2017 21:44:34
21-Apr-2017 21:44:34   - Installing sebastian/exporter (1.2.2)
21-Apr-2017 21:44:35     Downloading: Connecting...    Downloading: 0%               Downloading: 100%    Downloading: 100%
21-Apr-2017 21:44:35
21-Apr-2017 21:44:35   - Installing sebastian/environment (1.3.8)
21-Apr-2017 21:44:36     Downloading: Connecting...    Downloading: 0%               Downloading: 15%    Downloading: 30%    Downloading: 45%    Downloading: 60%    Downloading: 75%    Downloading: 100%    Downloading: 100%
21-Apr-2017 21:44:36
21-Apr-2017 21:44:36   - Installing sebastian/diff (1.4.1)
21-Apr-2017 21:44:37     Downloading: Connecting...    Downloading: 0%               Downloading: 15%    Downloading: 30%    Downloading: 45%    Downloading: 100%    Downloading: 100%
21-Apr-2017 21:44:37
21-Apr-2017 21:44:37   - Installing sebastian/comparator (1.2.2)
21-Apr-2017 21:44:38     Downloading: Connecting...    Downloading: 0%               Downloading: 10%    Downloading: 20%    Downloading: 30%    Downloading: 40%    Downloading: 45%    Downloading: 55%    Downloading: 65%    Downloading: 75%    Downloading: 85%    Downloading: 95%    Downloading: 100%    Downloading: 100%
21-Apr-2017 21:44:38
21-Apr-2017 21:44:38   - Installing phpunit/php-text-template (1.2.1)
21-Apr-2017 21:44:39     Downloading: Connecting...    Downloading: 0%               Downloading: 35%    Downloading: 100%    Downloading: 100%
21-Apr-2017 21:44:39
21-Apr-2017 21:44:39   - Installing doctrine/instantiator (1.0.5)
21-Apr-2017 21:44:40     Downloading: Connecting...    Downloading: 0%               Downloading: 15%    Downloading: 30%    Downloading: 45%    Downloading: 60%    Downloading: 75%    Downloading: 90%    Downloading: 100%    Downloading: 100%
21-Apr-2017 21:44:40
21-Apr-2017 21:44:40   - Installing phpunit/phpunit-mock-objects (2.3.8)
21-Apr-2017 21:44:41     Downloading: Connecting...    Downloading: 0%               Downloading: 5%    Downloading: 20%    Downloading: 25%    Downloading: 35%    Downloading: 40%    Downloading: 45%    Downloading: 55%    Downloading: 65%    Downloading: 70%    Downloading: 75%    Downloading: 80%    Downloading: 90%    Downloading: 95%    Downloading: 100%    Downloading: 100%
21-Apr-2017 21:44:42
21-Apr-2017 21:44:42   - Installing phpunit/php-timer (1.0.8)
21-Apr-2017 21:44:43     Downloading: Connecting...    Downloading: 0%               Downloading: 100%    Downloading: 100%
21-Apr-2017 21:44:43
21-Apr-2017 21:44:43   - Installing phpunit/php-file-iterator (1.4.2)
21-Apr-2017 21:44:44     Downloading: Connecting...    Downloading: 0%               Downloading: 20%    Downloading: 40%    Downloading: 60%    Downloading: 100%    Downloading: 100%
21-Apr-2017 21:44:44
21-Apr-2017 21:44:44   - Installing phpunit/php-token-stream (1.4.9)
21-Apr-2017 21:44:45     Downloading: Connecting...    Downloading: 0%               Downloading: 5%    Downloading: 10%    Downloading: 15%    Downloading: 20%    Downloading: 65%    Downloading: 70%    Downloading: 75%    Downloading: 80%    Downloading: 85%    Downloading: 90%    Downloading: 95%    Downloading: 100%    Downloading: 100%
21-Apr-2017 21:44:45
21-Apr-2017 21:44:45   - Installing phpunit/php-code-coverage (2.2.4)
21-Apr-2017 21:44:46     Downloading: Connecting...    Downloading: 0%               Downloading: 5%    Downloading: 10%    Downloading: 15%    Downloading: 20%    Downloading: 25%    Downloading: 30%    Downloading: 35%    Downloading: 40%    Downloading: 45%    Downloading: 50%    Downloading: 55%    Downloading: 60%    Downloading: 65%    Downloading: 70%    Downloading: 75%    Downloading: 85%    Downloading: 90%    Downloading: 100%    Downloading: 100%
21-Apr-2017 21:44:46
21-Apr-2017 21:44:46   - Installing phpspec/prophecy (v1.6.2)
21-Apr-2017 21:44:47     Downloading: Connecting...    Downloading: 0%               Downloading: 5%    Downloading: 10%    Downloading: 15%    Downloading: 20%    Downloading: 25%    Downloading: 30%    Downloading: 35%    Downloading: 40%    Downloading: 45%    Downloading: 50%    Downloading: 55%    Downloading: 60%    Downloading: 65%    Downloading: 70%    Downloading: 75%    Downloading: 80%    Downloading: 85%    Downloading: 90%    Downloading: 95%    Downloading: 100%    Downloading: 100%
21-Apr-2017 21:44:47
21-Apr-2017 21:44:47   - Installing phpunit/phpunit (4.8.31)
21-Apr-2017 21:44:49     Downloading: Connecting...    Downloading: 0%               Downloading: 5%    Downloading: 10%    Downloading: 15%    Downloading: 20%    Downloading: 25%    Downloading: 30%    Downloading: 35%    Downloading: 40%    Downloading: 45%    Downloading: 50%    Downloading: 55%    Downloading: 60%    Downloading: 65%    Downloading: 75%    Downloading: 85%    Downloading: 90%    Downloading: 95%    Downloading: 100%    Downloading: 100%
21-Apr-2017 21:44:49
21-Apr-2017 21:44:49   - Installing phpunit/dbunit (2.0.3)
21-Apr-2017 21:44:50     Downloading: Connecting...    Downloading: 0%               Downloading: 5%    Downloading: 10%    Downloading: 15%    Downloading: 20%    Downloading: 25%    Downloading: 30%    Downloading: 35%    Downloading: 40%    Downloading: 45%    Downloading: 50%    Downloading: 55%    Downloading: 60%    Downloading: 65%    Downloading: 70%    Downloading: 75%    Downloading: 80%    Downloading: 85%    Downloading: 90%    Downloading: 95%    Downloading: 100%    Downloading: 100%
21-Apr-2017 21:44:50
21-Apr-2017 21:44:50   - Installing squizlabs/php_codesniffer (2.7.1)
21-Apr-2017 21:44:51     Downloading: Connecting...    Downloading: 0%               Downloading: 5%    Downloading: 10%    Downloading: 15%    Downloading: 20%    Downloading: 25%    Downloading: 30%    Downloading: 35%    Downloading: 40%    Downloading: 45%    Downloading: 50%    Downloading: 55%    Downloading: 60%    Downloading: 65%    Downloading: 70%    Downloading: 75%    Downloading: 80%    Downloading: 85%    Downloading: 90%    Downloading: 95%    Downloading: 100%    Downloading: 100%
21-Apr-2017 21:44:51
21-Apr-2017 21:44:51   - Installing webmozart/assert (1.2.0)
21-Apr-2017 21:44:52     Downloading: Connecting...    Downloading: 0%               Downloading: 55%    Downloading: 75%    Downloading: 95%    Downloading: 100%
21-Apr-2017 21:44:52
21-Apr-2017 21:44:54 lusitanian/oauth suggests installing predis/predis (Allows using the Redis storage backend.)
21-Apr-2017 21:44:54 paragonie/random_compat suggests installing ext-libsodium (Provides a modern crypto API that can be used to generate random bytes.)
21-Apr-2017 21:44:54 patchwork/utf8 suggests installing ext-intl (Use Intl for best performance)
21-Apr-2017 21:44:54 patchwork/utf8 suggests installing ext-wfio (Use WFIO for UTF-8 filesystem access on Windows)
21-Apr-2017 21:44:54 s9e/text-formatter suggests installing ext-intl (Allows international URLs to be accepted by the URL filter)
21-Apr-2017 21:44:54 s9e/text-formatter suggests installing ext-xsl (Enables the XSLT renderer)
21-Apr-2017 21:44:54 symfony/http-kernel suggests installing symfony/class-loader ()
21-Apr-2017 21:44:54 symfony/http-kernel suggests installing symfony/var-dumper ()
21-Apr-2017 21:44:54 symfony/dependency-injection suggests installing symfony/expression-language (For using expressions in service container configuration)
21-Apr-2017 21:44:54 zendframework/zend-eventmanager suggests installing container-interop/container-interop (^1.1.0, to use the lazy listeners feature)
21-Apr-2017 21:44:54 zendframework/zend-eventmanager suggests installing zendframework/zend-stdlib (^2.7.3 || ^3.0, to use the FilterChain feature)
21-Apr-2017 21:44:54 zendframework/zend-code suggests installing doctrine/annotations (Doctrine\Common\Annotations >=1.0 for annotation features)
21-Apr-2017 21:44:54 zendframework/zend-code suggests installing zendframework/zend-stdlib (Zend\Stdlib component)
21-Apr-2017 21:44:54 ocramius/proxy-manager suggests installing ocramius/generated-hydrator (To have very fast object to array to object conversion for ghost objects)
21-Apr-2017 21:44:54 ocramius/proxy-manager suggests installing zendframework/zend-json (To have the JsonRpc adapter (Remote Object feature))
21-Apr-2017 21:44:54 ocramius/proxy-manager suggests installing zendframework/zend-soap (To have the Soap adapter (Remote Object feature))
21-Apr-2017 21:44:54 ocramius/proxy-manager suggests installing zendframework/zend-stdlib (To use the hydrator proxy)
21-Apr-2017 21:44:54 ocramius/proxy-manager suggests installing zendframework/zend-xmlrpc (To have the XmlRpc adapter (Remote Object feature))
21-Apr-2017 21:44:54 symfony/routing suggests installing doctrine/annotations (For using the annotation loader)
21-Apr-2017 21:44:54 symfony/routing suggests installing symfony/expression-language (For using expression matching)
21-Apr-2017 21:44:54 symfony/twig-bridge suggests installing symfony/asset (For using the AssetExtension)
21-Apr-2017 21:44:54 symfony/twig-bridge suggests installing symfony/expression-language (For using the ExpressionExtension)
21-Apr-2017 21:44:54 symfony/twig-bridge suggests installing symfony/form (For using the FormExtension)
21-Apr-2017 21:44:54 symfony/twig-bridge suggests installing symfony/security (For using the SecurityExtension)
21-Apr-2017 21:44:54 symfony/twig-bridge suggests installing symfony/stopwatch (For using the StopwatchExtension)
21-Apr-2017 21:44:54 symfony/twig-bridge suggests installing symfony/templating (For using the TwigEngine)
21-Apr-2017 21:44:54 symfony/twig-bridge suggests installing symfony/translation (For using the TranslationExtension)
21-Apr-2017 21:44:54 symfony/twig-bridge suggests installing symfony/var-dumper (For using the DumpExtension)
21-Apr-2017 21:44:54 facebook/webdriver suggests installing phpdocumentor/phpdocumentor (2.*)
21-Apr-2017 21:44:54 phpdocumentor/reflection-docblock suggests installing dflydev/markdown (~1.0)
21-Apr-2017 21:44:54 phpdocumentor/reflection-docblock suggests installing erusev/parsedown (~1.0)
21-Apr-2017 21:44:54 sebastian/global-state suggests installing ext-uopz (*)
21-Apr-2017 21:44:54 phpunit/phpunit-mock-objects suggests installing ext-soap (*)
21-Apr-2017 21:44:54 phpunit/phpunit suggests installing phpunit/php-invoker (~1.1)
21-Apr-2017 21:44:54 Generating autoload files
21-Apr-2017 21:44:55 Buildfile: /data/build/build.xml
21-Apr-2017 21:44:55
21-Apr-2017 21:44:55 phpBB > clean:
21-Apr-2017 21:44:55
21-Apr-2017 21:44:55    [delete] Directory /data/build/logs does not exist or is not a directory.
21-Apr-2017 21:44:55    [delete] Directory /data/build/api does not exist or is not a directory.
21-Apr-2017 21:44:55    [delete] Directory /data/build/codebrowser does not exist or is not a directory.
21-Apr-2017 21:44:55    [delete] Directory /data/build/coverage does not exist or is not a directory.
21-Apr-2017 21:44:55    [delete] Directory /data/build/cpd does not exist or is not a directory.
21-Apr-2017 21:44:55    [delete] Directory /data/build/dependencies does not exist or is not a directory.
21-Apr-2017 21:44:55    [delete] Directory /data/build/new_version does not exist or is not a directory.
21-Apr-2017 21:44:55    [delete] Directory /data/build/old_versions does not exist or is not a directory.
21-Apr-2017 21:44:55    [delete] Directory /data/build/save does not exist or is not a directory.
21-Apr-2017 21:44:55
21-Apr-2017 21:44:55 phpBB > prepare:
21-Apr-2017 21:44:55
21-Apr-2017 21:44:55     [mkdir] Created dir: /data/build/logs
21-Apr-2017 21:44:55     [mkdir] Created dir: /data/build/api
21-Apr-2017 21:44:55     [mkdir] Created dir: /data/build/codebrowser
21-Apr-2017 21:44:55     [mkdir] Created dir: /data/build/coverage
21-Apr-2017 21:44:55     [mkdir] Created dir: /data/build/cpd
21-Apr-2017 21:44:55     [mkdir] Created dir: /data/build/dependencies
21-Apr-2017 21:44:55     [mkdir] Created dir: /data/build/new_version
21-Apr-2017 21:44:55     [mkdir] Created dir: /data/build/new_version/files
21-Apr-2017 21:44:55     [mkdir] Created dir: /data/build/new_version/patches
21-Apr-2017 21:44:55     [mkdir] Created dir: /data/build/new_version/release_files
21-Apr-2017 21:44:55     [mkdir] Created dir: /data/build/new_version/update
21-Apr-2017 21:44:55     [mkdir] Created dir: /data/build/old_versions
21-Apr-2017 21:44:55     [mkdir] Created dir: /data/build/save
21-Apr-2017 21:44:55
21-Apr-2017 21:44:55 BUILD FINISHED
21-Apr-2017 21:44:55
21-Apr-2017 21:44:55 Total time: 0.1214 seconds
21-Apr-2017 21:44:55
21-Apr-2017 21:44:55 Finished task 'Prepare directory' with result: Success
21-Apr-2017 21:44:55 Skipping execution of task 'Run sniffs' as it is disabled
21-Apr-2017 21:44:55
Substituting variable: ${bamboo.working.directory} with /home/bamboo/xml-data/build-dir/PHPBB3-PR-JOB1
21-Apr-2017 21:44:55 Starting task 'Run sniffs' of type 'com.atlassian.bamboo.plugins.bamboo-docker-plugin:task.docker.cli'
21-Apr-2017 21:44:55 Running image name (phpbb:php-5.6)
21-Apr-2017 21:44:55
Beginning to execute external process for build 'phpBB3 - Pull Requests - Build and Test Job #7043 (PHPBB3-PR-JOB1-7043)'
... running command line:
/usr/bin/docker run --volume /home/bamboo/xml-data/build-dir/PHPBB3-PR-JOB1:/data --workdir /data/build --rm -u=991 phpbb:php-5.6 ../phpBB/vendor/bin/phing sniff
... in: /home/bamboo/xml-data/build-dir/PHPBB3-PR-JOB1
... using extra environment variables:
bamboo_planRepository_1_branch=3.1.x
bamboo_planRepository_1_branchDisplayName=3.1.x
bamboo_repository_revision_number=ff22d54eae45a79f5bc59d2c04f3e02eed8e4981
bamboo_PRref=master
bamboo_resultsUrl=https://bamboo.phpbb.com/browse/PHPBB3-PR-JOB1-7043
bamboo_capability_system_builder_command_Git=/usr/bin/git
bamboo_repository_75956235_git_username=bantu
bamboo_planRepository_1_name=phpBB Ascraeus
bamboo_build_working_directory=/home/bamboo/xml-data/build-dir/PHPBB3-PR-JOB1
bamboo_buildKey=PHPBB3-PR-JOB1
bamboo_capability_phpbb_tests=true
bamboo_shortPlanName=Pull Requests
bamboo_capability_system_builder_command_fop=/usr/bin/fop
bamboo_capability_dbms_sqlite_2=true
bamboo_planRepository_name=phpBB Ascraeus
bamboo_PRnumber=3909
bamboo_buildNumber=7043
bamboo_repository_75956235_git_repositoryUrl=https://github.com/phpbb/phpbb.git
bamboo_capability_system_builder_phpunit_PHPUnit=/usr/bin/phpunit
bamboo_shortJobName=Build and Test Job
bamboo_buildResultsUrl=https://bamboo.phpbb.com/browse/PHPBB3-PR-JOB1-7043
bamboo_repository_75956235_branch_name=3.1.x
bamboo_planRepository_repositoryUrl=https://github.com/phpbb/phpbb.git
bamboo_agentId=131073
bamboo_planName=phpBB3 - Pull Requests
bamboo_build_commandline_com_atlassian_bamboo_plugins_scripttask_task_builder_script_7=/bin/sh /home/bamboo/temp/PHPBB3-PR-JOB1-7043-ScriptBuildTask-7909767124295626700.sh
bamboo_shortPlanKey=PR
bamboo_shortJobKey=JOB1
bamboo_capability_dbms_mysql_55=true
bamboo_capability_system_jdk_JDK_1_7_0_65=/usr/lib/jvm/java-7-openjdk-amd64
bamboo_planRepository_revision=ff22d54eae45a79f5bc59d2c04f3e02eed8e4981
bamboo_repository_previous_revision_number=ff22d54eae45a79f5bc59d2c04f3e02eed8e4981
bamboo_buildTimeStamp=2017-04-21T21:43:28.299Z
bamboo_planRepository_previousRevision=ff22d54eae45a79f5bc59d2c04f3e02eed8e4981
bamboo_capability_system_builder_mvn2_Maven_2=/usr/share/maven2
bamboo_capability_system_jdk_JDK_1_6_0_16=/usr/lib/jvm/java-6-sun-1.6.0.16
bamboo_build_commandline_com_atlassian_bamboo_plugins_scripttask_task_builder_script_4=/bin/sh /home/bamboo/temp/PHPBB3-PR-JOB1-7043-ScriptBuildTask-6326850728795392458.sh
bamboo_buildResultKey=PHPBB3-PR-JOB1-7043
bamboo_repository_git_branch=3.1.x
bamboo_repository_branch_name=3.1.x
bamboo_buildPlanName=phpBB3 - Pull Requests - Build and Test Job
bamboo_planRepository_1_revision=ff22d54eae45a79f5bc59d2c04f3e02eed8e4981
bamboo_repository_name=phpBB Ascraeus
bamboo_capability_system_docker_executable=/usr/bin/docker
bamboo_build_commandline_com_atlassian_bamboo_plugins_bamboo_docker_plugin_task_docker_cli_12=/usr/bin/docker run --volume /home/bamboo/xml-data/build-dir/PHPBB3-PR-JOB1:/data --workdir /data/phpBB --rm -e HOME=/home/bamboo -u=991 phpbb:php-5.6 /bin/bash -c php ../composer.phar install --dev; cd ../build; ../phpBB/vendor/bin/phing clean prepare
bamboo_planRepository_branch=3.1.x
bamboo_agentWorkingDirectory=/home/bamboo/xml-data/build-dir
bamboo_capability_system_git_executable=/usr/bin/git
bamboo_planRepository_1_previousRevision=ff22d54eae45a79f5bc59d2c04f3e02eed8e4981
bamboo_capability_system_builder_phpunit_PHPUnit_3_4=/usr/bin/phpunit
bamboo_repository_git_username=bantu
bamboo_repository_75956235_revision_number=ff22d54eae45a79f5bc59d2c04f3e02eed8e4981
bamboo_planRepository_branchDisplayName=3.1.x
bamboo_planRepository_1_type=gitv2
bamboo_planRepository_branchName=3.1.x
bamboo_repository_75956235_previous_revision_number=ff22d54eae45a79f5bc59d2c04f3e02eed8e4981
bamboo_capability_system_jdk_JDK=/usr/lib/jvm/java-6-sun
bamboo_plan_storageTag=PHPBB3-PR
bamboo_planRepository_type=gitv2
bamboo_planRepository_1_username=bantu
bamboo_ManualBuildTriggerReason_userName=Build Robot
bamboo_repository_git_repositoryUrl=https://github.com/phpbb/phpbb.git
bamboo_repository_75956235_git_branch=3.1.x
bamboo_capability_system_builder_ant_Ant=/usr/share/ant
bamboo_repository_75956235_name=phpBB Ascraeus
bamboo_working_directory=/home/bamboo/xml-data/build-dir/PHPBB3-PR-JOB1
bamboo_planKey=PHPBB3-PR
bamboo_planRepository_1_repositoryUrl=https://github.com/phpbb/phpbb.git
bamboo_planRepository_username=bantu
bamboo_capability_local=true
bamboo_capability_system_jdk_JDK_1_6=/usr/lib/jvm/java-6-sun
bamboo_capability_system_jdk_JDK_1_7=/usr/lib/jvm/java-7-openjdk-amd64
bamboo_planRepository_1_branchName=3.1.x
21-Apr-2017 21:44:55 Buildfile: /data/build/build.xml
21-Apr-2017 21:44:55
21-Apr-2017 21:44:55 phpBB > sniff:
21-Apr-2017 21:44:55
21-Apr-2017 21:45:03 ............................................................  60 / 699 (9%)
21-Apr-2017 21:45:05 ............................................................ 120 / 699 (17%)
21-Apr-2017 21:45:06 ............................................................ 180 / 699 (26%)
21-Apr-2017 21:45:07 ............................................................ 240 / 699 (34%)
21-Apr-2017 21:45:13 ............................................................ 300 / 699 (43%)
21-Apr-2017 21:45:17 ............................................................ 360 / 699 (52%)
21-Apr-2017 21:45:23 ............................................................ 420 / 699 (60%)
21-Apr-2017 21:45:26 ............................................................ 480 / 699 (69%)
21-Apr-2017 21:45:30 ............................................................ 540 / 699 (77%)
21-Apr-2017 21:45:35 ............................................................ 600 / 699 (86%)
21-Apr-2017 21:45:38 ..................E......................................... 660 / 699 (94%)
21-Apr-2017 21:45:40 .......................................
21-Apr-2017 21:45:40
21-Apr-2017 21:45:40
21-Apr-2017 21:45:40 FILE: /data/phpBB/phpbb/composer/installer.php
21-Apr-2017 21:45:40 ----------------------------------------------------------------------
21-Apr-2017 21:45:40 FOUND 1 ERROR AFFECTING 1 LINE
21-Apr-2017 21:45:40 ----------------------------------------------------------------------
21-Apr-2017 21:45:40 704 | ERROR | Opening brace should be on a new line
21-Apr-2017 21:45:40      |       | (phpbb.ControlStructures.OpeningBraceBsdAllman.BraceOnSameLine)
21-Apr-2017 21:45:40 ----------------------------------------------------------------------
21-Apr-2017 21:45:40
21-Apr-2017 21:45:40 Time: 44.34 secs; Memory: 79.5Mb
21-Apr-2017 21:45:40
21-Apr-2017 21:45:48 ............................................................  60 / 206 (29%)
21-Apr-2017 21:46:07 ............................................................ 120 / 206 (58%)
21-Apr-2017 21:46:22 ............................................................ 180 / 206 (87%)
21-Apr-2017 21:46:29 ..........................
21-Apr-2017 21:46:29
21-Apr-2017 21:46:29 Time: 49.05 secs; Memory: 60.25Mb
21-Apr-2017 21:46:29
21-Apr-2017 21:46:29
21-Apr-2017 21:46:29
21-Apr-2017 21:46:29 Time: 17ms; Memory: 3.5Mb
21-Apr-2017 21:46:29
21-Apr-2017 21:46:29        [if] Error in IfTask
21-Apr-2017 21:46:29 Execution of target "sniff" failed for the following reason: /data/build/build.xml:109:6: /data/build/build.xml:115:9: PHP Code Sniffer failed.
21-Apr-2017 21:46:29
21-Apr-2017 21:46:29 BUILD FAILED
21-Apr-2017 21:46:29 /data/build/build.xml:109:6: /data/build/build.xml:115:9: PHP Code Sniffer failed.
21-Apr-2017 21:46:29 Total time: 2 minutes  33.77 seconds
21-Apr-2017 21:46:29
21-Apr-2017 21:46:29 Failing task since return code of [/usr/bin/docker run --volume /home/bamboo/xml-data/build-dir/PHPBB3-PR-JOB1:/data --workdir /data/build --rm -u=991 phpbb:php-5.6 ../phpBB/vendor/bin/phing sniff] was 1 while expected 0
21-Apr-2017 21:46:29 Error occurred while running Task 'Run sniffs(11)' of type com.atlassian.bamboo.plugins.bamboo-docker-plugin:task.docker.cli.
21-Apr-2017 21:46:29 com.atlassian.bamboo.task.TaskException: Failed to execute task
21-Apr-2017 21:46:29         at com.atlassian.bamboo.plugins.docker.service.RunService.execute(RunService.java:71)
21-Apr-2017 21:46:29         at com.atlassian.bamboo.plugins.docker.tasks.cli.DockerCliTask.execute(DockerCliTask.java:60)
21-Apr-2017 21:46:29         at com.atlassian.bamboo.task.TaskExecutorImpl.lambda$executeTasks$3(TaskExecutorImpl.java:317)
21-Apr-2017 21:46:29         at com.atlassian.bamboo.task.TaskExecutorImpl.executeTaskWithPrePostActions(TaskExecutorImpl.java:246)
21-Apr-2017 21:46:29         at com.atlassian.bamboo.task.TaskExecutorImpl.executeTasks(TaskExecutorImpl.java:317)
21-Apr-2017 21:46:29         at com.atlassian.bamboo.task.TaskExecutorImpl.execute(TaskExecutorImpl.java:118)
21-Apr-2017 21:46:29         at com.atlassian.bamboo.build.pipeline.tasks.ExecuteBuildTask.call(ExecuteBuildTask.java:74)
21-Apr-2017 21:46:29         at com.atlassian.bamboo.v2.build.agent.DefaultBuildAgent.build(DefaultBuildAgent.java:216)
21-Apr-2017 21:46:29         at com.atlassian.bamboo.v2.build.agent.BuildAgentControllerImpl$1.call(BuildAgentControllerImpl.java:139)
21-Apr-2017 21:46:29         at com.atlassian.bamboo.v2.build.agent.BuildAgentControllerImpl$1.call(BuildAgentControllerImpl.java:130)
21-Apr-2017 21:46:29         at com.atlassian.bamboo.variable.CustomVariableContextImpl.withVariableSubstitutor(CustomVariableContextImpl.java:221)
21-Apr-2017 21:46:29         at com.atlassian.bamboo.v2.build.agent.BuildAgentControllerImpl.waitAndPerformBuild(BuildAgentControllerImpl.java:129)
21-Apr-2017 21:46:29         at com.atlassian.bamboo.v2.build.agent.DefaultBuildAgent$1.run(DefaultBuildAgent.java:138)
21-Apr-2017 21:46:29         at com.atlassian.bamboo.utils.BambooRunnables$1.run(BambooRunnables.java:51)
21-Apr-2017 21:46:29         at com.atlassian.bamboo.security.ImpersonationHelper.runWith(ImpersonationHelper.java:31)
21-Apr-2017 21:46:29         at com.atlassian.bamboo.security.ImpersonationHelper.runWithSystemAuthority(ImpersonationHelper.java:20)
21-Apr-2017 21:46:29         at com.atlassian.bamboo.security.ImpersonationHelper$1.run(ImpersonationHelper.java:52)
21-Apr-2017 21:46:29         at java.lang.Thread.run(Thread.java:745)
21-Apr-2017 21:46:29 Caused by: com.atlassian.bamboo.plugins.docker.client.DockerException: Error running Docker run command
21-Apr-2017 21:46:29         at com.atlassian.bamboo.plugins.docker.client.DockerCmd.run(DockerCmd.java:103)
21-Apr-2017 21:46:29         at com.atlassian.bamboo.plugins.docker.service.RunService.execute(RunService.java:60)
21-Apr-2017 21:46:29         ... 17 more
21-Apr-2017 21:46:29 Caused by: com.atlassian.utils.process.ProcessException: Error executing /usr/bin/docker run --volume /home/bamboo/xml-data/build-dir/PHPBB3-PR-JOB1:/data --workdir /data/build --rm -u=991 phpbb:php-5.6 ../phpBB/vendor/bin/phing sniff
21-Apr-2017 21:46:29         at com.atlassian.bamboo.plugins.docker.process.DockerTaskProcessService.execute(DockerTaskProcessService.java:60)
21-Apr-2017 21:46:29         at com.atlassian.bamboo.plugins.docker.client.DockerCmd.run(DockerCmd.java:99)
21-Apr-2017 21:46:29         ... 18 more
21-Apr-2017 21:46:29 Starting task 'Parsing test results produced by script' of type 'com.atlassian.bamboo.plugins.testresultparser:task.testresultparser.junit'
21-Apr-2017 21:46:29 Parsing test results under /home/bamboo/xml-data/build-dir/PHPBB3-PR-JOB1...
21-Apr-2017 21:46:29 Failing task since test cases were expected but none were found.
21-Apr-2017 21:46:29 Finished task 'Parsing test results produced by script' with result: Failed
21-Apr-2017 21:46:29
Substituting variable: ${bamboo.PRnumber} with 3909
21-Apr-2017 21:46:29
Substituting variable: ${bamboo.buildResultsUrl} with https://bamboo.phpbb.com/browse/PHPBB3-PR-JOB1-7043
21-Apr-2017 21:46:29
Substituting variable: ${bamboo.buildResultsUrl} with https://bamboo.phpbb.com/browse/PHPBB3-PR-JOB1-7043
21-Apr-2017 21:46:29 Starting task 'Set result build status' of type 'com.atlassian.bamboo.plugins.scripttask:task.builder.script'
21-Apr-2017 21:46:29
Beginning to execute external process for build 'phpBB3 - Pull Requests - Build and Test Job #7043 (PHPBB3-PR-JOB1-7043)'
... running command line:
/bin/sh /home/bamboo/temp/PHPBB3-PR-JOB1-7043-ScriptBuildTask-4159222890083953045.sh
... in: /home/bamboo/xml-data/build-dir/PHPBB3-PR-JOB1
... using extra environment variables:
bamboo_planRepository_1_branch=3.1.x
bamboo_planRepository_1_branchDisplayName=3.1.x
bamboo_repository_revision_number=ff22d54eae45a79f5bc59d2c04f3e02eed8e4981
bamboo_PRref=master
bamboo_resultsUrl=https://bamboo.phpbb.com/browse/PHPBB3-PR-JOB1-7043
bamboo_capability_system_builder_command_Git=/usr/bin/git
bamboo_repository_75956235_git_username=bantu
bamboo_planRepository_1_name=phpBB Ascraeus
bamboo_build_working_directory=/home/bamboo/xml-data/build-dir/PHPBB3-PR-JOB1
bamboo_buildKey=PHPBB3-PR-JOB1
bamboo_capability_phpbb_tests=true
bamboo_shortPlanName=Pull Requests
bamboo_capability_system_builder_command_fop=/usr/bin/fop
bamboo_capability_dbms_sqlite_2=true
bamboo_planRepository_name=phpBB Ascraeus
bamboo_PRnumber=3909
bamboo_buildNumber=7043
bamboo_repository_75956235_git_repositoryUrl=https://github.com/phpbb/phpbb.git
bamboo_capability_system_builder_phpunit_PHPUnit=/usr/bin/phpunit
bamboo_shortJobName=Build and Test Job
bamboo_buildResultsUrl=https://bamboo.phpbb.com/browse/PHPBB3-PR-JOB1-7043
bamboo_repository_75956235_branch_name=3.1.x
bamboo_planRepository_repositoryUrl=https://github.com/phpbb/phpbb.git
bamboo_agentId=131073
bamboo_planName=phpBB3 - Pull Requests
bamboo_build_commandline_com_atlassian_bamboo_plugins_scripttask_task_builder_script_7=/bin/sh /home/bamboo/temp/PHPBB3-PR-JOB1-7043-ScriptBuildTask-7909767124295626700.sh
bamboo_shortPlanKey=PR
bamboo_shortJobKey=JOB1
bamboo_capability_dbms_mysql_55=true
bamboo_capability_system_jdk_JDK_1_7_0_65=/usr/lib/jvm/java-7-openjdk-amd64
bamboo_planRepository_revision=ff22d54eae45a79f5bc59d2c04f3e02eed8e4981
bamboo_repository_previous_revision_number=ff22d54eae45a79f5bc59d2c04f3e02eed8e4981
bamboo_buildTimeStamp=2017-04-21T21:43:28.299Z
bamboo_planRepository_previousRevision=ff22d54eae45a79f5bc59d2c04f3e02eed8e4981
bamboo_capability_system_builder_mvn2_Maven_2=/usr/share/maven2
bamboo_capability_system_jdk_JDK_1_6_0_16=/usr/lib/jvm/java-6-sun-1.6.0.16
bamboo_build_commandline_com_atlassian_bamboo_plugins_scripttask_task_builder_script_4=/bin/sh /home/bamboo/temp/PHPBB3-PR-JOB1-7043-ScriptBuildTask-6326850728795392458.sh
bamboo_buildResultKey=PHPBB3-PR-JOB1-7043
bamboo_repository_git_branch=3.1.x
bamboo_repository_branch_name=3.1.x
bamboo_buildPlanName=phpBB3 - Pull Requests - Build and Test Job
bamboo_planRepository_1_revision=ff22d54eae45a79f5bc59d2c04f3e02eed8e4981
bamboo_repository_name=phpBB Ascraeus
bamboo_capability_system_docker_executable=/usr/bin/docker
bamboo_build_commandline_com_atlassian_bamboo_plugins_bamboo_docker_plugin_task_docker_cli_11=/usr/bin/docker run --volume /home/bamboo/xml-data/build-dir/PHPBB3-PR-JOB1:/data --workdir /data/build --rm -u=991 phpbb:php-5.6 ../phpBB/vendor/bin/phing sniff
bamboo_build_commandline_com_atlassian_bamboo_plugins_bamboo_docker_plugin_task_docker_cli_12=/usr/bin/docker run --volume /home/bamboo/xml-data/build-dir/PHPBB3-PR-JOB1:/data --workdir /data/phpBB --rm -e HOME=/home/bamboo -u=991 phpbb:php-5.6 /bin/bash -c php ../composer.phar install --dev; cd ../build; ../phpBB/vendor/bin/phing clean prepare
bamboo_planRepository_branch=3.1.x
bamboo_agentWorkingDirectory=/home/bamboo/xml-data/build-dir
bamboo_capability_system_git_executable=/usr/bin/git
bamboo_planRepository_1_previousRevision=ff22d54eae45a79f5bc59d2c04f3e02eed8e4981
bamboo_capability_system_builder_phpunit_PHPUnit_3_4=/usr/bin/phpunit
bamboo_repository_git_username=bantu
bamboo_repository_75956235_revision_number=ff22d54eae45a79f5bc59d2c04f3e02eed8e4981
bamboo_planRepository_branchDisplayName=3.1.x
bamboo_planRepository_1_type=gitv2
bamboo_planRepository_branchName=3.1.x
bamboo_repository_75956235_previous_revision_number=ff22d54eae45a79f5bc59d2c04f3e02eed8e4981
bamboo_capability_system_jdk_JDK=/usr/lib/jvm/java-6-sun
bamboo_plan_storageTag=PHPBB3-PR
bamboo_planRepository_type=gitv2
bamboo_planRepository_1_username=bantu
bamboo_ManualBuildTriggerReason_userName=Build Robot
bamboo_repository_git_repositoryUrl=https://github.com/phpbb/phpbb.git
bamboo_repository_75956235_git_branch=3.1.x
bamboo_capability_system_builder_ant_Ant=/usr/share/ant
bamboo_repository_75956235_name=phpBB Ascraeus
bamboo_working_directory=/home/bamboo/xml-data/build-dir/PHPBB3-PR-JOB1
bamboo_planKey=PHPBB3-PR
bamboo_planRepository_1_repositoryUrl=https://github.com/phpbb/phpbb.git
bamboo_planRepository_username=bantu
bamboo_capability_local=true
bamboo_capability_system_jdk_JDK_1_6=/usr/lib/jvm/java-6-sun
bamboo_capability_system_jdk_JDK_1_7=/usr/lib/jvm/java-7-openjdk-amd64
bamboo_planRepository_1_branchName=3.1.x
21-Apr-2017 21:46:29 From https://github.com/phpbb/phpbb
21-Apr-2017 21:46:29 * branch            refs/pull/3909/head -> FETCH_HEAD
21-Apr-2017 21:46:29 grep: build/logs/phpunit.xml: No such file or directory
21-Apr-2017 21:46:29 grep: build/logs/phpunit.xml: No such file or directory
21-Apr-2017 21:46:29   % Total    % Received % Xferd  Average Speed   Time    Time     Time  Current
21-Apr-2017 21:46:29                                  Dload  Upload   Total   Spent    Left  Speed
21-Apr-2017 21:46:29
21-Apr-2017 21:46:30   0     0    0     0    0     0      0      0 --:--:-- --:--:-- --:--:--     0
21-Apr-2017 21:46:30   0     0    0     0    0     0      0      0 --:--:-- --:--:-- --:--:--     0
21-Apr-2017 21:46:30 100   273  100    93  100   180    185    358 --:--:-- --:--:-- --:--:--   358
21-Apr-2017 21:46:30 Finished task 'Set result build status' with result: Success
21-Apr-2017 21:46:30 Running post build plugin 'NCover Results Collector'
21-Apr-2017 21:46:30 Running post build plugin 'Artifact Copier'
21-Apr-2017 21:46:30 Running post build plugin 'npm Cache Cleanup'
21-Apr-2017 21:46:30 Running post build plugin 'Clover Results Collector'
21-Apr-2017 21:46:30 Running post build plugin 'Docker Container Cleanup'
21-Apr-2017 21:46:30 Successfully removed working directory at '/home/bamboo/xml-data/build-dir/PHPBB3-PR-JOB1'
21-Apr-2017 21:46:30 Finalising the build...
21-Apr-2017 21:46:30 Stopping timer.
21-Apr-2017 21:46:30 Build PHPBB3-PR-JOB1-7043 completed.
21-Apr-2017 21:46:30 Running on server: post build plugin 'NCover Results Collector'
21-Apr-2017 21:46:30 Running on server: post build plugin 'Build Hanging Detection Configuration'
21-Apr-2017 21:46:30 Running on server: post build plugin 'Clover Delta Calculator'
21-Apr-2017 21:46:30 Running on server: post build plugin 'Maven Dependencies Postprocessor'
21-Apr-2017 21:46:30 All post build plugins have finished
21-Apr-2017 21:46:30 Generating build results summary...
21-Apr-2017 21:46:30 Saving build results to disk...
21-Apr-2017 21:46:30 Logging substituted variables...
21-Apr-2017 21:46:30 Indexing build results...
21-Apr-2017 21:46:30 Finished building PHPBB3-PR-JOB1-7043.
21-Apr-2017 21:46:30
Substituting variable: ${bamboo.PRnumber} with 3909