Tests pending pull requests

Build: #7175 failed

Job: Build and Test Job failed

Stages & jobs

  1. Build and Test

Build log

The build generated 624 lines of output. Download or view full build log

14-May-2017 03:44:21 Build phpBB3 - Pull Requests - Build and Test Job #7175 (PHPBB3-PR-JOB1-7175) started building on agent Default Agent
14-May-2017 03:44:21
14-May-2017 03:44:21 Build working directory is /home/bamboo/xml-data/build-dir/PHPBB3-PR-JOB1
14-May-2017 03:44:21 Executing build phpBB3 - Pull Requests - Build and Test Job #7175 (PHPBB3-PR-JOB1-7175)
14-May-2017 03:44:21 Starting task 'Checkout develop branch' of type 'com.atlassian.bamboo.plugins.vcs:task.vcs.checkout'
14-May-2017 03:44:21 Build always requires a clean checkout
14-May-2017 03:44:21 Cleaning build directory '/home/bamboo/xml-data/build-dir/PHPBB3-PR-JOB1'
14-May-2017 03:44:21 Updating source code to revision: 0984dbb3f89543b959223a21d2e6d9e6db615d98
14-May-2017 03:44:21 Fetching 'refs/heads/3.1.x' from 'https://github.com/phpbb/phpbb.git'.
14-May-2017 03:44:21 Checking out revision 0984dbb3f89543b959223a21d2e6d9e6db615d98.
14-May-2017 03:44:21 Creating local git repository in '/home/bamboo/xml-data/build-dir/PHPBB3-PR-JOB1/.git'.
14-May-2017 03:44:21 Cloning into '/home/bamboo/xml-data/build-dir/PHPBB3-PR-JOB1'...
14-May-2017 03:44:21 done.
14-May-2017 03:44:23 Switched to a new branch '3.1.x'
14-May-2017 03:44:23 Branch 3.1.x set up to track remote branch 3.1.x from origin.
14-May-2017 03:44:23 Updated source code to revision: 0984dbb3f89543b959223a21d2e6d9e6db615d98
14-May-2017 03:44:23 Finished task 'Checkout develop branch' with result: Success
14-May-2017 03:44:23 Running pre-build action: VCS Version Collector
14-May-2017 03:44:23
Substituting variable: ${bamboo.PRnumber} with 4624
14-May-2017 03:44:23
Substituting variable: ${bamboo.buildResultsUrl} with https://bamboo.phpbb.com/browse/PHPBB3-PR-JOB1-7175
14-May-2017 03:44:23 Starting task 'Set pending build status' of type 'com.atlassian.bamboo.plugins.scripttask:task.builder.script'
14-May-2017 03:44:23
Beginning to execute external process for build 'phpBB3 - Pull Requests - Build and Test Job #7175 (PHPBB3-PR-JOB1-7175)'
... running command line:
/bin/sh /home/bamboo/temp/PHPBB3-PR-JOB1-7175-ScriptBuildTask-1648805300866020387.sh
... in: /home/bamboo/xml-data/build-dir/PHPBB3-PR-JOB1
... using extra environment variables:
bamboo_planRepository_1_branch=3.1.x
bamboo_planRepository_1_branchDisplayName=3.1.x
bamboo_repository_revision_number=0984dbb3f89543b959223a21d2e6d9e6db615d98
bamboo_PRref=master
bamboo_resultsUrl=https://bamboo.phpbb.com/browse/PHPBB3-PR-JOB1-7175
bamboo_capability_system_builder_command_Git=/usr/bin/git
bamboo_repository_75956235_git_username=bantu
bamboo_planRepository_1_name=phpBB Ascraeus
bamboo_build_working_directory=/home/bamboo/xml-data/build-dir/PHPBB3-PR-JOB1
bamboo_buildKey=PHPBB3-PR-JOB1
bamboo_capability_phpbb_tests=true
bamboo_shortPlanName=Pull Requests
bamboo_capability_system_builder_command_fop=/usr/bin/fop
bamboo_capability_dbms_sqlite_2=true
bamboo_planRepository_name=phpBB Ascraeus
bamboo_PRnumber=4624
bamboo_buildNumber=7175
bamboo_repository_75956235_git_repositoryUrl=https://github.com/phpbb/phpbb.git
bamboo_capability_system_builder_phpunit_PHPUnit=/usr/bin/phpunit
bamboo_shortJobName=Build and Test Job
bamboo_buildResultsUrl=https://bamboo.phpbb.com/browse/PHPBB3-PR-JOB1-7175
bamboo_repository_75956235_branch_name=3.1.x
bamboo_planRepository_repositoryUrl=https://github.com/phpbb/phpbb.git
bamboo_agentId=131073
bamboo_planName=phpBB3 - Pull Requests
bamboo_shortPlanKey=PR
bamboo_shortJobKey=JOB1
bamboo_capability_dbms_mysql_55=true
bamboo_capability_system_jdk_JDK_1_7_0_65=/usr/lib/jvm/java-7-openjdk-amd64
bamboo_planRepository_revision=0984dbb3f89543b959223a21d2e6d9e6db615d98
bamboo_repository_previous_revision_number=0984dbb3f89543b959223a21d2e6d9e6db615d98
bamboo_buildTimeStamp=2017-05-14T03:44:21.570Z
bamboo_planRepository_previousRevision=0984dbb3f89543b959223a21d2e6d9e6db615d98
bamboo_capability_system_builder_mvn2_Maven_2=/usr/share/maven2
bamboo_capability_system_jdk_JDK_1_6_0_16=/usr/lib/jvm/java-6-sun-1.6.0.16
bamboo_buildResultKey=PHPBB3-PR-JOB1-7175
bamboo_repository_git_branch=3.1.x
bamboo_repository_branch_name=3.1.x
bamboo_buildPlanName=phpBB3 - Pull Requests - Build and Test Job
bamboo_planRepository_1_revision=0984dbb3f89543b959223a21d2e6d9e6db615d98
bamboo_repository_name=phpBB Ascraeus
bamboo_capability_system_docker_executable=/usr/bin/docker
bamboo_planRepository_branch=3.1.x
bamboo_agentWorkingDirectory=/home/bamboo/xml-data/build-dir
bamboo_capability_system_git_executable=/usr/bin/git
bamboo_planRepository_1_previousRevision=0984dbb3f89543b959223a21d2e6d9e6db615d98
bamboo_capability_system_builder_phpunit_PHPUnit_3_4=/usr/bin/phpunit
bamboo_repository_git_username=bantu
bamboo_repository_75956235_revision_number=0984dbb3f89543b959223a21d2e6d9e6db615d98
bamboo_planRepository_branchDisplayName=3.1.x
bamboo_planRepository_1_type=gitv2
bamboo_planRepository_branchName=3.1.x
bamboo_repository_75956235_previous_revision_number=0984dbb3f89543b959223a21d2e6d9e6db615d98
bamboo_capability_system_jdk_JDK=/usr/lib/jvm/java-6-sun
bamboo_plan_storageTag=PHPBB3-PR
bamboo_planRepository_type=gitv2
bamboo_planRepository_1_username=bantu
bamboo_ManualBuildTriggerReason_userName=Build Robot
bamboo_repository_git_repositoryUrl=https://github.com/phpbb/phpbb.git
bamboo_repository_75956235_git_branch=3.1.x
bamboo_capability_system_builder_ant_Ant=/usr/share/ant
bamboo_repository_75956235_name=phpBB Ascraeus
bamboo_working_directory=/home/bamboo/xml-data/build-dir/PHPBB3-PR-JOB1
bamboo_planKey=PHPBB3-PR
bamboo_planRepository_1_repositoryUrl=https://github.com/phpbb/phpbb.git
bamboo_planRepository_username=bantu
bamboo_capability_local=true
bamboo_capability_system_jdk_JDK_1_6=/usr/lib/jvm/java-6-sun
bamboo_capability_system_jdk_JDK_1_7=/usr/lib/jvm/java-7-openjdk-amd64
bamboo_planRepository_1_branchName=3.1.x
14-May-2017 03:44:24 From https://github.com/phpbb/phpbb
14-May-2017 03:44:24 * branch            refs/pull/4624/head -> FETCH_HEAD
14-May-2017 03:44:24   % Total    % Received % Xferd  Average Speed   Time    Time     Time  Current
14-May-2017 03:44:24                                  Dload  Upload   Total   Spent    Left  Speed
14-May-2017 03:44:24
14-May-2017 03:44:25   0     0    0     0    0     0      0      0 --:--:-- --:--:-- --:--:--     0
14-May-2017 03:44:25 100   275  100    93  100   182    182    356 --:--:-- --:--:-- --:--:--   356
14-May-2017 03:44:25 Finished task 'Set pending build status' with result: Success
14-May-2017 03:44:25
Substituting variable: ${bamboo.PRnumber} with 4624
14-May-2017 03:44:25 Starting task 'Fetch PR' of type 'com.atlassian.bamboo.plugins.scripttask:task.builder.script'
14-May-2017 03:44:25
Beginning to execute external process for build 'phpBB3 - Pull Requests - Build and Test Job #7175 (PHPBB3-PR-JOB1-7175)'
... running command line:
/bin/sh /home/bamboo/temp/PHPBB3-PR-JOB1-7175-ScriptBuildTask-529078485476089059.sh
... in: /home/bamboo/xml-data/build-dir/PHPBB3-PR-JOB1
... using extra environment variables:
bamboo_planRepository_1_branch=3.1.x
bamboo_planRepository_1_branchDisplayName=3.1.x
bamboo_repository_revision_number=0984dbb3f89543b959223a21d2e6d9e6db615d98
bamboo_PRref=master
bamboo_resultsUrl=https://bamboo.phpbb.com/browse/PHPBB3-PR-JOB1-7175
bamboo_capability_system_builder_command_Git=/usr/bin/git
bamboo_repository_75956235_git_username=bantu
bamboo_planRepository_1_name=phpBB Ascraeus
bamboo_build_working_directory=/home/bamboo/xml-data/build-dir/PHPBB3-PR-JOB1
bamboo_buildKey=PHPBB3-PR-JOB1
bamboo_capability_phpbb_tests=true
bamboo_shortPlanName=Pull Requests
bamboo_capability_system_builder_command_fop=/usr/bin/fop
bamboo_capability_dbms_sqlite_2=true
bamboo_planRepository_name=phpBB Ascraeus
bamboo_PRnumber=4624
bamboo_buildNumber=7175
bamboo_repository_75956235_git_repositoryUrl=https://github.com/phpbb/phpbb.git
bamboo_capability_system_builder_phpunit_PHPUnit=/usr/bin/phpunit
bamboo_shortJobName=Build and Test Job
bamboo_buildResultsUrl=https://bamboo.phpbb.com/browse/PHPBB3-PR-JOB1-7175
bamboo_repository_75956235_branch_name=3.1.x
bamboo_planRepository_repositoryUrl=https://github.com/phpbb/phpbb.git
bamboo_agentId=131073
bamboo_planName=phpBB3 - Pull Requests
bamboo_build_commandline_com_atlassian_bamboo_plugins_scripttask_task_builder_script_7=/bin/sh /home/bamboo/temp/PHPBB3-PR-JOB1-7175-ScriptBuildTask-1648805300866020387.sh
bamboo_shortPlanKey=PR
bamboo_shortJobKey=JOB1
bamboo_capability_dbms_mysql_55=true
bamboo_capability_system_jdk_JDK_1_7_0_65=/usr/lib/jvm/java-7-openjdk-amd64
bamboo_planRepository_revision=0984dbb3f89543b959223a21d2e6d9e6db615d98
bamboo_repository_previous_revision_number=0984dbb3f89543b959223a21d2e6d9e6db615d98
bamboo_buildTimeStamp=2017-05-14T03:44:21.570Z
bamboo_planRepository_previousRevision=0984dbb3f89543b959223a21d2e6d9e6db615d98
bamboo_capability_system_builder_mvn2_Maven_2=/usr/share/maven2
bamboo_capability_system_jdk_JDK_1_6_0_16=/usr/lib/jvm/java-6-sun-1.6.0.16
bamboo_buildResultKey=PHPBB3-PR-JOB1-7175
bamboo_repository_git_branch=3.1.x
bamboo_repository_branch_name=3.1.x
bamboo_buildPlanName=phpBB3 - Pull Requests - Build and Test Job
bamboo_planRepository_1_revision=0984dbb3f89543b959223a21d2e6d9e6db615d98
bamboo_repository_name=phpBB Ascraeus
bamboo_capability_system_docker_executable=/usr/bin/docker
bamboo_planRepository_branch=3.1.x
bamboo_agentWorkingDirectory=/home/bamboo/xml-data/build-dir
bamboo_capability_system_git_executable=/usr/bin/git
bamboo_planRepository_1_previousRevision=0984dbb3f89543b959223a21d2e6d9e6db615d98
bamboo_capability_system_builder_phpunit_PHPUnit_3_4=/usr/bin/phpunit
bamboo_repository_git_username=bantu
bamboo_repository_75956235_revision_number=0984dbb3f89543b959223a21d2e6d9e6db615d98
bamboo_planRepository_branchDisplayName=3.1.x
bamboo_planRepository_1_type=gitv2
bamboo_planRepository_branchName=3.1.x
bamboo_repository_75956235_previous_revision_number=0984dbb3f89543b959223a21d2e6d9e6db615d98
bamboo_capability_system_jdk_JDK=/usr/lib/jvm/java-6-sun
bamboo_plan_storageTag=PHPBB3-PR
bamboo_planRepository_type=gitv2
bamboo_planRepository_1_username=bantu
bamboo_ManualBuildTriggerReason_userName=Build Robot
bamboo_repository_git_repositoryUrl=https://github.com/phpbb/phpbb.git
bamboo_repository_75956235_git_branch=3.1.x
bamboo_capability_system_builder_ant_Ant=/usr/share/ant
bamboo_repository_75956235_name=phpBB Ascraeus
bamboo_working_directory=/home/bamboo/xml-data/build-dir/PHPBB3-PR-JOB1
bamboo_planKey=PHPBB3-PR
bamboo_planRepository_1_repositoryUrl=https://github.com/phpbb/phpbb.git
bamboo_planRepository_username=bantu
bamboo_capability_local=true
bamboo_capability_system_jdk_JDK_1_6=/usr/lib/jvm/java-6-sun
bamboo_capability_system_jdk_JDK_1_7=/usr/lib/jvm/java-7-openjdk-amd64
bamboo_planRepository_1_branchName=3.1.x
14-May-2017 03:44:26 From https://github.com/phpbb/phpbb
14-May-2017 03:44:26 * branch            refs/pull/4624/merge -> FETCH_HEAD
14-May-2017 03:44:26 Note: checking out 'FETCH_HEAD'.
14-May-2017 03:44:26
14-May-2017 03:44:26 You are in 'detached HEAD' state. You can look around, make experimental
14-May-2017 03:44:26 changes and commit them, and you can discard any commits you make in this
14-May-2017 03:44:26 state without impacting any branches by performing another checkout.
14-May-2017 03:44:26
14-May-2017 03:44:26 If you want to create a new branch to retain commits you create, you may
14-May-2017 03:44:26 do so (now or later) by using -b with the checkout command again. Example:
14-May-2017 03:44:26
14-May-2017 03:44:26   git checkout -b new_branch_name
14-May-2017 03:44:26
14-May-2017 03:44:26 HEAD is now at cc8c077... Merge 6f5bc7430555deebba5c4e101d9a7929703af031 into 52dd4895c89e75c2e6cddd1933bfe310c272e66a
14-May-2017 03:44:26 Finished task 'Fetch PR' with result: Success
14-May-2017 03:44:26 Skipping execution of task 'Prepare directory' as it is disabled
14-May-2017 03:44:26
Substituting variable: ${bamboo.working.directory} with /home/bamboo/xml-data/build-dir/PHPBB3-PR-JOB1
14-May-2017 03:44:26 Starting task 'Prepare directory' of type 'com.atlassian.bamboo.plugins.bamboo-docker-plugin:task.docker.cli'
14-May-2017 03:44:26 Running image name (phpbb:php-5.6)
14-May-2017 03:44:26
Beginning to execute external process for build 'phpBB3 - Pull Requests - Build and Test Job #7175 (PHPBB3-PR-JOB1-7175)'
... running command line:
/usr/bin/docker run --volume /home/bamboo/xml-data/build-dir/PHPBB3-PR-JOB1:/data --workdir /data/phpBB --rm -e HOME=/home/bamboo -u=991 phpbb:php-5.6 /bin/bash -c php ../composer.phar install --dev; cd ../build; ../phpBB/vendor/bin/phing clean prepare
... in: /home/bamboo/xml-data/build-dir/PHPBB3-PR-JOB1
... using extra environment variables:
bamboo_planRepository_1_branch=3.1.x
bamboo_planRepository_1_branchDisplayName=3.1.x
bamboo_repository_revision_number=0984dbb3f89543b959223a21d2e6d9e6db615d98
bamboo_PRref=master
bamboo_resultsUrl=https://bamboo.phpbb.com/browse/PHPBB3-PR-JOB1-7175
bamboo_capability_system_builder_command_Git=/usr/bin/git
bamboo_repository_75956235_git_username=bantu
bamboo_planRepository_1_name=phpBB Ascraeus
bamboo_build_working_directory=/home/bamboo/xml-data/build-dir/PHPBB3-PR-JOB1
bamboo_buildKey=PHPBB3-PR-JOB1
bamboo_capability_phpbb_tests=true
bamboo_shortPlanName=Pull Requests
bamboo_capability_system_builder_command_fop=/usr/bin/fop
bamboo_capability_dbms_sqlite_2=true
bamboo_planRepository_name=phpBB Ascraeus
bamboo_PRnumber=4624
bamboo_buildNumber=7175
bamboo_repository_75956235_git_repositoryUrl=https://github.com/phpbb/phpbb.git
bamboo_capability_system_builder_phpunit_PHPUnit=/usr/bin/phpunit
bamboo_shortJobName=Build and Test Job
bamboo_buildResultsUrl=https://bamboo.phpbb.com/browse/PHPBB3-PR-JOB1-7175
bamboo_repository_75956235_branch_name=3.1.x
bamboo_planRepository_repositoryUrl=https://github.com/phpbb/phpbb.git
bamboo_agentId=131073
bamboo_planName=phpBB3 - Pull Requests
bamboo_build_commandline_com_atlassian_bamboo_plugins_scripttask_task_builder_script_7=/bin/sh /home/bamboo/temp/PHPBB3-PR-JOB1-7175-ScriptBuildTask-1648805300866020387.sh
bamboo_shortPlanKey=PR
bamboo_shortJobKey=JOB1
bamboo_capability_dbms_mysql_55=true
bamboo_capability_system_jdk_JDK_1_7_0_65=/usr/lib/jvm/java-7-openjdk-amd64
bamboo_planRepository_revision=0984dbb3f89543b959223a21d2e6d9e6db615d98
bamboo_repository_previous_revision_number=0984dbb3f89543b959223a21d2e6d9e6db615d98
bamboo_buildTimeStamp=2017-05-14T03:44:21.570Z
bamboo_planRepository_previousRevision=0984dbb3f89543b959223a21d2e6d9e6db615d98
bamboo_capability_system_builder_mvn2_Maven_2=/usr/share/maven2
bamboo_capability_system_jdk_JDK_1_6_0_16=/usr/lib/jvm/java-6-sun-1.6.0.16
bamboo_build_commandline_com_atlassian_bamboo_plugins_scripttask_task_builder_script_4=/bin/sh /home/bamboo/temp/PHPBB3-PR-JOB1-7175-ScriptBuildTask-529078485476089059.sh
bamboo_buildResultKey=PHPBB3-PR-JOB1-7175
bamboo_repository_git_branch=3.1.x
bamboo_repository_branch_name=3.1.x
bamboo_buildPlanName=phpBB3 - Pull Requests - Build and Test Job
bamboo_planRepository_1_revision=0984dbb3f89543b959223a21d2e6d9e6db615d98
bamboo_repository_name=phpBB Ascraeus
bamboo_capability_system_docker_executable=/usr/bin/docker
bamboo_planRepository_branch=3.1.x
bamboo_agentWorkingDirectory=/home/bamboo/xml-data/build-dir
bamboo_capability_system_git_executable=/usr/bin/git
bamboo_planRepository_1_previousRevision=0984dbb3f89543b959223a21d2e6d9e6db615d98
bamboo_capability_system_builder_phpunit_PHPUnit_3_4=/usr/bin/phpunit
bamboo_repository_git_username=bantu
bamboo_repository_75956235_revision_number=0984dbb3f89543b959223a21d2e6d9e6db615d98
bamboo_planRepository_branchDisplayName=3.1.x
bamboo_planRepository_1_type=gitv2
bamboo_planRepository_branchName=3.1.x
bamboo_repository_75956235_previous_revision_number=0984dbb3f89543b959223a21d2e6d9e6db615d98
bamboo_capability_system_jdk_JDK=/usr/lib/jvm/java-6-sun
bamboo_plan_storageTag=PHPBB3-PR
bamboo_planRepository_type=gitv2
bamboo_planRepository_1_username=bantu
bamboo_ManualBuildTriggerReason_userName=Build Robot
bamboo_repository_git_repositoryUrl=https://github.com/phpbb/phpbb.git
bamboo_repository_75956235_git_branch=3.1.x
bamboo_capability_system_builder_ant_Ant=/usr/share/ant
bamboo_repository_75956235_name=phpBB Ascraeus
bamboo_working_directory=/home/bamboo/xml-data/build-dir/PHPBB3-PR-JOB1
bamboo_planKey=PHPBB3-PR
bamboo_planRepository_1_repositoryUrl=https://github.com/phpbb/phpbb.git
bamboo_planRepository_username=bantu
bamboo_capability_local=true
bamboo_capability_system_jdk_JDK_1_6=/usr/lib/jvm/java-6-sun
bamboo_capability_system_jdk_JDK_1_7=/usr/lib/jvm/java-7-openjdk-amd64
bamboo_planRepository_1_branchName=3.1.x
14-May-2017 03:44:26 You are running composer with xdebug enabled. This has a major impact on runtime performance. See https://getcomposer.org/xdebug
14-May-2017 03:44:26 You are using the deprecated option "dev". Dev packages are installed by default now.
14-May-2017 03:44:26 Cannot create cache directory /home/bamboo/.composer/cache/repo/https---packagist.org/, or directory is not writable. Proceeding without cache
14-May-2017 03:44:26 Cannot create cache directory /home/bamboo/.composer/cache/files/, or directory is not writable. Proceeding without cache
14-May-2017 03:44:26 Loading composer repositories with package information
14-May-2017 03:44:26 Installing dependencies (including require-dev) from lock file
14-May-2017 03:44:27   - Installing bantu/ini-get-wrapper (v1.0.1)
14-May-2017 03:44:27     Downloading: Connecting...    Downloading: 0%               Downloading: 100%    Downloading: 100%
14-May-2017 03:44:27
14-May-2017 03:44:27   - Installing symfony/process (v3.2.8)
14-May-2017 03:44:28     Downloading: Connecting...    Downloading: 0%               Downloading: 20%    Downloading: 40%    Downloading: 60%    Downloading: 80%    Downloading: 100%
14-May-2017 03:44:28
14-May-2017 03:44:28   - Installing symfony/finder (v3.2.0)
14-May-2017 03:44:29     Downloading: Connecting...    Downloading: 0%               Downloading: 5%    Downloading: 10%    Downloading: 15%    Downloading: 20%    Downloading: 25%    Downloading: 100%
14-May-2017 03:44:29
14-May-2017 03:44:29   - Installing symfony/filesystem (v3.2.0)
14-May-2017 03:44:30     Downloading: Connecting...    Downloading: 0%               Downloading: 35%    Downloading: 40%    Downloading: 75%    Downloading: 95%    Downloading: 100%    Downloading: 100%
14-May-2017 03:44:30
14-May-2017 03:44:30   - Installing symfony/polyfill-mbstring (v1.3.0)
14-May-2017 03:44:30     Downloading: Connecting...    Downloading: 0%               Downloading: 35%    Downloading: 70%    Downloading: 100%
14-May-2017 03:44:30
14-May-2017 03:44:30   - Installing psr/log (1.0.2)
14-May-2017 03:44:31     Downloading: Connecting...    Downloading: 0%               Downloading: 15%    Downloading: 100%
14-May-2017 03:44:31
14-May-2017 03:44:31   - Installing symfony/debug (v3.2.0)
14-May-2017 03:44:32     Downloading: Connecting...    Downloading: 0%               Downloading: 5%    Downloading: 15%    Downloading: 20%    Downloading: 25%    Downloading: 35%    Downloading: 40%    Downloading: 45%    Downloading: 80%    Downloading: 85%    Downloading: 95%    Downloading: 100%    Downloading: 100%
14-May-2017 03:44:32
14-May-2017 03:44:32   - Installing symfony/console (v3.2.0)
14-May-2017 03:44:32     Downloading: Connecting...    Downloading: 0%               Downloading: 5%    Downloading: 10%    Downloading: 15%    Downloading: 20%    Downloading: 25%    Downloading: 30%    Downloading: 35%    Downloading: 40%    Downloading: 45%    Downloading: 50%    Downloading: 55%    Downloading: 60%    Downloading: 65%    Downloading: 70%    Downloading: 75%    Downloading: 80%    Downloading: 85%    Downloading: 90%    Downloading: 95%    Downloading: 100%    Downloading: 100%
14-May-2017 03:44:32
14-May-2017 03:44:32   - Installing seld/phar-utils (1.0.1)
14-May-2017 03:44:33     Downloading: Connecting...    Downloading: 0%               Downloading: 30%    Downloading: 60%    Downloading: 85%    Downloading: 100%
14-May-2017 03:44:33
14-May-2017 03:44:33   - Installing seld/jsonlint (1.6.0)
14-May-2017 03:44:33     Downloading: Connecting...    Downloading: 0%               Downloading: 40%    Downloading: 85%    Downloading: 100%    Downloading: 100%
14-May-2017 03:44:33
14-May-2017 03:44:33   - Installing seld/cli-prompt (1.0.3)
14-May-2017 03:44:34     Downloading: Connecting...    Downloading: 0%               Downloading: 15%    Downloading: 30%    Downloading: 100%
14-May-2017 03:44:34
14-May-2017 03:44:34   - Installing justinrainbow/json-schema (4.1.0)
14-May-2017 03:44:34     Downloading: Connecting...    Downloading: 0%               Downloading: 5%    Downloading: 25%    Downloading: 30%    Downloading: 35%    Downloading: 60%    Downloading: 65%    Downloading: 90%    Downloading: 95%    Downloading: 100%
14-May-2017 03:44:34
14-May-2017 03:44:34   - Installing composer/spdx-licenses (1.1.6)
14-May-2017 03:44:35     Downloading: Connecting...    Downloading: 0%               Downloading: 100%    Downloading: 100%
14-May-2017 03:44:35
14-May-2017 03:44:35   - Installing composer/semver (1.4.2)
14-May-2017 03:44:35     Downloading: Connecting...    Downloading: 0%               Downloading: 35%    Downloading: 95%    Downloading: 100%
14-May-2017 03:44:35
14-May-2017 03:44:35   - Installing composer/ca-bundle (1.0.7)
14-May-2017 03:44:36     Downloading: Connecting...    Downloading: 0%               Downloading: 5%    Downloading: 10%    Downloading: 15%    Downloading: 20%    Downloading: 25%    Downloading: 30%    Downloading: 35%    Downloading: 40%    Downloading: 45%    Downloading: 50%    Downloading: 55%    Downloading: 60%    Downloading: 65%    Downloading: 70%    Downloading: 75%    Downloading: 80%    Downloading: 85%    Downloading: 90%    Downloading: 95%    Downloading: 100%    Downloading: 100%
14-May-2017 03:44:36
14-May-2017 03:44:36   - Installing composer/composer (1.3.3)
14-May-2017 03:44:37     Downloading: Connecting...    Downloading: 0%               Downloading: 5%    Downloading: 10%    Downloading: 15%    Downloading: 20%    Downloading: 25%    Downloading: 30%    Downloading: 35%    Downloading: 40%    Downloading: 45%    Downloading: 50%    Downloading: 55%    Downloading: 60%    Downloading: 65%    Downloading: 70%    Downloading: 75%    Downloading: 80%    Downloading: 85%    Downloading: 90%    Downloading: 95%    Downloading: 100%    Downloading: 100%
14-May-2017 03:44:37
14-May-2017 03:44:37   - Installing google/recaptcha (1.1.2)
14-May-2017 03:44:37     Downloading: Connecting...    Downloading: 0%               Downloading: 30%    Downloading: 55%    Downloading: 60%    Downloading: 85%    Downloading: 100%
14-May-2017 03:44:37
14-May-2017 03:44:37   - Installing psr/http-message (1.0.1)
14-May-2017 03:44:38     Downloading: Connecting...    Downloading: 0%               Downloading: 65%    Downloading: 90%    Downloading: 100%
14-May-2017 03:44:38
14-May-2017 03:44:38   - Installing guzzlehttp/psr7 (1.4.2)
14-May-2017 03:44:39     Downloading: Connecting...    Downloading: 0%               Downloading: 5%    Downloading: 10%    Downloading: 15%    Downloading: 20%    Downloading: 55%    Downloading: 60%    Downloading: 65%    Downloading: 70%    Downloading: 75%    Downloading: 80%    Downloading: 85%    Downloading: 90%    Downloading: 95%    Downloading: 100%    Downloading: 100%
14-May-2017 03:44:39
14-May-2017 03:44:39   - Installing guzzlehttp/promises (v1.3.1)
14-May-2017 03:44:39     Downloading: Connecting...    Downloading: 0%               Downloading: 30%    Downloading: 60%    Downloading: 90%    Downloading: 100%
14-May-2017 03:44:39
14-May-2017 03:44:39   - Installing guzzlehttp/guzzle (dev-master 56bf6c1)
14-May-2017 03:44:39     Cloning 56bf6c1cc3e1b24691f10a09321516d4790cecbd
14-May-2017 03:44:41     Failed to download guzzlehttp/guzzle from source: Failed to clone https://github.com/guzzle/guzzle.git via https, ssh protocols, aborting.
14-May-2017 03:44:41
14-May-2017 03:44:41 - https://github.com/guzzle/guzzle.git
14-May-2017 03:44:41   Cloning into '/data/phpBB/vendor/guzzlehttp/guzzle'...
14-May-2017 03:44:41   fatal: unable to look up current user in the passwd file: no such user
14-May-2017 03:44:41
14-May-2017 03:44:41 - git@github.com:guzzle/guzzle.git
14-May-2017 03:44:41   Cloning into '/data/phpBB/vendor/guzzlehttp/guzzle'...
14-May-2017 03:44:41   No user exists for uid 991
14-May-2017 03:44:41   fatal: Could not read from remote repository.
14-May-2017 03:44:41  
14-May-2017 03:44:41   Please make sure you have the correct access rights
14-May-2017 03:44:41   and the repository exists.
14-May-2017 03:44:41
14-May-2017 03:44:41     Now trying to download from dist
14-May-2017 03:44:41   - Installing guzzlehttp/guzzle (dev-master 56bf6c1)
14-May-2017 03:44:42     Downloading: Connecting...    Downloading: 100%         
14-May-2017 03:44:42
14-May-2017 03:44:42   - Installing lusitanian/oauth (v0.8.10)
14-May-2017 03:44:43     Downloading: Connecting...    Downloading: 0%               Downloading: 5%    Downloading: 10%    Downloading: 15%    Downloading: 20%    Downloading: 25%    Downloading: 35%    Downloading: 40%    Downloading: 50%    Downloading: 55%    Downloading: 60%    Downloading: 65%    Downloading: 70%    Downloading: 80%    Downloading: 85%    Downloading: 90%    Downloading: 95%    Downloading: 100%    Downloading: 100%
14-May-2017 03:44:43
14-May-2017 03:44:43   - Installing marc1706/fast-image-size (v1.1.3)
14-May-2017 03:44:43     Downloading: Connecting...    Downloading: 0%               Downloading: 20%    Downloading: 40%    Downloading: 60%    Downloading: 80%    Downloading: 100%
14-May-2017 03:44:43
14-May-2017 03:44:43   - Installing paragonie/random_compat (v1.4.1)
14-May-2017 03:44:44     Downloading: Connecting...    Downloading: 0%               Downloading: 20%    Downloading: 35%    Downloading: 55%    Downloading: 70%    Downloading: 90%    Downloading: 100%
14-May-2017 03:44:44
14-May-2017 03:44:44   - Installing patchwork/utf8 (v1.3.1)
14-May-2017 03:44:45     Downloading: Connecting...    Downloading: 0%               Downloading: 5%    Downloading: 10%    Downloading: 15%    Downloading: 20%    Downloading: 25%    Downloading: 30%    Downloading: 35%    Downloading: 40%    Downloading: 45%    Downloading: 50%    Downloading: 55%    Downloading: 60%    Downloading: 65%    Downloading: 70%    Downloading: 75%    Downloading: 80%    Downloading: 85%    Downloading: 90%    Downloading: 95%    Downloading: 100%    Downloading: 100%
14-May-2017 03:44:45
14-May-2017 03:44:45   - Installing s9e/text-formatter (0.9.6)
14-May-2017 03:44:45     Downloading: Connecting...    Downloading: 0%               Downloading: 5%    Downloading: 10%    Downloading: 15%    Downloading: 20%    Downloading: 25%    Downloading: 30%    Downloading: 35%    Downloading: 40%    Downloading: 45%    Downloading: 50%    Downloading: 55%    Downloading: 60%    Downloading: 65%    Downloading: 70%    Downloading: 75%    Downloading: 80%    Downloading: 85%    Downloading: 90%    Downloading: 95%    Downloading: 100%    Downloading: 100%
14-May-2017 03:44:46
14-May-2017 03:44:46   - Installing symfony/config (v3.2.0)
14-May-2017 03:44:46     Downloading: Connecting...    Downloading: 0%               Downloading: 5%    Downloading: 15%    Downloading: 20%    Downloading: 25%    Downloading: 30%    Downloading: 35%    Downloading: 40%    Downloading: 50%    Downloading: 55%    Downloading: 60%    Downloading: 70%    Downloading: 75%    Downloading: 80%    Downloading: 90%    Downloading: 95%    Downloading: 100%
14-May-2017 03:44:46
14-May-2017 03:44:46   - Installing symfony/http-foundation (v3.2.0)
14-May-2017 03:44:47     Downloading: Connecting...    Downloading: 0%               Downloading: 5%    Downloading: 10%    Downloading: 15%    Downloading: 20%    Downloading: 25%    Downloading: 30%    Downloading: 35%    Downloading: 40%    Downloading: 45%    Downloading: 50%    Downloading: 55%    Downloading: 60%    Downloading: 65%    Downloading: 70%    Downloading: 75%    Downloading: 80%    Downloading: 85%    Downloading: 90%    Downloading: 95%    Downloading: 100%    Downloading: 100%
14-May-2017 03:44:47
14-May-2017 03:44:47   - Installing symfony/event-dispatcher (v3.2.0)
14-May-2017 03:44:47     Downloading: Connecting...    Downloading: 0%               Downloading: 5%    Downloading: 10%    Downloading: 15%    Downloading: 100%
14-May-2017 03:44:47
14-May-2017 03:44:47   - Installing symfony/http-kernel (v3.2.0)
14-May-2017 03:44:48     Downloading: Connecting...    Downloading: 0%               Downloading: 5%    Downloading: 10%    Downloading: 15%    Downloading: 20%    Downloading: 25%    Downloading: 30%    Downloading: 35%    Downloading: 40%    Downloading: 45%    Downloading: 50%    Downloading: 55%    Downloading: 60%    Downloading: 65%    Downloading: 70%    Downloading: 75%    Downloading: 80%    Downloading: 85%    Downloading: 90%    Downloading: 95%    Downloading: 100%    Downloading: 100%
14-May-2017 03:44:48
14-May-2017 03:44:48   - Installing symfony/dependency-injection (v3.2.0)
14-May-2017 03:44:49     Downloading: Connecting...    Downloading: 0%               Downloading: 5%    Downloading: 10%    Downloading: 15%    Downloading: 20%    Downloading: 25%    Downloading: 30%    Downloading: 35%    Downloading: 40%    Downloading: 45%    Downloading: 50%    Downloading: 55%    Downloading: 60%    Downloading: 65%    Downloading: 70%    Downloading: 75%    Downloading: 80%    Downloading: 85%    Downloading: 90%    Downloading: 95%    Downloading: 100%    Downloading: 100%
14-May-2017 03:44:49
14-May-2017 03:44:49   - Installing zendframework/zend-eventmanager (3.1.0)
14-May-2017 03:44:49     Downloading: Connecting...    Downloading: 0%               Downloading: 25%    Downloading: 35%    Downloading: 60%    Downloading: 70%    Downloading: 95%    Downloading: 100%
14-May-2017 03:44:49
14-May-2017 03:44:49   - Installing zendframework/zend-code (2.6.3)
14-May-2017 03:44:50     Downloading: Connecting...    Downloading: 0%               Downloading: 5%    Downloading: 10%    Downloading: 15%    Downloading: 20%    Downloading: 25%    Downloading: 30%    Downloading: 35%    Downloading: 40%    Downloading: 45%    Downloading: 50%    Downloading: 55%    Downloading: 60%    Downloading: 65%    Downloading: 70%    Downloading: 75%    Downloading: 80%    Downloading: 85%    Downloading: 90%    Downloading: 95%    Downloading: 100%
14-May-2017 03:44:50
14-May-2017 03:44:50   - Installing ocramius/proxy-manager (1.0.2)
14-May-2017 03:44:51     Downloading: Connecting...    Downloading: 0%               Downloading: 5%    Downloading: 10%    Downloading: 15%    Downloading: 20%    Downloading: 25%    Downloading: 30%    Downloading: 35%    Downloading: 40%    Downloading: 45%    Downloading: 50%    Downloading: 55%    Downloading: 65%    Downloading: 70%    Downloading: 75%    Downloading: 80%    Downloading: 85%    Downloading: 90%    Downloading: 95%    Downloading: 100%    Downloading: 100%
14-May-2017 03:44:51
14-May-2017 03:44:51   - Installing symfony/proxy-manager-bridge (v3.2.0)
14-May-2017 03:44:52     Downloading: Connecting...    Downloading: 0%               Downloading: 25%    Downloading: 60%    Downloading: 85%    Downloading: 100%
14-May-2017 03:44:52
14-May-2017 03:44:52   - Installing symfony/routing (v3.2.0)
14-May-2017 03:44:52     Downloading: Connecting...    Downloading: 0%               Downloading: 5%    Downloading: 10%    Downloading: 15%    Downloading: 20%    Downloading: 25%    Downloading: 30%    Downloading: 35%    Downloading: 40%    Downloading: 45%    Downloading: 50%    Downloading: 55%    Downloading: 60%    Downloading: 65%    Downloading: 70%    Downloading: 75%    Downloading: 80%    Downloading: 85%    Downloading: 90%    Downloading: 95%    Downloading: 100%    Downloading: 100%
14-May-2017 03:44:52
14-May-2017 03:44:52   - Installing twig/twig (1.x-dev d884330)
14-May-2017 03:44:52     Cloning d884330572fd1c8e92f8ef59bbfb886a58920ce8
14-May-2017 03:44:54     Failed to download twig/twig from source: Failed to clone https://github.com/twigphp/Twig.git via https, ssh protocols, aborting.
14-May-2017 03:44:54
14-May-2017 03:44:54 - https://github.com/twigphp/Twig.git
14-May-2017 03:44:54   Cloning into '/data/phpBB/vendor/twig/twig'...
14-May-2017 03:44:54   fatal: unable to look up current user in the passwd file: no such user
14-May-2017 03:44:54
14-May-2017 03:44:54 - git@github.com:twigphp/Twig.git
14-May-2017 03:44:54   Cloning into '/data/phpBB/vendor/twig/twig'...
14-May-2017 03:44:54   No user exists for uid 991
14-May-2017 03:44:54   fatal: Could not read from remote repository.
14-May-2017 03:44:54  
14-May-2017 03:44:54   Please make sure you have the correct access rights
14-May-2017 03:44:54   and the repository exists.
14-May-2017 03:44:54
14-May-2017 03:44:54     Now trying to download from dist
14-May-2017 03:44:54   - Installing twig/twig (1.x-dev d884330)
14-May-2017 03:44:55     Downloading: Connecting...    Downloading: 100%         
14-May-2017 03:44:55
14-May-2017 03:44:55   - Installing symfony/twig-bridge (v3.1.4)
14-May-2017 03:44:55     Downloading: Connecting...    Downloading: 0%               Downloading: 10%    Downloading: 15%    Downloading: 20%    Downloading: 25%    Downloading: 35%    Downloading: 45%    Downloading: 55%    Downloading: 60%    Downloading: 65%    Downloading: 70%    Downloading: 80%    Downloading: 90%    Downloading: 95%    Downloading: 100%
14-May-2017 03:44:55
14-May-2017 03:44:55   - Installing symfony/dom-crawler (v3.2.0)
14-May-2017 03:44:56     Downloading: Connecting...    Downloading: 0%               Downloading: 25%    Downloading: 50%    Downloading: 55%    Downloading: 75%    Downloading: 80%    Downloading: 100%
14-May-2017 03:44:56
14-May-2017 03:44:56   - Installing symfony/css-selector (v3.2.0)
14-May-2017 03:44:57     Downloading: Connecting...    Downloading: 0%               Downloading: 5%    Downloading: 10%    Downloading: 15%    Downloading: 20%    Downloading: 25%    Downloading: 30%    Downloading: 35%    Downloading: 40%    Downloading: 45%    Downloading: 50%    Downloading: 55%    Downloading: 60%    Downloading: 65%    Downloading: 70%    Downloading: 75%    Downloading: 100%    Downloading: 100%
14-May-2017 03:44:57
14-May-2017 03:44:57   - Installing symfony/browser-kit (v3.2.0)
14-May-2017 03:44:57     Downloading: Connecting...    Downloading: 0%               Downloading: 45%    Downloading: 50%    Downloading: 95%    Downloading: 100%
14-May-2017 03:44:57
14-May-2017 03:44:57   - Installing fabpot/goutte (v3.2.0)
14-May-2017 03:44:58     Downloading: Connecting...    Downloading: 0%               Downloading: 70%    Downloading: 100%
14-May-2017 03:44:58
14-May-2017 03:44:58   - Installing facebook/webdriver (1.2.0)
14-May-2017 03:44:59     Downloading: Connecting...    Downloading: 0%               Downloading: 5%    Downloading: 10%    Downloading: 15%    Downloading: 20%    Downloading: 25%    Downloading: 30%    Downloading: 35%    Downloading: 40%    Downloading: 45%    Downloading: 50%    Downloading: 55%    Downloading: 60%    Downloading: 65%    Downloading: 70%    Downloading: 75%    Downloading: 80%    Downloading: 85%    Downloading: 90%    Downloading: 95%    Downloading: 100%    Downloading: 100%
14-May-2017 03:44:59
14-May-2017 03:44:59   - Installing laravel/homestead (v4.0.5)
14-May-2017 03:44:59     Downloading: Connecting...    Downloading: 0%               Downloading: 5%    Downloading: 10%    Downloading: 100%
14-May-2017 03:44:59
14-May-2017 03:44:59   - Installing phing/phing (2.4.14)
14-May-2017 03:45:00     Downloading: Connecting...    Downloading: 0%               Downloading: 5%    Downloading: 10%    Downloading: 15%    Downloading: 20%    Downloading: 25%    Downloading: 30%    Downloading: 35%    Downloading: 40%    Downloading: 45%    Downloading: 50%    Downloading: 55%    Downloading: 60%    Downloading: 65%    Downloading: 70%    Downloading: 75%    Downloading: 80%    Downloading: 85%    Downloading: 90%    Downloading: 95%    Downloading: 100%    Downloading: 100%
14-May-2017 03:45:00
14-May-2017 03:45:00   - Installing webmozart/assert (1.2.0)
14-May-2017 03:45:01     Downloading: Connecting...    Downloading: 0%               Downloading: 55%    Downloading: 75%    Downloading: 95%    Downloading: 100%
14-May-2017 03:45:01
14-May-2017 03:45:01   - Installing phpdocumentor/reflection-common (1.0)
14-May-2017 03:45:01     Downloading: Connecting...    Downloading: 0%               Downloading: 65%    Downloading: 95%    Downloading: 100%
14-May-2017 03:45:01
14-May-2017 03:45:01   - Installing phpdocumentor/type-resolver (0.2.1)
14-May-2017 03:45:02     Downloading: Connecting...    Downloading: 0%               Downloading: 20%    Downloading: 35%    Downloading: 55%    Downloading: 75%    Downloading: 90%    Downloading: 100%
14-May-2017 03:45:02
14-May-2017 03:45:02   - Installing phpdocumentor/reflection-docblock (3.1.1)
14-May-2017 03:45:03     Downloading: Connecting...    Downloading: 0%               Downloading: 5%    Downloading: 15%    Downloading: 20%    Downloading: 30%    Downloading: 35%    Downloading: 40%    Downloading: 50%    Downloading: 55%    Downloading: 60%    Downloading: 70%    Downloading: 75%    Downloading: 80%    Downloading: 85%    Downloading: 95%    Downloading: 100%    Downloading: 100%
14-May-2017 03:45:03
14-May-2017 03:45:03   - Installing symfony/yaml (v3.2.0)
14-May-2017 03:45:03     Downloading: Connecting...    Downloading: 0%               Downloading: 10%    Downloading: 15%    Downloading: 25%    Downloading: 35%    Downloading: 40%    Downloading: 50%    Downloading: 60%    Downloading: 65%    Downloading: 75%    Downloading: 85%    Downloading: 90%    Downloading: 100%
14-May-2017 03:45:03
14-May-2017 03:45:03   - Installing sebastian/version (2.0.1)
14-May-2017 03:45:04     Downloading: Connecting...    Downloading: 0%               Downloading: 100%
14-May-2017 03:45:04
14-May-2017 03:45:04   - Installing sebastian/resource-operations (1.0.0)
14-May-2017 03:45:04     Downloading: Connecting...    Downloading: 0%               Downloading: 65%    Downloading: 100%    Downloading: 100%
14-May-2017 03:45:04
14-May-2017 03:45:04   - Installing sebastian/recursion-context (2.0.0)
14-May-2017 03:45:05     Downloading: Connecting...    Downloading: 0%               Downloading: 35%    Downloading: 100%
14-May-2017 03:45:05
14-May-2017 03:45:05   - Installing sebastian/object-enumerator (2.0.1)
14-May-2017 03:45:05     Downloading: Connecting...    Downloading: 0%               Downloading: 100%
14-May-2017 03:45:05
14-May-2017 03:45:05   - Installing sebastian/global-state (1.1.1)
14-May-2017 03:45:06     Downloading: Connecting...    Downloading: 0%               Downloading: 40%    Downloading: 70%    Downloading: 100%    Downloading: 100%
14-May-2017 03:45:06
14-May-2017 03:45:06   - Installing sebastian/exporter (2.0.0)
14-May-2017 03:45:06     Downloading: Connecting...    Downloading: 0%               Downloading: 100%
14-May-2017 03:45:06
14-May-2017 03:45:06   - Installing sebastian/environment (2.0.0)
14-May-2017 03:45:07     Downloading: Connecting...    Downloading: 0%               Downloading: 15%    Downloading: 30%    Downloading: 45%    Downloading: 60%    Downloading: 75%    Downloading: 90%    Downloading: 100%
14-May-2017 03:45:07
14-May-2017 03:45:07   - Installing sebastian/diff (1.4.1)
14-May-2017 03:45:08     Downloading: Connecting...    Downloading: 0%               Downloading: 15%    Downloading: 30%    Downloading: 45%    Downloading: 100%
14-May-2017 03:45:08
14-May-2017 03:45:08   - Installing sebastian/comparator (1.2.4)
14-May-2017 03:45:08     Downloading: Connecting...    Downloading: 0%               Downloading: 10%    Downloading: 55%    Downloading: 65%    Downloading: 75%    Downloading: 85%    Downloading: 100%
14-May-2017 03:45:08
14-May-2017 03:45:08   - Installing phpunit/php-text-template (1.2.1)
14-May-2017 03:45:09     Downloading: Connecting...    Downloading: 0%               Downloading: 35%    Downloading: 100%
14-May-2017 03:45:09
14-May-2017 03:45:09   - Installing doctrine/instantiator (1.0.5)
14-May-2017 03:45:09     Downloading: Connecting...    Downloading: 0%               Downloading: 15%    Downloading: 30%    Downloading: 45%    Downloading: 50%    Downloading: 65%    Downloading: 80%    Downloading: 95%    Downloading: 100%    Downloading: 100%
14-May-2017 03:45:09
14-May-2017 03:45:09   - Installing phpunit/phpunit-mock-objects (3.4.3)
14-May-2017 03:45:10     Downloading: Connecting...    Downloading: 0%               Downloading: 5%    Downloading: 10%    Downloading: 15%    Downloading: 20%    Downloading: 25%    Downloading: 30%    Downloading: 35%    Downloading: 40%    Downloading: 45%    Downloading: 55%    Downloading: 60%    Downloading: 65%    Downloading: 70%    Downloading: 75%    Downloading: 80%    Downloading: 85%    Downloading: 90%    Downloading: 95%    Downloading: 100%
14-May-2017 03:45:10
14-May-2017 03:45:10   - Installing phpunit/php-timer (1.0.9)
14-May-2017 03:45:10     Downloading: Connecting...    Downloading: 0%               Downloading: 45%    Downloading: 100%
14-May-2017 03:45:10
14-May-2017 03:45:10   - Installing phpunit/php-file-iterator (1.4.2)
14-May-2017 03:45:11     Downloading: Connecting...    Downloading: 0%               Downloading: 20%    Downloading: 40%    Downloading: 60%    Downloading: 100%    Downloading: 100%
14-May-2017 03:45:11
14-May-2017 03:45:11   - Installing sebastian/code-unit-reverse-lookup (1.0.1)
14-May-2017 03:45:11     Downloading: Connecting...    Downloading: 0%               Downloading: 55%    Downloading: 100%
14-May-2017 03:45:11
14-May-2017 03:45:11   - Installing phpunit/php-token-stream (1.4.11)
14-May-2017 03:45:12     Downloading: Connecting...    Downloading: 0%               Downloading: 5%    Downloading: 10%    Downloading: 15%    Downloading: 20%    Downloading: 100%
14-May-2017 03:45:12
14-May-2017 03:45:12   - Installing phpunit/php-code-coverage (4.0.8)
14-May-2017 03:45:13     Downloading: Connecting...    Downloading: 0%               Downloading: 5%    Downloading: 10%    Downloading: 15%    Downloading: 20%    Downloading: 25%    Downloading: 30%    Downloading: 35%    Downloading: 40%    Downloading: 45%    Downloading: 50%    Downloading: 55%    Downloading: 60%    Downloading: 65%    Downloading: 70%    Downloading: 80%    Downloading: 90%    Downloading: 95%    Downloading: 100%    Downloading: 100%
14-May-2017 03:45:13
14-May-2017 03:45:13   - Installing phpspec/prophecy (v1.7.0)
14-May-2017 03:45:13     Downloading: Connecting...    Downloading: 0%               Downloading: 5%    Downloading: 10%    Downloading: 15%    Downloading: 20%    Downloading: 25%    Downloading: 30%    Downloading: 35%    Downloading: 40%    Downloading: 45%    Downloading: 50%    Downloading: 55%    Downloading: 60%    Downloading: 65%    Downloading: 70%    Downloading: 75%    Downloading: 80%    Downloading: 85%    Downloading: 90%    Downloading: 95%    Downloading: 100%    Downloading: 100%
14-May-2017 03:45:13
14-May-2017 03:45:13   - Installing myclabs/deep-copy (1.6.1)
14-May-2017 03:45:14     Downloading: Connecting...    Downloading: 0%               Downloading: 5%    Downloading: 10%    Downloading: 15%    Downloading: 20%    Downloading: 100%
14-May-2017 03:45:14
14-May-2017 03:45:14   - Installing phpunit/phpunit (5.7.19)
14-May-2017 03:45:15     Downloading: Connecting...    Downloading: 0%               Downloading: 5%    Downloading: 10%    Downloading: 15%    Downloading: 20%    Downloading: 25%    Downloading: 30%    Downloading: 35%    Downloading: 40%    Downloading: 45%    Downloading: 50%    Downloading: 55%    Downloading: 60%    Downloading: 70%    Downloading: 75%    Downloading: 80%    Downloading: 85%    Downloading: 90%    Downloading: 95%    Downloading: 100%    Downloading: 100%
14-May-2017 03:45:15
14-May-2017 03:45:15   - Installing phpunit/dbunit (2.0.3)
14-May-2017 03:45:16     Downloading: Connecting...    Downloading: 0%               Downloading: 5%    Downloading: 10%    Downloading: 15%    Downloading: 20%    Downloading: 25%    Downloading: 30%    Downloading: 35%    Downloading: 40%    Downloading: 45%    Downloading: 50%    Downloading: 55%    Downloading: 60%    Downloading: 65%    Downloading: 70%    Downloading: 75%    Downloading: 80%    Downloading: 85%    Downloading: 90%    Downloading: 95%    Downloading: 100%    Downloading: 100%
14-May-2017 03:45:16
14-May-2017 03:45:16   - Installing squizlabs/php_codesniffer (2.7.1)
14-May-2017 03:45:16     Downloading: Connecting...    Downloading: 0%               Downloading: 5%    Downloading: 10%    Downloading: 15%    Downloading: 20%    Downloading: 25%    Downloading: 30%    Downloading: 35%    Downloading: 40%    Downloading: 45%    Downloading: 50%    Downloading: 55%    Downloading: 60%    Downloading: 65%    Downloading: 70%    Downloading: 75%    Downloading: 80%    Downloading: 85%    Downloading: 90%    Downloading: 95%    Downloading: 100%    Downloading: 100%
14-May-2017 03:45:16
14-May-2017 03:45:17 lusitanian/oauth suggests installing predis/predis (Allows using the Redis storage backend.)
14-May-2017 03:45:17 paragonie/random_compat suggests installing ext-libsodium (Provides a modern crypto API that can be used to generate random bytes.)
14-May-2017 03:45:17 patchwork/utf8 suggests installing ext-intl (Use Intl for best performance)
14-May-2017 03:45:17 patchwork/utf8 suggests installing ext-wfio (Use WFIO for UTF-8 filesystem access on Windows)
14-May-2017 03:45:17 s9e/text-formatter suggests installing ext-intl (Allows international URLs to be accepted by the URL filter)
14-May-2017 03:45:17 s9e/text-formatter suggests installing ext-xsl (Enables the XSLT renderer)
14-May-2017 03:45:17 symfony/http-kernel suggests installing symfony/class-loader ()
14-May-2017 03:45:17 symfony/http-kernel suggests installing symfony/var-dumper ()
14-May-2017 03:45:17 symfony/dependency-injection suggests installing symfony/expression-language (For using expressions in service container configuration)
14-May-2017 03:45:17 zendframework/zend-eventmanager suggests installing container-interop/container-interop (^1.1.0, to use the lazy listeners feature)
14-May-2017 03:45:17 zendframework/zend-eventmanager suggests installing zendframework/zend-stdlib (^2.7.3 || ^3.0, to use the FilterChain feature)
14-May-2017 03:45:17 zendframework/zend-code suggests installing doctrine/annotations (Doctrine\Common\Annotations >=1.0 for annotation features)
14-May-2017 03:45:17 zendframework/zend-code suggests installing zendframework/zend-stdlib (Zend\Stdlib component)
14-May-2017 03:45:17 ocramius/proxy-manager suggests installing ocramius/generated-hydrator (To have very fast object to array to object conversion for ghost objects)
14-May-2017 03:45:17 ocramius/proxy-manager suggests installing zendframework/zend-json (To have the JsonRpc adapter (Remote Object feature))
14-May-2017 03:45:17 ocramius/proxy-manager suggests installing zendframework/zend-soap (To have the Soap adapter (Remote Object feature))
14-May-2017 03:45:17 ocramius/proxy-manager suggests installing zendframework/zend-stdlib (To use the hydrator proxy)
14-May-2017 03:45:17 ocramius/proxy-manager suggests installing zendframework/zend-xmlrpc (To have the XmlRpc adapter (Remote Object feature))
14-May-2017 03:45:17 symfony/routing suggests installing doctrine/annotations (For using the annotation loader)
14-May-2017 03:45:17 symfony/routing suggests installing symfony/expression-language (For using expression matching)
14-May-2017 03:45:17 symfony/twig-bridge suggests installing symfony/asset (For using the AssetExtension)
14-May-2017 03:45:17 symfony/twig-bridge suggests installing symfony/expression-language (For using the ExpressionExtension)
14-May-2017 03:45:17 symfony/twig-bridge suggests installing symfony/form (For using the FormExtension)
14-May-2017 03:45:17 symfony/twig-bridge suggests installing symfony/security (For using the SecurityExtension)
14-May-2017 03:45:17 symfony/twig-bridge suggests installing symfony/stopwatch (For using the StopwatchExtension)
14-May-2017 03:45:17 symfony/twig-bridge suggests installing symfony/templating (For using the TwigEngine)
14-May-2017 03:45:17 symfony/twig-bridge suggests installing symfony/translation (For using the TranslationExtension)
14-May-2017 03:45:17 symfony/twig-bridge suggests installing symfony/var-dumper (For using the DumpExtension)
14-May-2017 03:45:17 facebook/webdriver suggests installing phpdocumentor/phpdocumentor (2.*)
14-May-2017 03:45:17 sebastian/global-state suggests installing ext-uopz (*)
14-May-2017 03:45:17 phpunit/phpunit-mock-objects suggests installing ext-soap (*)
14-May-2017 03:45:17 phpunit/phpunit suggests installing phpunit/php-invoker (~1.1)
14-May-2017 03:45:17 Generating autoload files
14-May-2017 03:45:18 Buildfile: /data/build/build.xml
14-May-2017 03:45:18
14-May-2017 03:45:18 phpBB > clean:
14-May-2017 03:45:18
14-May-2017 03:45:18    [delete] Directory /data/build/logs does not exist or is not a directory.
14-May-2017 03:45:18    [delete] Directory /data/build/api does not exist or is not a directory.
14-May-2017 03:45:18    [delete] Directory /data/build/codebrowser does not exist or is not a directory.
14-May-2017 03:45:18    [delete] Directory /data/build/coverage does not exist or is not a directory.
14-May-2017 03:45:18    [delete] Directory /data/build/cpd does not exist or is not a directory.
14-May-2017 03:45:18    [delete] Directory /data/build/dependencies does not exist or is not a directory.
14-May-2017 03:45:18    [delete] Directory /data/build/new_version does not exist or is not a directory.
14-May-2017 03:45:18    [delete] Directory /data/build/old_versions does not exist or is not a directory.
14-May-2017 03:45:18    [delete] Directory /data/build/save does not exist or is not a directory.
14-May-2017 03:45:18
14-May-2017 03:45:18 phpBB > prepare:
14-May-2017 03:45:18
14-May-2017 03:45:18     [mkdir] Created dir: /data/build/logs
14-May-2017 03:45:18     [mkdir] Created dir: /data/build/api
14-May-2017 03:45:18     [mkdir] Created dir: /data/build/codebrowser
14-May-2017 03:45:18     [mkdir] Created dir: /data/build/coverage
14-May-2017 03:45:18     [mkdir] Created dir: /data/build/cpd
14-May-2017 03:45:18     [mkdir] Created dir: /data/build/dependencies
14-May-2017 03:45:18     [mkdir] Created dir: /data/build/new_version
14-May-2017 03:45:18     [mkdir] Created dir: /data/build/new_version/files
14-May-2017 03:45:18     [mkdir] Created dir: /data/build/new_version/patches
14-May-2017 03:45:18     [mkdir] Created dir: /data/build/new_version/release_files
14-May-2017 03:45:18     [mkdir] Created dir: /data/build/new_version/update
14-May-2017 03:45:18     [mkdir] Created dir: /data/build/old_versions
14-May-2017 03:45:18     [mkdir] Created dir: /data/build/save
14-May-2017 03:45:18
14-May-2017 03:45:18 BUILD FINISHED
14-May-2017 03:45:18
14-May-2017 03:45:18 Total time: 0.1131 seconds
14-May-2017 03:45:18
14-May-2017 03:45:18 Finished task 'Prepare directory' with result: Success
14-May-2017 03:45:18 Skipping execution of task 'Run sniffs' as it is disabled
14-May-2017 03:45:18
Substituting variable: ${bamboo.working.directory} with /home/bamboo/xml-data/build-dir/PHPBB3-PR-JOB1
14-May-2017 03:45:18 Starting task 'Run sniffs' of type 'com.atlassian.bamboo.plugins.bamboo-docker-plugin:task.docker.cli'
14-May-2017 03:45:18 Running image name (phpbb:php-5.6)
14-May-2017 03:45:18
Beginning to execute external process for build 'phpBB3 - Pull Requests - Build and Test Job #7175 (PHPBB3-PR-JOB1-7175)'
... running command line:
/usr/bin/docker run --volume /home/bamboo/xml-data/build-dir/PHPBB3-PR-JOB1:/data --workdir /data/build --rm -u=991 phpbb:php-5.6 ../phpBB/vendor/bin/phing sniff
... in: /home/bamboo/xml-data/build-dir/PHPBB3-PR-JOB1
... using extra environment variables:
bamboo_planRepository_1_branch=3.1.x
bamboo_planRepository_1_branchDisplayName=3.1.x
bamboo_repository_revision_number=0984dbb3f89543b959223a21d2e6d9e6db615d98
bamboo_PRref=master
bamboo_resultsUrl=https://bamboo.phpbb.com/browse/PHPBB3-PR-JOB1-7175
bamboo_capability_system_builder_command_Git=/usr/bin/git
bamboo_repository_75956235_git_username=bantu
bamboo_planRepository_1_name=phpBB Ascraeus
bamboo_build_working_directory=/home/bamboo/xml-data/build-dir/PHPBB3-PR-JOB1
bamboo_buildKey=PHPBB3-PR-JOB1
bamboo_capability_phpbb_tests=true
bamboo_shortPlanName=Pull Requests
bamboo_capability_system_builder_command_fop=/usr/bin/fop
bamboo_capability_dbms_sqlite_2=true
bamboo_planRepository_name=phpBB Ascraeus
bamboo_PRnumber=4624
bamboo_buildNumber=7175
bamboo_repository_75956235_git_repositoryUrl=https://github.com/phpbb/phpbb.git
bamboo_capability_system_builder_phpunit_PHPUnit=/usr/bin/phpunit
bamboo_shortJobName=Build and Test Job
bamboo_buildResultsUrl=https://bamboo.phpbb.com/browse/PHPBB3-PR-JOB1-7175
bamboo_repository_75956235_branch_name=3.1.x
bamboo_planRepository_repositoryUrl=https://github.com/phpbb/phpbb.git
bamboo_agentId=131073
bamboo_planName=phpBB3 - Pull Requests
bamboo_build_commandline_com_atlassian_bamboo_plugins_scripttask_task_builder_script_7=/bin/sh /home/bamboo/temp/PHPBB3-PR-JOB1-7175-ScriptBuildTask-1648805300866020387.sh
bamboo_shortPlanKey=PR
bamboo_shortJobKey=JOB1
bamboo_capability_dbms_mysql_55=true
bamboo_capability_system_jdk_JDK_1_7_0_65=/usr/lib/jvm/java-7-openjdk-amd64
bamboo_planRepository_revision=0984dbb3f89543b959223a21d2e6d9e6db615d98
bamboo_repository_previous_revision_number=0984dbb3f89543b959223a21d2e6d9e6db615d98
bamboo_buildTimeStamp=2017-05-14T03:44:21.570Z
bamboo_planRepository_previousRevision=0984dbb3f89543b959223a21d2e6d9e6db615d98
bamboo_capability_system_builder_mvn2_Maven_2=/usr/share/maven2
bamboo_capability_system_jdk_JDK_1_6_0_16=/usr/lib/jvm/java-6-sun-1.6.0.16
bamboo_build_commandline_com_atlassian_bamboo_plugins_scripttask_task_builder_script_4=/bin/sh /home/bamboo/temp/PHPBB3-PR-JOB1-7175-ScriptBuildTask-529078485476089059.sh
bamboo_buildResultKey=PHPBB3-PR-JOB1-7175
bamboo_repository_git_branch=3.1.x
bamboo_repository_branch_name=3.1.x
bamboo_buildPlanName=phpBB3 - Pull Requests - Build and Test Job
bamboo_planRepository_1_revision=0984dbb3f89543b959223a21d2e6d9e6db615d98
bamboo_repository_name=phpBB Ascraeus
bamboo_capability_system_docker_executable=/usr/bin/docker
bamboo_build_commandline_com_atlassian_bamboo_plugins_bamboo_docker_plugin_task_docker_cli_12=/usr/bin/docker run --volume /home/bamboo/xml-data/build-dir/PHPBB3-PR-JOB1:/data --workdir /data/phpBB --rm -e HOME=/home/bamboo -u=991 phpbb:php-5.6 /bin/bash -c php ../composer.phar install --dev; cd ../build; ../phpBB/vendor/bin/phing clean prepare
bamboo_planRepository_branch=3.1.x
bamboo_agentWorkingDirectory=/home/bamboo/xml-data/build-dir
bamboo_capability_system_git_executable=/usr/bin/git
bamboo_planRepository_1_previousRevision=0984dbb3f89543b959223a21d2e6d9e6db615d98
bamboo_capability_system_builder_phpunit_PHPUnit_3_4=/usr/bin/phpunit
bamboo_repository_git_username=bantu
bamboo_repository_75956235_revision_number=0984dbb3f89543b959223a21d2e6d9e6db615d98
bamboo_planRepository_branchDisplayName=3.1.x
bamboo_planRepository_1_type=gitv2
bamboo_planRepository_branchName=3.1.x
bamboo_repository_75956235_previous_revision_number=0984dbb3f89543b959223a21d2e6d9e6db615d98
bamboo_capability_system_jdk_JDK=/usr/lib/jvm/java-6-sun
bamboo_plan_storageTag=PHPBB3-PR
bamboo_planRepository_type=gitv2
bamboo_planRepository_1_username=bantu
bamboo_ManualBuildTriggerReason_userName=Build Robot
bamboo_repository_git_repositoryUrl=https://github.com/phpbb/phpbb.git
bamboo_repository_75956235_git_branch=3.1.x
bamboo_capability_system_builder_ant_Ant=/usr/share/ant
bamboo_repository_75956235_name=phpBB Ascraeus
bamboo_working_directory=/home/bamboo/xml-data/build-dir/PHPBB3-PR-JOB1
bamboo_planKey=PHPBB3-PR
bamboo_planRepository_1_repositoryUrl=https://github.com/phpbb/phpbb.git
bamboo_planRepository_username=bantu
bamboo_capability_local=true
bamboo_capability_system_jdk_JDK_1_6=/usr/lib/jvm/java-6-sun
bamboo_capability_system_jdk_JDK_1_7=/usr/lib/jvm/java-7-openjdk-amd64
bamboo_planRepository_1_branchName=3.1.x
14-May-2017 03:45:18 Buildfile: /data/build/build.xml
14-May-2017 03:45:18
14-May-2017 03:45:18 phpBB > sniff:
14-May-2017 03:45:18
14-May-2017 03:45:27 ............................................................  60 / 700 (9%)
14-May-2017 03:45:28 ............................................................ 120 / 700 (17%)
14-May-2017 03:45:29 ............................................................ 180 / 700 (26%)
14-May-2017 03:45:31 ............................................................ 240 / 700 (34%)
14-May-2017 03:45:36 ............................................................ 300 / 700 (43%)
14-May-2017 03:45:41 ............................................................ 360 / 700 (51%)
14-May-2017 03:45:47 ............................................................ 420 / 700 (60%)
14-May-2017 03:45:51 ............................................................ 480 / 700 (69%)
14-May-2017 03:45:55 ............................................................ 540 / 700 (77%)
14-May-2017 03:46:00 ............................................................ 600 / 700 (86%)
14-May-2017 03:46:03 ............................................................ 660 / 700 (94%)
14-May-2017 03:46:05 ........................................
14-May-2017 03:46:05
14-May-2017 03:46:05 Time: 46.06 secs; Memory: 79.5Mb
14-May-2017 03:46:05
14-May-2017 03:46:13 ............................................................  60 / 206 (29%)
14-May-2017 03:46:31 ............................................................ 120 / 206 (58%)
14-May-2017 03:46:46 ............................................................ 180 / 206 (87%)
14-May-2017 03:46:53 ..........................
14-May-2017 03:46:53
14-May-2017 03:46:53 Time: 48.08 secs; Memory: 60.25Mb
14-May-2017 03:46:53
14-May-2017 03:46:53
14-May-2017 03:46:53
14-May-2017 03:46:53 Time: 17ms; Memory: 3.5Mb
14-May-2017 03:46:53
14-May-2017 03:46:53
14-May-2017 03:46:53 BUILD FINISHED
14-May-2017 03:46:53
14-May-2017 03:46:53 Total time: 2 minutes  34.53 seconds
14-May-2017 03:46:53
14-May-2017 03:46:53 Finished task 'Run sniffs' with result: Success
14-May-2017 03:46:53 Skipping execution of task 'Run tests' as it is disabled
14-May-2017 03:46:53
Substituting variable: ${bamboo.working.directory} with /home/bamboo/xml-data/build-dir/PHPBB3-PR-JOB1
14-May-2017 03:46:53 Starting task 'Run tests' of type 'com.atlassian.bamboo.plugins.bamboo-docker-plugin:task.docker.cli'
14-May-2017 03:46:53 Running image name (phpbb:php-5.6)
14-May-2017 03:46:53
Beginning to execute external process for build 'phpBB3 - Pull Requests - Build and Test Job #7175 (PHPBB3-PR-JOB1-7175)'
... running command line:
/usr/bin/docker run --volume /home/bamboo/xml-data/build-dir/PHPBB3-PR-JOB1:/data --workdir /data --rm -u=991 phpbb:php-5.6 /bin/bash -c phpBB/vendor/bin/phpunit --log-junit build/logs/phpunit.xml
... in: /home/bamboo/xml-data/build-dir/PHPBB3-PR-JOB1
... using extra environment variables:
bamboo_planRepository_1_branch=3.1.x
bamboo_planRepository_1_branchDisplayName=3.1.x
bamboo_repository_revision_number=0984dbb3f89543b959223a21d2e6d9e6db615d98
bamboo_PRref=master
bamboo_resultsUrl=https://bamboo.phpbb.com/browse/PHPBB3-PR-JOB1-7175
bamboo_capability_system_builder_command_Git=/usr/bin/git
bamboo_repository_75956235_git_username=bantu
bamboo_planRepository_1_name=phpBB Ascraeus
bamboo_build_working_directory=/home/bamboo/xml-data/build-dir/PHPBB3-PR-JOB1
bamboo_buildKey=PHPBB3-PR-JOB1
bamboo_capability_phpbb_tests=true
bamboo_shortPlanName=Pull Requests
bamboo_capability_system_builder_command_fop=/usr/bin/fop
bamboo_capability_dbms_sqlite_2=true
bamboo_planRepository_name=phpBB Ascraeus
bamboo_PRnumber=4624
bamboo_buildNumber=7175
bamboo_repository_75956235_git_repositoryUrl=https://github.com/phpbb/phpbb.git
bamboo_capability_system_builder_phpunit_PHPUnit=/usr/bin/phpunit
bamboo_shortJobName=Build and Test Job
bamboo_buildResultsUrl=https://bamboo.phpbb.com/browse/PHPBB3-PR-JOB1-7175
bamboo_repository_75956235_branch_name=3.1.x
bamboo_planRepository_repositoryUrl=https://github.com/phpbb/phpbb.git
bamboo_agentId=131073
bamboo_planName=phpBB3 - Pull Requests
bamboo_build_commandline_com_atlassian_bamboo_plugins_scripttask_task_builder_script_7=/bin/sh /home/bamboo/temp/PHPBB3-PR-JOB1-7175-ScriptBuildTask-1648805300866020387.sh
bamboo_shortPlanKey=PR
bamboo_shortJobKey=JOB1
bamboo_capability_dbms_mysql_55=true
bamboo_capability_system_jdk_JDK_1_7_0_65=/usr/lib/jvm/java-7-openjdk-amd64
bamboo_planRepository_revision=0984dbb3f89543b959223a21d2e6d9e6db615d98
bamboo_repository_previous_revision_number=0984dbb3f89543b959223a21d2e6d9e6db615d98
bamboo_buildTimeStamp=2017-05-14T03:44:21.570Z
bamboo_planRepository_previousRevision=0984dbb3f89543b959223a21d2e6d9e6db615d98
bamboo_capability_system_builder_mvn2_Maven_2=/usr/share/maven2
bamboo_capability_system_jdk_JDK_1_6_0_16=/usr/lib/jvm/java-6-sun-1.6.0.16
bamboo_build_commandline_com_atlassian_bamboo_plugins_scripttask_task_builder_script_4=/bin/sh /home/bamboo/temp/PHPBB3-PR-JOB1-7175-ScriptBuildTask-529078485476089059.sh
bamboo_buildResultKey=PHPBB3-PR-JOB1-7175
bamboo_repository_git_branch=3.1.x
bamboo_repository_branch_name=3.1.x
bamboo_buildPlanName=phpBB3 - Pull Requests - Build and Test Job
bamboo_planRepository_1_revision=0984dbb3f89543b959223a21d2e6d9e6db615d98
bamboo_repository_name=phpBB Ascraeus
bamboo_capability_system_docker_executable=/usr/bin/docker
bamboo_build_commandline_com_atlassian_bamboo_plugins_bamboo_docker_plugin_task_docker_cli_11=/usr/bin/docker run --volume /home/bamboo/xml-data/build-dir/PHPBB3-PR-JOB1:/data --workdir /data/build --rm -u=991 phpbb:php-5.6 ../phpBB/vendor/bin/phing sniff
bamboo_build_commandline_com_atlassian_bamboo_plugins_bamboo_docker_plugin_task_docker_cli_12=/usr/bin/docker run --volume /home/bamboo/xml-data/build-dir/PHPBB3-PR-JOB1:/data --workdir /data/phpBB --rm -e HOME=/home/bamboo -u=991 phpbb:php-5.6 /bin/bash -c php ../composer.phar install --dev; cd ../build; ../phpBB/vendor/bin/phing clean prepare
bamboo_planRepository_branch=3.1.x
bamboo_agentWorkingDirectory=/home/bamboo/xml-data/build-dir
bamboo_capability_system_git_executable=/usr/bin/git
bamboo_planRepository_1_previousRevision=0984dbb3f89543b959223a21d2e6d9e6db615d98
bamboo_capability_system_builder_phpunit_PHPUnit_3_4=/usr/bin/phpunit
bamboo_repository_git_username=bantu
bamboo_repository_75956235_revision_number=0984dbb3f89543b959223a21d2e6d9e6db615d98
bamboo_planRepository_branchDisplayName=3.1.x
bamboo_planRepository_1_type=gitv2
bamboo_planRepository_branchName=3.1.x
bamboo_repository_75956235_previous_revision_number=0984dbb3f89543b959223a21d2e6d9e6db615d98
bamboo_capability_system_jdk_JDK=/usr/lib/jvm/java-6-sun
bamboo_plan_storageTag=PHPBB3-PR
bamboo_planRepository_type=gitv2
bamboo_planRepository_1_username=bantu
bamboo_ManualBuildTriggerReason_userName=Build Robot
bamboo_repository_git_repositoryUrl=https://github.com/phpbb/phpbb.git
bamboo_repository_75956235_git_branch=3.1.x
bamboo_capability_system_builder_ant_Ant=/usr/share/ant
bamboo_repository_75956235_name=phpBB Ascraeus
bamboo_working_directory=/home/bamboo/xml-data/build-dir/PHPBB3-PR-JOB1
bamboo_planKey=PHPBB3-PR
bamboo_planRepository_1_repositoryUrl=https://github.com/phpbb/phpbb.git
bamboo_planRepository_username=bantu
bamboo_capability_local=true
bamboo_capability_system_jdk_JDK_1_6=/usr/lib/jvm/java-6-sun
bamboo_capability_system_jdk_JDK_1_7=/usr/lib/jvm/java-7-openjdk-amd64
bamboo_planRepository_1_branchName=3.1.x
14-May-2017 03:46:56 PHPUnit 5.7.19 by Sebastian Bergmann and contributors.
14-May-2017 03:46:56
14-May-2017 03:47:04 .............................................................   61 / 6939 (  0%)
14-May-2017 03:47:04 .............................................................  122 / 6939 (  1%)
14-May-2017 03:47:05 ...I.....SSSS............SSSS.........S...S..................  183 / 6939 (  2%)
14-May-2017 03:47:07 ....................................................S........  244 / 6939 (  3%)
14-May-2017 03:47:08 stty: standard input: Inappropriate ioctl for device
14-May-2017 03:47:08 stty: standard input: Inappropriate ioctl for device
14-May-2017 03:47:08 stty: standard input: Inappropriate ioctl for device
14-May-2017 03:47:08 stty: standard input: Inappropriate ioctl for device
14-May-2017 03:47:15 ....F........................................................  305 / 6939 (  4%)
14-May-2017 03:47:15 .............................................................  366 / 6939 (  5%)
14-May-2017 03:47:16 .............................................................  427 / 6939 (  6%)
14-May-2017 03:47:17 .............................................................  488 / 6939 (  7%)
14-May-2017 03:47:17 .............................................................  549 / 6939 (  7%)
14-May-2017 03:47:18 .............................................................  610 / 6939 (  8%)
14-May-2017 03:47:19 .............................................................  671 / 6939 (  9%)
14-May-2017 03:47:19 .............................................................  732 / 6939 ( 10%)
14-May-2017 03:47:20 .............................................................  793 / 6939 ( 11%)
14-May-2017 03:47:21 .............................................................  854 / 6939 ( 12%)
14-May-2017 03:47:22 .............................................................  915 / 6939 ( 13%)
14-May-2017 03:47:23 .............................................................  976 / 6939 ( 14%)
14-May-2017 03:47:25 ............................................................. 1037 / 6939 ( 14%)
14-May-2017 03:47:29 ..................................I.......................... 1098 / 6939 ( 15%)
14-May-2017 03:47:35 ............................................................. 1159 / 6939 ( 16%)
14-May-2017 03:47:38 ............................................................. 1220 / 6939 ( 17%)
14-May-2017 03:47:40 .S.S.S....................................................... 1281 / 6939 ( 18%)
14-May-2017 03:47:40 ............................................................. 1342 / 6939 ( 19%)
14-May-2017 03:47:40 ............................................................. 1403 / 6939 ( 20%)
14-May-2017 03:47:40 ............................................................. 1464 / 6939 ( 21%)
14-May-2017 03:47:40 ............................................................. 1525 / 6939 ( 21%)
14-May-2017 03:47:41 ............................................................. 1586 / 6939 ( 22%)
14-May-2017 03:47:41 ............................................................. 1647 / 6939 ( 23%)
14-May-2017 03:47:41 ............................................................. 1708 / 6939 ( 24%)
14-May-2017 03:47:41 ............................................................. 1769 / 6939 ( 25%)
14-May-2017 03:47:41 ............................................................. 1830 / 6939 ( 26%)
14-May-2017 03:47:41 ............................................................. 1891 / 6939 ( 27%)
14-May-2017 03:47:41 ............................................................. 1952 / 6939 ( 28%)
14-May-2017 03:47:42 ............................................................. 2013 / 6939 ( 29%)
14-May-2017 03:47:42 ............................................................. 2074 / 6939 ( 29%)
14-May-2017 03:47:43 ............................................................. 2135 / 6939 ( 30%)
14-May-2017 03:47:45 ............................................................. 2196 / 6939 ( 31%)
14-May-2017 03:47:45 ............................................................. 2257 / 6939 ( 32%)
14-May-2017 03:47:46 ............................................................. 2318 / 6939 ( 33%)
14-May-2017 03:47:48 ..I.II....................................................... 2379 / 6939 ( 34%)
14-May-2017 03:47:48 ............................................................. 2440 / 6939 ( 35%)
14-May-2017 03:47:48 ............................................................. 2501 / 6939 ( 36%)
14-May-2017 03:47:49 ............................................................. 2562 / 6939 ( 36%)
14-May-2017 03:47:52 ............................................................. 2623 / 6939 ( 37%)
14-May-2017 03:47:53 ............................................................. 2684 / 6939 ( 38%)
14-May-2017 03:47:53 ......................................SSSSSSSSS.............. 2745 / 6939 ( 39%)
14-May-2017 03:47:53 ............................................................. 2806 / 6939 ( 40%)
14-May-2017 03:48:04 ............................................................. 2867 / 6939 ( 41%)
14-May-2017 03:48:08 ............................................................. 2928 / 6939 ( 42%)
14-May-2017 03:48:13 ..............S.............................................. 2989 / 6939 ( 43%)
14-May-2017 03:48:13 ............................................................. 3050 / 6939 ( 43%)
14-May-2017 03:48:23 ............................................................. 3111 / 6939 ( 44%)
14-May-2017 03:48:31 ............................................................. 3172 / 6939 ( 45%)
14-May-2017 03:48:38 ............................................................. 3233 / 6939 ( 46%)
14-May-2017 03:48:39 ............................................................. 3294 / 6939 ( 47%)
14-May-2017 03:48:39 ............................................................. 3355 / 6939 ( 48%)
14-May-2017 03:48:40 ............................................................. 3416 / 6939 ( 49%)
14-May-2017 03:48:40 ............................................................. 3477 / 6939 ( 50%)
14-May-2017 03:48:40 ............................................................. 3538 / 6939 ( 50%)
14-May-2017 03:48:40 ............................................................. 3599 / 6939 ( 51%)
14-May-2017 03:48:40 ............................................................. 3660 / 6939 ( 52%)
14-May-2017 03:48:40 ............................................................. 3721 / 6939 ( 53%)
14-May-2017 03:48:44 ............................................................. 3782 / 6939 ( 54%)
14-May-2017 03:48:45 ............................................................. 3843 / 6939 ( 55%)
14-May-2017 03:48:47 ............................................................. 3904 / 6939 ( 56%)
14-May-2017 03:48:48 ............................................................. 3965 / 6939 ( 57%)
14-May-2017 03:48:50 ............................................................. 4026 / 6939 ( 58%)
14-May-2017 03:48:55 ............................................................. 4087 / 6939 ( 58%)
14-May-2017 03:49:00 ............................................................. 4148 / 6939 ( 59%)
14-May-2017 03:49:00 ............................................................. 4209 / 6939 ( 60%)
14-May-2017 03:49:02 ............................................................. 4270 / 6939 ( 61%)
14-May-2017 03:49:02 ............................................................. 4331 / 6939 ( 62%)
14-May-2017 03:49:02 ............................................................. 4392 / 6939 ( 63%)
14-May-2017 03:49:02 ............................................................. 4453 / 6939 ( 64%)
14-May-2017 03:49:02 ............................................................. 4514 / 6939 ( 65%)
14-May-2017 03:49:02 ............................................................. 4575 / 6939 ( 65%)
14-May-2017 03:49:02 ............................................................. 4636 / 6939 ( 66%)
14-May-2017 03:49:02 ............................................................. 4697 / 6939 ( 67%)
14-May-2017 03:49:10 ............................................................. 4758 / 6939 ( 68%)
14-May-2017 03:49:20 ......................................S...................... 4819 / 6939 ( 69%)
14-May-2017 03:49:28 ............................................................. 4880 / 6939 ( 70%)
14-May-2017 03:49:37 ............................................................. 4941 / 6939 ( 71%)
14-May-2017 03:49:38 ............................................................. 5002 / 6939 ( 72%)
14-May-2017 03:49:38 ............................................................. 5063 / 6939 ( 72%)
14-May-2017 03:49:39 ............................................................. 5124 / 6939 ( 73%)
14-May-2017 03:49:39 ..................................................SSSSSSSSSSS 5185 / 6939 ( 74%)
14-May-2017 03:49:39 SSSSSSSSSSSSSSSSSSSSSSSSSSSSSSSSSSSSSSSSSSSSSSSSSSSSSSSSSSSSS 5246 / 6939 ( 75%)
14-May-2017 03:49:39 SSSSSSSSSSSSSSSSSSSSSSSSSSSSSSSSSSSSSSSSSSSSSSSSSSSSSSSSSSSSS 5307 / 6939 ( 76%)
14-May-2017 03:49:40 SSSSSSSSSSSSSSSSSSSSSSSSSSSSSSSSSSSSSSSSSSSSSSSSSSSSSSSSSSSSS 5368 / 6939 ( 77%)
14-May-2017 03:49:40 SSSSSSSSSSSSSSSSSSSSSSSSSSSSSSSSSSSSSSSSSSSSSSSSSSSSSSSSSSSSS 5429 / 6939 ( 78%)
14-May-2017 03:49:41 SSSSSS....................................................... 5490 / 6939 ( 79%)
14-May-2017 03:49:43 ............................................................. 5551 / 6939 ( 79%)
14-May-2017 03:49:45 ............................................................. 5612 / 6939 ( 80%)
14-May-2017 03:49:47 ............................................................. 5673 / 6939 ( 81%)
14-May-2017 03:49:48 ............................................................. 5734 / 6939 ( 82%)
14-May-2017 03:49:50 ............................................................. 5795 / 6939 ( 83%)
14-May-2017 03:49:52 ............................................................. 5856 / 6939 ( 84%)
14-May-2017 03:49:54 ............................................................. 5917 / 6939 ( 85%)
14-May-2017 03:49:56 ............................................................. 5978 / 6939 ( 86%)
14-May-2017 03:49:57 ............................................................. 6039 / 6939 ( 87%)
14-May-2017 03:49:59 ............................................................. 6100 / 6939 ( 87%)
14-May-2017 03:50:01 ............................................................. 6161 / 6939 ( 88%)
14-May-2017 03:50:03 ............................................................. 6222 / 6939 ( 89%)
14-May-2017 03:50:04 ............................................................. 6283 / 6939 ( 90%)
14-May-2017 03:50:06 ............................................................. 6344 / 6939 ( 91%)
14-May-2017 03:50:08 ............................................................. 6405 / 6939 ( 92%)
14-May-2017 03:50:10 ............................................................. 6466 / 6939 ( 93%)
14-May-2017 03:50:11 ............................................................. 6527 / 6939 ( 94%)
14-May-2017 03:50:13 ............................................................. 6588 / 6939 ( 94%)
14-May-2017 03:50:15 ............................................................. 6649 / 6939 ( 95%)
14-May-2017 03:50:17 ............................................................. 6710 / 6939 ( 96%)
14-May-2017 03:50:19 ............................................................. 6771 / 6939 ( 97%)
14-May-2017 03:50:21 ............................................................. 6832 / 6939 ( 98%)
14-May-2017 03:50:22 ............................................................. 6893 / 6939 ( 99%)
14-May-2017 03:50:24 ............................................SS                6939 / 6939 (100%)
14-May-2017 03:50:24
14-May-2017 03:50:24 Time: 3.5 minutes, Memory: 429.25MB
14-May-2017 03:50:24
14-May-2017 03:50:24 There was 1 failure:
14-May-2017 03:50:24
14-May-2017 03:50:24 1) phpbb_console_user_add_test::test_add_dialog
14-May-2017 03:50:24 Failed asserting that null is not equal to null.
14-May-2017 03:50:24
14-May-2017 03:50:24 /data/tests/console/user/add_test.php:70
14-May-2017 03:50:24
14-May-2017 03:50:24 FAILURES!
14-May-2017 03:50:24 Tests: 9221, Assertions: 61270, Failures: 1, Skipped: 288, Incomplete: 5.
14-May-2017 03:50:25 Failing task since return code of [/usr/bin/docker run --volume /home/bamboo/xml-data/build-dir/PHPBB3-PR-JOB1:/data --workdir /data --rm -u=991 phpbb:php-5.6 /bin/bash -c phpBB/vendor/bin/phpunit --log-junit build/logs/phpunit.xml] was 1 while expected 0
14-May-2017 03:50:25 Error occurred while running Task 'Run tests(10)' of type com.atlassian.bamboo.plugins.bamboo-docker-plugin:task.docker.cli.
14-May-2017 03:50:25 com.atlassian.bamboo.task.TaskException: Failed to execute task
14-May-2017 03:50:25         at com.atlassian.bamboo.plugins.docker.service.RunService.execute(RunService.java:71)
14-May-2017 03:50:25         at com.atlassian.bamboo.plugins.docker.tasks.cli.DockerCliTask.execute(DockerCliTask.java:60)
14-May-2017 03:50:25         at com.atlassian.bamboo.task.TaskExecutorImpl.lambda$executeTasks$3(TaskExecutorImpl.java:317)
14-May-2017 03:50:25         at com.atlassian.bamboo.task.TaskExecutorImpl.executeTaskWithPrePostActions(TaskExecutorImpl.java:246)
14-May-2017 03:50:25         at com.atlassian.bamboo.task.TaskExecutorImpl.executeTasks(TaskExecutorImpl.java:317)
14-May-2017 03:50:25         at com.atlassian.bamboo.task.TaskExecutorImpl.execute(TaskExecutorImpl.java:118)
14-May-2017 03:50:25         at com.atlassian.bamboo.build.pipeline.tasks.ExecuteBuildTask.call(ExecuteBuildTask.java:74)
14-May-2017 03:50:25         at com.atlassian.bamboo.v2.build.agent.DefaultBuildAgent.build(DefaultBuildAgent.java:216)
14-May-2017 03:50:25         at com.atlassian.bamboo.v2.build.agent.BuildAgentControllerImpl$1.call(BuildAgentControllerImpl.java:139)
14-May-2017 03:50:25         at com.atlassian.bamboo.v2.build.agent.BuildAgentControllerImpl$1.call(BuildAgentControllerImpl.java:130)
14-May-2017 03:50:25         at com.atlassian.bamboo.variable.CustomVariableContextImpl.withVariableSubstitutor(CustomVariableContextImpl.java:221)
14-May-2017 03:50:25         at com.atlassian.bamboo.v2.build.agent.BuildAgentControllerImpl.waitAndPerformBuild(BuildAgentControllerImpl.java:129)
14-May-2017 03:50:25         at com.atlassian.bamboo.v2.build.agent.DefaultBuildAgent$1.run(DefaultBuildAgent.java:138)
14-May-2017 03:50:25         at com.atlassian.bamboo.utils.BambooRunnables$1.run(BambooRunnables.java:51)
14-May-2017 03:50:25         at com.atlassian.bamboo.security.ImpersonationHelper.runWith(ImpersonationHelper.java:31)
14-May-2017 03:50:25         at com.atlassian.bamboo.security.ImpersonationHelper.runWithSystemAuthority(ImpersonationHelper.java:20)
14-May-2017 03:50:25         at com.atlassian.bamboo.security.ImpersonationHelper$1.run(ImpersonationHelper.java:52)
14-May-2017 03:50:25         at java.lang.Thread.run(Thread.java:745)
14-May-2017 03:50:25 Caused by: com.atlassian.bamboo.plugins.docker.client.DockerException: Error running Docker run command
14-May-2017 03:50:25         at com.atlassian.bamboo.plugins.docker.client.DockerCmd.run(DockerCmd.java:103)
14-May-2017 03:50:25         at com.atlassian.bamboo.plugins.docker.service.RunService.execute(RunService.java:60)
14-May-2017 03:50:25         ... 17 more
14-May-2017 03:50:25 Caused by: com.atlassian.utils.process.ProcessException: Error executing /usr/bin/docker run --volume /home/bamboo/xml-data/build-dir/PHPBB3-PR-JOB1:/data --workdir /data --rm -u=991 phpbb:php-5.6 /bin/bash -c "phpBB/vendor/bin/phpunit --log-junit build/logs/phpunit.xml"
14-May-2017 03:50:25         at com.atlassian.bamboo.plugins.docker.process.DockerTaskProcessService.execute(DockerTaskProcessService.java:60)
14-May-2017 03:50:25         at com.atlassian.bamboo.plugins.docker.client.DockerCmd.run(DockerCmd.java:99)
14-May-2017 03:50:25         ... 18 more
14-May-2017 03:50:25 Starting task 'Parsing test results produced by script' of type 'com.atlassian.bamboo.plugins.testresultparser:task.testresultparser.junit'
14-May-2017 03:50:25 Parsing test results under /home/bamboo/xml-data/build-dir/PHPBB3-PR-JOB1...
14-May-2017 03:50:25 Failing task since 1 failing test cases were found.
14-May-2017 03:50:25 Finished task 'Parsing test results produced by script' with result: Failed
14-May-2017 03:50:25
Substituting variable: ${bamboo.PRnumber} with 4624
14-May-2017 03:50:25
Substituting variable: ${bamboo.buildResultsUrl} with https://bamboo.phpbb.com/browse/PHPBB3-PR-JOB1-7175
14-May-2017 03:50:25
Substituting variable: ${bamboo.buildResultsUrl} with https://bamboo.phpbb.com/browse/PHPBB3-PR-JOB1-7175
14-May-2017 03:50:25 Starting task 'Set result build status' of type 'com.atlassian.bamboo.plugins.scripttask:task.builder.script'
14-May-2017 03:50:25
Beginning to execute external process for build 'phpBB3 - Pull Requests - Build and Test Job #7175 (PHPBB3-PR-JOB1-7175)'
... running command line:
/bin/sh /home/bamboo/temp/PHPBB3-PR-JOB1-7175-ScriptBuildTask-2636832064912990374.sh
... in: /home/bamboo/xml-data/build-dir/PHPBB3-PR-JOB1
... using extra environment variables:
bamboo_planRepository_1_branch=3.1.x
bamboo_planRepository_1_branchDisplayName=3.1.x
bamboo_repository_revision_number=0984dbb3f89543b959223a21d2e6d9e6db615d98
bamboo_PRref=master
bamboo_resultsUrl=https://bamboo.phpbb.com/browse/PHPBB3-PR-JOB1-7175
bamboo_capability_system_builder_command_Git=/usr/bin/git
bamboo_repository_75956235_git_username=bantu
bamboo_planRepository_1_name=phpBB Ascraeus
bamboo_build_working_directory=/home/bamboo/xml-data/build-dir/PHPBB3-PR-JOB1
bamboo_buildKey=PHPBB3-PR-JOB1
bamboo_capability_phpbb_tests=true
bamboo_shortPlanName=Pull Requests
bamboo_capability_system_builder_command_fop=/usr/bin/fop
bamboo_capability_dbms_sqlite_2=true
bamboo_planRepository_name=phpBB Ascraeus
bamboo_PRnumber=4624
bamboo_buildNumber=7175
bamboo_repository_75956235_git_repositoryUrl=https://github.com/phpbb/phpbb.git
bamboo_capability_system_builder_phpunit_PHPUnit=/usr/bin/phpunit
bamboo_shortJobName=Build and Test Job
bamboo_buildResultsUrl=https://bamboo.phpbb.com/browse/PHPBB3-PR-JOB1-7175
bamboo_repository_75956235_branch_name=3.1.x
bamboo_planRepository_repositoryUrl=https://github.com/phpbb/phpbb.git
bamboo_agentId=131073
bamboo_planName=phpBB3 - Pull Requests
bamboo_build_commandline_com_atlassian_bamboo_plugins_scripttask_task_builder_script_7=/bin/sh /home/bamboo/temp/PHPBB3-PR-JOB1-7175-ScriptBuildTask-1648805300866020387.sh
bamboo_shortPlanKey=PR
bamboo_shortJobKey=JOB1
bamboo_capability_dbms_mysql_55=true
bamboo_capability_system_jdk_JDK_1_7_0_65=/usr/lib/jvm/java-7-openjdk-amd64
bamboo_planRepository_revision=0984dbb3f89543b959223a21d2e6d9e6db615d98
bamboo_repository_previous_revision_number=0984dbb3f89543b959223a21d2e6d9e6db615d98
bamboo_buildTimeStamp=2017-05-14T03:44:21.570Z
bamboo_planRepository_previousRevision=0984dbb3f89543b959223a21d2e6d9e6db615d98
bamboo_capability_system_builder_mvn2_Maven_2=/usr/share/maven2
bamboo_capability_system_jdk_JDK_1_6_0_16=/usr/lib/jvm/java-6-sun-1.6.0.16
bamboo_build_commandline_com_atlassian_bamboo_plugins_scripttask_task_builder_script_4=/bin/sh /home/bamboo/temp/PHPBB3-PR-JOB1-7175-ScriptBuildTask-529078485476089059.sh
bamboo_buildResultKey=PHPBB3-PR-JOB1-7175
bamboo_repository_git_branch=3.1.x
bamboo_repository_branch_name=3.1.x
bamboo_buildPlanName=phpBB3 - Pull Requests - Build and Test Job
bamboo_planRepository_1_revision=0984dbb3f89543b959223a21d2e6d9e6db615d98
bamboo_repository_name=phpBB Ascraeus
bamboo_capability_system_docker_executable=/usr/bin/docker
bamboo_build_commandline_com_atlassian_bamboo_plugins_bamboo_docker_plugin_task_docker_cli_10=/usr/bin/docker run --volume /home/bamboo/xml-data/build-dir/PHPBB3-PR-JOB1:/data --workdir /data --rm -u=991 phpbb:php-5.6 /bin/bash -c phpBB/vendor/bin/phpunit --log-junit build/logs/phpunit.xml
bamboo_build_commandline_com_atlassian_bamboo_plugins_bamboo_docker_plugin_task_docker_cli_11=/usr/bin/docker run --volume /home/bamboo/xml-data/build-dir/PHPBB3-PR-JOB1:/data --workdir /data/build --rm -u=991 phpbb:php-5.6 ../phpBB/vendor/bin/phing sniff
bamboo_build_commandline_com_atlassian_bamboo_plugins_bamboo_docker_plugin_task_docker_cli_12=/usr/bin/docker run --volume /home/bamboo/xml-data/build-dir/PHPBB3-PR-JOB1:/data --workdir /data/phpBB --rm -e HOME=/home/bamboo -u=991 phpbb:php-5.6 /bin/bash -c php ../composer.phar install --dev; cd ../build; ../phpBB/vendor/bin/phing clean prepare
bamboo_planRepository_branch=3.1.x
bamboo_agentWorkingDirectory=/home/bamboo/xml-data/build-dir
bamboo_capability_system_git_executable=/usr/bin/git
bamboo_planRepository_1_previousRevision=0984dbb3f89543b959223a21d2e6d9e6db615d98
bamboo_capability_system_builder_phpunit_PHPUnit_3_4=/usr/bin/phpunit
bamboo_repository_git_username=bantu
bamboo_repository_75956235_revision_number=0984dbb3f89543b959223a21d2e6d9e6db615d98
bamboo_planRepository_branchDisplayName=3.1.x
bamboo_planRepository_1_type=gitv2
bamboo_planRepository_branchName=3.1.x
bamboo_repository_75956235_previous_revision_number=0984dbb3f89543b959223a21d2e6d9e6db615d98
bamboo_capability_system_jdk_JDK=/usr/lib/jvm/java-6-sun
bamboo_plan_storageTag=PHPBB3-PR
bamboo_planRepository_type=gitv2
bamboo_planRepository_1_username=bantu
bamboo_ManualBuildTriggerReason_userName=Build Robot
bamboo_repository_git_repositoryUrl=https://github.com/phpbb/phpbb.git
bamboo_repository_75956235_git_branch=3.1.x
bamboo_capability_system_builder_ant_Ant=/usr/share/ant
bamboo_repository_75956235_name=phpBB Ascraeus
bamboo_working_directory=/home/bamboo/xml-data/build-dir/PHPBB3-PR-JOB1
bamboo_planKey=PHPBB3-PR
bamboo_planRepository_1_repositoryUrl=https://github.com/phpbb/phpbb.git
bamboo_planRepository_username=bantu
bamboo_capability_local=true
bamboo_capability_system_jdk_JDK_1_6=/usr/lib/jvm/java-6-sun
bamboo_capability_system_jdk_JDK_1_7=/usr/lib/jvm/java-7-openjdk-amd64
bamboo_planRepository_1_branchName=3.1.x
14-May-2017 03:50:25 From https://github.com/phpbb/phpbb
14-May-2017 03:50:25 * branch            refs/pull/4624/head -> FETCH_HEAD
14-May-2017 03:50:25   <testsuite name="" tests="6646" assertions="61267" failures="1" errors="0" time="198.383159">
14-May-2017 03:50:25     <testsuite name="phpBB Test Suite" tests="5144" assertions="59765" failures="1" errors="0" time="155.380675">
14-May-2017 03:50:25       <testsuite name="phpbb_console_user_add_test" file="/data/tests/console/user/add_test.php" tests="3" assertions="9" failures="1" errors="0" time="0.406712">
14-May-2017 03:50:25   % Total    % Received % Xferd  Average Speed   Time    Time     Time  Current
14-May-2017 03:50:25                                  Dload  Upload   Total   Spent    Left  Speed
14-May-2017 03:50:25
14-May-2017 03:50:25   0     0    0     0    0     0      0      0 --:--:-- --:--:-- --:--:--     0
14-May-2017 03:50:25 100   267  100    93  100   174    239    447 --:--:-- --:--:-- --:--:--   448
14-May-2017 03:50:25 Finished task 'Set result build status' with result: Success
14-May-2017 03:50:25 Running post build plugin 'NCover Results Collector'
14-May-2017 03:50:25 Running post build plugin 'Artifact Copier'
14-May-2017 03:50:25 Running post build plugin 'npm Cache Cleanup'
14-May-2017 03:50:25 Running post build plugin 'Clover Results Collector'
14-May-2017 03:50:25 Running post build plugin 'Docker Container Cleanup'
14-May-2017 03:50:26 Successfully removed working directory at '/home/bamboo/xml-data/build-dir/PHPBB3-PR-JOB1'
14-May-2017 03:50:26 Finalising the build...
14-May-2017 03:50:26 Stopping timer.
14-May-2017 03:50:26 Build PHPBB3-PR-JOB1-7175 completed.
14-May-2017 03:50:26 Running on server: post build plugin 'NCover Results Collector'
14-May-2017 03:50:26 Running on server: post build plugin 'Build Hanging Detection Configuration'
14-May-2017 03:50:26 Running on server: post build plugin 'Clover Delta Calculator'
14-May-2017 03:50:26 Running on server: post build plugin 'Maven Dependencies Postprocessor'
14-May-2017 03:50:26 All post build plugins have finished
14-May-2017 03:50:26 Generating build results summary...
14-May-2017 03:50:30 Saving build results to disk...
14-May-2017 03:50:31 Logging substituted variables...
14-May-2017 03:50:31 Indexing build results...
14-May-2017 03:50:31 Finished building PHPBB3-PR-JOB1-7175.
14-May-2017 03:50:31
Substituting variable: ${bamboo.PRnumber} with 4624