Tests pending pull requests

Build: #7292 failed

Job: Build and Test Job failed

Stages & jobs

  1. Build and Test

Build log

The build generated 456 lines of output. Download or view full build log

28-Jun-2017 15:31:19 Build phpBB3 - Pull Requests - Build and Test Job #7292 (PHPBB3-PR-JOB1-7292) started building on agent Default Agent
28-Jun-2017 15:31:19
28-Jun-2017 15:31:19 Build working directory is /home/bamboo/xml-data/build-dir/PHPBB3-PR-JOB1
28-Jun-2017 15:31:19 Executing build phpBB3 - Pull Requests - Build and Test Job #7292 (PHPBB3-PR-JOB1-7292)
28-Jun-2017 15:31:19 Starting task 'Checkout develop branch' of type 'com.atlassian.bamboo.plugins.vcs:task.vcs.checkout'
28-Jun-2017 15:31:19 Build always requires a clean checkout
28-Jun-2017 15:31:19 Cleaning build directory '/home/bamboo/xml-data/build-dir/PHPBB3-PR-JOB1'
28-Jun-2017 15:31:19 Updating source code to revision: dc49a8a199df28d985e951474dc08d23cd46097c
28-Jun-2017 15:31:19 Fetching 'refs/heads/3.1.x' from 'https://github.com/phpbb/phpbb.git'.
28-Jun-2017 15:31:19 Checking out revision dc49a8a199df28d985e951474dc08d23cd46097c.
28-Jun-2017 15:31:19 Creating local git repository in '/home/bamboo/xml-data/build-dir/PHPBB3-PR-JOB1/.git'.
28-Jun-2017 15:31:19 Cloning into '/home/bamboo/xml-data/build-dir/PHPBB3-PR-JOB1'...
28-Jun-2017 15:31:19 done.
28-Jun-2017 15:31:21 Switched to a new branch '3.1.x'
28-Jun-2017 15:31:21 Branch 3.1.x set up to track remote branch 3.1.x from origin.
28-Jun-2017 15:31:21 Updated source code to revision: dc49a8a199df28d985e951474dc08d23cd46097c
28-Jun-2017 15:31:21 Finished task 'Checkout develop branch' with result: Success
28-Jun-2017 15:31:21 Running pre-build action: VCS Version Collector
28-Jun-2017 15:31:21
Substituting variable: ${bamboo.PRnumber} with 4789
28-Jun-2017 15:31:21
Substituting variable: ${bamboo.buildResultsUrl} with https://bamboo.phpbb.com/browse/PHPBB3-PR-JOB1-7292
28-Jun-2017 15:31:21 Starting task 'Set pending build status' of type 'com.atlassian.bamboo.plugins.scripttask:task.builder.script'
28-Jun-2017 15:31:21
Beginning to execute external process for build 'phpBB3 - Pull Requests - Build and Test Job #7292 (PHPBB3-PR-JOB1-7292)'
... running command line:
/bin/sh /home/bamboo/temp/PHPBB3-PR-JOB1-7292-ScriptBuildTask-6456462501670185866.sh
... in: /home/bamboo/xml-data/build-dir/PHPBB3-PR-JOB1
... using extra environment variables:
bamboo_planRepository_1_branch=3.1.x
bamboo_planRepository_1_branchDisplayName=3.1.x
bamboo_repository_revision_number=dc49a8a199df28d985e951474dc08d23cd46097c
bamboo_PRref=master
bamboo_resultsUrl=https://bamboo.phpbb.com/browse/PHPBB3-PR-JOB1-7292
bamboo_capability_system_builder_command_Git=/usr/bin/git
bamboo_repository_75956235_git_username=bantu
bamboo_planRepository_1_name=phpBB Ascraeus
bamboo_build_working_directory=/home/bamboo/xml-data/build-dir/PHPBB3-PR-JOB1
bamboo_buildKey=PHPBB3-PR-JOB1
bamboo_capability_phpbb_tests=true
bamboo_shortPlanName=Pull Requests
bamboo_capability_system_builder_command_fop=/usr/bin/fop
bamboo_capability_dbms_sqlite_2=true
bamboo_planRepository_name=phpBB Ascraeus
bamboo_PRnumber=4789
bamboo_buildNumber=7292
bamboo_repository_75956235_git_repositoryUrl=https://github.com/phpbb/phpbb.git
bamboo_capability_system_builder_phpunit_PHPUnit=/usr/bin/phpunit
bamboo_shortJobName=Build and Test Job
bamboo_buildResultsUrl=https://bamboo.phpbb.com/browse/PHPBB3-PR-JOB1-7292
bamboo_repository_75956235_branch_name=3.1.x
bamboo_planRepository_repositoryUrl=https://github.com/phpbb/phpbb.git
bamboo_agentId=131073
bamboo_planName=phpBB3 - Pull Requests
bamboo_shortPlanKey=PR
bamboo_shortJobKey=JOB1
bamboo_capability_dbms_mysql_55=true
bamboo_capability_system_jdk_JDK_1_7_0_65=/usr/lib/jvm/java-7-openjdk-amd64
bamboo_planRepository_revision=dc49a8a199df28d985e951474dc08d23cd46097c
bamboo_repository_previous_revision_number=dc49a8a199df28d985e951474dc08d23cd46097c
bamboo_buildTimeStamp=2017-06-28T15:31:19.269Z
bamboo_planRepository_previousRevision=dc49a8a199df28d985e951474dc08d23cd46097c
bamboo_capability_system_builder_mvn2_Maven_2=/usr/share/maven2
bamboo_capability_system_jdk_JDK_1_6_0_16=/usr/lib/jvm/java-6-sun-1.6.0.16
bamboo_buildResultKey=PHPBB3-PR-JOB1-7292
bamboo_repository_git_branch=3.1.x
bamboo_repository_branch_name=3.1.x
bamboo_buildPlanName=phpBB3 - Pull Requests - Build and Test Job
bamboo_planRepository_1_revision=dc49a8a199df28d985e951474dc08d23cd46097c
bamboo_repository_name=phpBB Ascraeus
bamboo_buildFailed=false
bamboo_capability_system_docker_executable=/usr/bin/docker
bamboo_planRepository_branch=3.1.x
bamboo_agentWorkingDirectory=/home/bamboo/xml-data/build-dir
bamboo_capability_system_git_executable=/usr/bin/git
bamboo_planRepository_1_previousRevision=dc49a8a199df28d985e951474dc08d23cd46097c
bamboo_capability_system_builder_phpunit_PHPUnit_3_4=/usr/bin/phpunit
bamboo_repository_git_username=bantu
bamboo_repository_75956235_revision_number=dc49a8a199df28d985e951474dc08d23cd46097c
bamboo_planRepository_branchDisplayName=3.1.x
bamboo_planRepository_1_type=gitv2
bamboo_planRepository_branchName=3.1.x
bamboo_repository_75956235_previous_revision_number=dc49a8a199df28d985e951474dc08d23cd46097c
bamboo_capability_system_jdk_JDK=/usr/lib/jvm/java-6-sun
bamboo_plan_storageTag=PHPBB3-PR
bamboo_planRepository_type=gitv2
bamboo_planRepository_1_username=bantu
bamboo_ManualBuildTriggerReason_userName=Build Robot
bamboo_repository_git_repositoryUrl=https://github.com/phpbb/phpbb.git
bamboo_repository_75956235_git_branch=3.1.x
bamboo_capability_system_builder_ant_Ant=/usr/share/ant
bamboo_repository_75956235_name=phpBB Ascraeus
bamboo_working_directory=/home/bamboo/xml-data/build-dir/PHPBB3-PR-JOB1
bamboo_planKey=PHPBB3-PR
bamboo_planRepository_1_repositoryUrl=https://github.com/phpbb/phpbb.git
bamboo_planRepository_username=bantu
bamboo_capability_local=true
bamboo_capability_system_jdk_JDK_1_6=/usr/lib/jvm/java-6-sun
bamboo_capability_system_jdk_JDK_1_7=/usr/lib/jvm/java-7-openjdk-amd64
bamboo_planRepository_1_branchName=3.1.x
28-Jun-2017 15:31:22 From https://github.com/phpbb/phpbb
28-Jun-2017 15:31:22 * branch            refs/pull/4789/head -> FETCH_HEAD
28-Jun-2017 15:31:22   % Total    % Received % Xferd  Average Speed   Time    Time     Time  Current
28-Jun-2017 15:31:22                                  Dload  Upload   Total   Spent    Left  Speed
28-Jun-2017 15:31:22
28-Jun-2017 15:31:22   0     0    0     0    0     0      0      0 --:--:-- --:--:-- --:--:--     0
28-Jun-2017 15:31:22 100   275  100    93  100   182    343    671 --:--:-- --:--:-- --:--:--   674
28-Jun-2017 15:31:22 Finished task 'Set pending build status' with result: Success
28-Jun-2017 15:31:22
Substituting variable: ${bamboo.PRnumber} with 4789
28-Jun-2017 15:31:22 Starting task 'Fetch PR' of type 'com.atlassian.bamboo.plugins.scripttask:task.builder.script'
28-Jun-2017 15:31:22
Beginning to execute external process for build 'phpBB3 - Pull Requests - Build and Test Job #7292 (PHPBB3-PR-JOB1-7292)'
... running command line:
/bin/sh /home/bamboo/temp/PHPBB3-PR-JOB1-7292-ScriptBuildTask-2723591401902841711.sh
... in: /home/bamboo/xml-data/build-dir/PHPBB3-PR-JOB1
... using extra environment variables:
bamboo_planRepository_1_branch=3.1.x
bamboo_planRepository_1_branchDisplayName=3.1.x
bamboo_repository_revision_number=dc49a8a199df28d985e951474dc08d23cd46097c
bamboo_PRref=master
bamboo_resultsUrl=https://bamboo.phpbb.com/browse/PHPBB3-PR-JOB1-7292
bamboo_capability_system_builder_command_Git=/usr/bin/git
bamboo_repository_75956235_git_username=bantu
bamboo_planRepository_1_name=phpBB Ascraeus
bamboo_build_working_directory=/home/bamboo/xml-data/build-dir/PHPBB3-PR-JOB1
bamboo_buildKey=PHPBB3-PR-JOB1
bamboo_capability_phpbb_tests=true
bamboo_shortPlanName=Pull Requests
bamboo_capability_system_builder_command_fop=/usr/bin/fop
bamboo_capability_dbms_sqlite_2=true
bamboo_planRepository_name=phpBB Ascraeus
bamboo_PRnumber=4789
bamboo_buildNumber=7292
bamboo_repository_75956235_git_repositoryUrl=https://github.com/phpbb/phpbb.git
bamboo_capability_system_builder_phpunit_PHPUnit=/usr/bin/phpunit
bamboo_shortJobName=Build and Test Job
bamboo_buildResultsUrl=https://bamboo.phpbb.com/browse/PHPBB3-PR-JOB1-7292
bamboo_repository_75956235_branch_name=3.1.x
bamboo_planRepository_repositoryUrl=https://github.com/phpbb/phpbb.git
bamboo_agentId=131073
bamboo_planName=phpBB3 - Pull Requests
bamboo_build_commandline_com_atlassian_bamboo_plugins_scripttask_task_builder_script_7=/bin/sh /home/bamboo/temp/PHPBB3-PR-JOB1-7292-ScriptBuildTask-6456462501670185866.sh
bamboo_shortPlanKey=PR
bamboo_shortJobKey=JOB1
bamboo_capability_dbms_mysql_55=true
bamboo_capability_system_jdk_JDK_1_7_0_65=/usr/lib/jvm/java-7-openjdk-amd64
bamboo_planRepository_revision=dc49a8a199df28d985e951474dc08d23cd46097c
bamboo_repository_previous_revision_number=dc49a8a199df28d985e951474dc08d23cd46097c
bamboo_buildTimeStamp=2017-06-28T15:31:19.269Z
bamboo_planRepository_previousRevision=dc49a8a199df28d985e951474dc08d23cd46097c
bamboo_capability_system_builder_mvn2_Maven_2=/usr/share/maven2
bamboo_capability_system_jdk_JDK_1_6_0_16=/usr/lib/jvm/java-6-sun-1.6.0.16
bamboo_buildResultKey=PHPBB3-PR-JOB1-7292
bamboo_repository_git_branch=3.1.x
bamboo_repository_branch_name=3.1.x
bamboo_buildPlanName=phpBB3 - Pull Requests - Build and Test Job
bamboo_planRepository_1_revision=dc49a8a199df28d985e951474dc08d23cd46097c
bamboo_repository_name=phpBB Ascraeus
bamboo_buildFailed=false
bamboo_capability_system_docker_executable=/usr/bin/docker
bamboo_planRepository_branch=3.1.x
bamboo_agentWorkingDirectory=/home/bamboo/xml-data/build-dir
bamboo_capability_system_git_executable=/usr/bin/git
bamboo_planRepository_1_previousRevision=dc49a8a199df28d985e951474dc08d23cd46097c
bamboo_capability_system_builder_phpunit_PHPUnit_3_4=/usr/bin/phpunit
bamboo_repository_git_username=bantu
bamboo_repository_75956235_revision_number=dc49a8a199df28d985e951474dc08d23cd46097c
bamboo_planRepository_branchDisplayName=3.1.x
bamboo_planRepository_1_type=gitv2
bamboo_planRepository_branchName=3.1.x
bamboo_repository_75956235_previous_revision_number=dc49a8a199df28d985e951474dc08d23cd46097c
bamboo_capability_system_jdk_JDK=/usr/lib/jvm/java-6-sun
bamboo_plan_storageTag=PHPBB3-PR
bamboo_planRepository_type=gitv2
bamboo_planRepository_1_username=bantu
bamboo_ManualBuildTriggerReason_userName=Build Robot
bamboo_repository_git_repositoryUrl=https://github.com/phpbb/phpbb.git
bamboo_repository_75956235_git_branch=3.1.x
bamboo_capability_system_builder_ant_Ant=/usr/share/ant
bamboo_repository_75956235_name=phpBB Ascraeus
bamboo_working_directory=/home/bamboo/xml-data/build-dir/PHPBB3-PR-JOB1
bamboo_planKey=PHPBB3-PR
bamboo_planRepository_1_repositoryUrl=https://github.com/phpbb/phpbb.git
bamboo_planRepository_username=bantu
bamboo_capability_local=true
bamboo_capability_system_jdk_JDK_1_6=/usr/lib/jvm/java-6-sun
bamboo_capability_system_jdk_JDK_1_7=/usr/lib/jvm/java-7-openjdk-amd64
bamboo_planRepository_1_branchName=3.1.x
28-Jun-2017 15:31:23 From https://github.com/phpbb/phpbb
28-Jun-2017 15:31:23 * branch            refs/pull/4789/merge -> FETCH_HEAD
28-Jun-2017 15:31:24 Note: checking out 'FETCH_HEAD'.
28-Jun-2017 15:31:24
28-Jun-2017 15:31:24 You are in 'detached HEAD' state. You can look around, make experimental
28-Jun-2017 15:31:24 changes and commit them, and you can discard any commits you make in this
28-Jun-2017 15:31:24 state without impacting any branches by performing another checkout.
28-Jun-2017 15:31:24
28-Jun-2017 15:31:24 If you want to create a new branch to retain commits you create, you may
28-Jun-2017 15:31:24 do so (now or later) by using -b with the checkout command again. Example:
28-Jun-2017 15:31:24
28-Jun-2017 15:31:24   git checkout -b new_branch_name
28-Jun-2017 15:31:24
28-Jun-2017 15:31:24 HEAD is now at 0c0e53f... Merge ebd543903decb103b27e218093ec0c35e814638b into 5e24508280e1fc3393966487d72f01932d92afbc
28-Jun-2017 15:31:24 Finished task 'Fetch PR' with result: Success
28-Jun-2017 15:31:24 Skipping execution of task 'Prepare directory' as it is disabled
28-Jun-2017 15:31:24
Substituting variable: ${bamboo.working.directory} with /home/bamboo/xml-data/build-dir/PHPBB3-PR-JOB1
28-Jun-2017 15:31:24 Starting task 'Prepare directory' of type 'com.atlassian.bamboo.plugins.bamboo-docker-plugin:task.docker.cli'
28-Jun-2017 15:31:24 Running image name (phpbb:php-5.6)
28-Jun-2017 15:31:24
Beginning to execute external process for build 'phpBB3 - Pull Requests - Build and Test Job #7292 (PHPBB3-PR-JOB1-7292)'
... running command line:
/usr/bin/docker run --volume /home/bamboo/xml-data/build-dir/PHPBB3-PR-JOB1:/data --workdir /data/phpBB --rm -e HOME=/home/bamboo -u=991 phpbb:php-5.6 /bin/bash -c php ../composer.phar install --dev; cd ../build; ../phpBB/vendor/bin/phing clean prepare
... in: /home/bamboo/xml-data/build-dir/PHPBB3-PR-JOB1
... using extra environment variables:
bamboo_planRepository_1_branch=3.1.x
bamboo_planRepository_1_branchDisplayName=3.1.x
bamboo_repository_revision_number=dc49a8a199df28d985e951474dc08d23cd46097c
bamboo_PRref=master
bamboo_resultsUrl=https://bamboo.phpbb.com/browse/PHPBB3-PR-JOB1-7292
bamboo_capability_system_builder_command_Git=/usr/bin/git
bamboo_repository_75956235_git_username=bantu
bamboo_planRepository_1_name=phpBB Ascraeus
bamboo_build_working_directory=/home/bamboo/xml-data/build-dir/PHPBB3-PR-JOB1
bamboo_buildKey=PHPBB3-PR-JOB1
bamboo_capability_phpbb_tests=true
bamboo_shortPlanName=Pull Requests
bamboo_capability_system_builder_command_fop=/usr/bin/fop
bamboo_capability_dbms_sqlite_2=true
bamboo_planRepository_name=phpBB Ascraeus
bamboo_PRnumber=4789
bamboo_buildNumber=7292
bamboo_repository_75956235_git_repositoryUrl=https://github.com/phpbb/phpbb.git
bamboo_capability_system_builder_phpunit_PHPUnit=/usr/bin/phpunit
bamboo_shortJobName=Build and Test Job
bamboo_buildResultsUrl=https://bamboo.phpbb.com/browse/PHPBB3-PR-JOB1-7292
bamboo_repository_75956235_branch_name=3.1.x
bamboo_planRepository_repositoryUrl=https://github.com/phpbb/phpbb.git
bamboo_agentId=131073
bamboo_planName=phpBB3 - Pull Requests
bamboo_build_commandline_com_atlassian_bamboo_plugins_scripttask_task_builder_script_7=/bin/sh /home/bamboo/temp/PHPBB3-PR-JOB1-7292-ScriptBuildTask-6456462501670185866.sh
bamboo_shortPlanKey=PR
bamboo_shortJobKey=JOB1
bamboo_capability_dbms_mysql_55=true
bamboo_capability_system_jdk_JDK_1_7_0_65=/usr/lib/jvm/java-7-openjdk-amd64
bamboo_planRepository_revision=dc49a8a199df28d985e951474dc08d23cd46097c
bamboo_repository_previous_revision_number=dc49a8a199df28d985e951474dc08d23cd46097c
bamboo_buildTimeStamp=2017-06-28T15:31:19.269Z
bamboo_planRepository_previousRevision=dc49a8a199df28d985e951474dc08d23cd46097c
bamboo_capability_system_builder_mvn2_Maven_2=/usr/share/maven2
bamboo_capability_system_jdk_JDK_1_6_0_16=/usr/lib/jvm/java-6-sun-1.6.0.16
bamboo_build_commandline_com_atlassian_bamboo_plugins_scripttask_task_builder_script_4=/bin/sh /home/bamboo/temp/PHPBB3-PR-JOB1-7292-ScriptBuildTask-2723591401902841711.sh
bamboo_buildResultKey=PHPBB3-PR-JOB1-7292
bamboo_repository_git_branch=3.1.x
bamboo_repository_branch_name=3.1.x
bamboo_buildPlanName=phpBB3 - Pull Requests - Build and Test Job
bamboo_planRepository_1_revision=dc49a8a199df28d985e951474dc08d23cd46097c
bamboo_repository_name=phpBB Ascraeus
bamboo_buildFailed=false
bamboo_capability_system_docker_executable=/usr/bin/docker
bamboo_planRepository_branch=3.1.x
bamboo_agentWorkingDirectory=/home/bamboo/xml-data/build-dir
bamboo_capability_system_git_executable=/usr/bin/git
bamboo_planRepository_1_previousRevision=dc49a8a199df28d985e951474dc08d23cd46097c
bamboo_capability_system_builder_phpunit_PHPUnit_3_4=/usr/bin/phpunit
bamboo_repository_git_username=bantu
bamboo_repository_75956235_revision_number=dc49a8a199df28d985e951474dc08d23cd46097c
bamboo_planRepository_branchDisplayName=3.1.x
bamboo_planRepository_1_type=gitv2
bamboo_planRepository_branchName=3.1.x
bamboo_repository_75956235_previous_revision_number=dc49a8a199df28d985e951474dc08d23cd46097c
bamboo_capability_system_jdk_JDK=/usr/lib/jvm/java-6-sun
bamboo_plan_storageTag=PHPBB3-PR
bamboo_planRepository_type=gitv2
bamboo_planRepository_1_username=bantu
bamboo_ManualBuildTriggerReason_userName=Build Robot
bamboo_repository_git_repositoryUrl=https://github.com/phpbb/phpbb.git
bamboo_repository_75956235_git_branch=3.1.x
bamboo_capability_system_builder_ant_Ant=/usr/share/ant
bamboo_repository_75956235_name=phpBB Ascraeus
bamboo_working_directory=/home/bamboo/xml-data/build-dir/PHPBB3-PR-JOB1
bamboo_planKey=PHPBB3-PR
bamboo_planRepository_1_repositoryUrl=https://github.com/phpbb/phpbb.git
bamboo_planRepository_username=bantu
bamboo_capability_local=true
bamboo_capability_system_jdk_JDK_1_6=/usr/lib/jvm/java-6-sun
bamboo_capability_system_jdk_JDK_1_7=/usr/lib/jvm/java-7-openjdk-amd64
bamboo_planRepository_1_branchName=3.1.x
28-Jun-2017 15:31:24 You are running composer with xdebug enabled. This has a major impact on runtime performance. See https://getcomposer.org/xdebug
28-Jun-2017 15:31:24 You are using the deprecated option "dev". Dev packages are installed by default now.
28-Jun-2017 15:31:24 Cannot create cache directory /home/bamboo/.composer/cache/repo/https---packagist.org/, or directory is not writable. Proceeding without cache
28-Jun-2017 15:31:24 Cannot create cache directory /home/bamboo/.composer/cache/files/, or directory is not writable. Proceeding without cache
28-Jun-2017 15:31:24 Loading composer repositories with package information
28-Jun-2017 15:31:24 Installing dependencies (including require-dev) from lock file
28-Jun-2017 15:31:24   - Installing bantu/ini-get-wrapper (v1.0.1)
28-Jun-2017 15:31:25     Downloading: Connecting...    Downloading: 0%               Downloading: 100%    Downloading: 100%
28-Jun-2017 15:31:25
28-Jun-2017 15:31:25   - Installing symfony/process (v3.3.2)
28-Jun-2017 15:31:25     Downloading: Connecting...    Downloading: 0%               Downloading: 25%    Downloading: 30%    Downloading: 50%    Downloading: 55%    Downloading: 80%    Downloading: 85%    Downloading: 100%
28-Jun-2017 15:31:25
28-Jun-2017 15:31:25   - Installing symfony/finder (v3.3.2)
28-Jun-2017 15:31:26     Downloading: Connecting...    Downloading: 0%               Downloading: 5%    Downloading: 10%    Downloading: 40%    Downloading: 45%    Downloading: 50%    Downloading: 55%    Downloading: 60%    Downloading: 95%    Downloading: 100%
28-Jun-2017 15:31:26
28-Jun-2017 15:31:26   - Installing symfony/filesystem (v3.3.2)
28-Jun-2017 15:31:27     Downloading: Connecting...    Downloading: 0%               Downloading: 50%    Downloading: 55%    Downloading: 85%    Downloading: 90%    Downloading: 100%    Downloading: 100%
28-Jun-2017 15:31:27
28-Jun-2017 15:31:27   - Installing symfony/polyfill-mbstring (v1.4.0)
28-Jun-2017 15:31:27     Downloading: Connecting...    Downloading: 0%               Downloading: 35%    Downloading: 70%    Downloading: 90%    Downloading: 100%
28-Jun-2017 15:31:27
28-Jun-2017 15:31:27   - Installing psr/log (1.0.2)
28-Jun-2017 15:31:28     Downloading: Connecting...    Downloading: 0%               Downloading: 15%    Downloading: 100%
28-Jun-2017 15:31:28
28-Jun-2017 15:31:28   - Installing symfony/debug (v3.3.2)
28-Jun-2017 15:31:30     Downloading: Connecting...    Downloading: 0%               Downloading: 10%    Downloading: 20%    Downloading: 30%    Downloading: 40%    Downloading: 50%    Downloading: 55%    Downloading: 60%    Downloading: 70%    Downloading: 85%    Downloading: 95%    Downloading: 100%    Downloading: 100%
28-Jun-2017 15:31:30
28-Jun-2017 15:31:30   - Installing symfony/console (v3.3.2)
28-Jun-2017 15:31:30     Downloading: Connecting...    Downloading: 0%               Downloading: 5%    Downloading: 10%    Downloading: 15%    Downloading: 20%    Downloading: 25%    Downloading: 30%    Downloading: 35%    Downloading: 40%    Downloading: 45%    Downloading: 50%    Downloading: 55%    Downloading: 60%    Downloading: 65%    Downloading: 70%    Downloading: 75%    Downloading: 80%    Downloading: 85%    Downloading: 90%    Downloading: 95%    Downloading: 100%    Downloading: 100%
28-Jun-2017 15:31:30
28-Jun-2017 15:31:30   - Installing seld/phar-utils (1.0.1)
28-Jun-2017 15:31:31     Downloading: Connecting...    Downloading: 0%               Downloading: 30%    Downloading: 60%    Downloading: 85%    Downloading: 100%
28-Jun-2017 15:31:31
28-Jun-2017 15:31:31   - Installing seld/jsonlint (1.6.0)
28-Jun-2017 15:31:32     Downloading: Connecting...    Downloading: 0%               Downloading: 40%    Downloading: 85%    Downloading: 100%    Downloading: 100%
28-Jun-2017 15:31:32
28-Jun-2017 15:31:32   - Installing seld/cli-prompt (1.0.3)
28-Jun-2017 15:31:32     Downloading: Connecting...    Downloading: 0%               Downloading: 15%    Downloading: 30%    Downloading: 100%
28-Jun-2017 15:31:32
28-Jun-2017 15:31:32   - Installing justinrainbow/json-schema (5.2.1)
28-Jun-2017 15:31:33     Downloading: Connecting...    Downloading: 0%               Downloading: 5%    Downloading: 20%    Downloading: 25%    Downloading: 45%    Downloading: 50%    Downloading: 70%    Downloading: 75%    Downloading: 90%    Downloading: 95%    Downloading: 100%
28-Jun-2017 15:31:33
28-Jun-2017 15:31:33   - Installing composer/spdx-licenses (1.1.6)
28-Jun-2017 15:31:34     Downloading: Connecting...    Downloading: 0%               Downloading: 70%    Downloading: 100%
28-Jun-2017 15:31:34
28-Jun-2017 15:31:34   - Installing composer/semver (1.4.2)
28-Jun-2017 15:31:34     Downloading: Connecting...    Downloading: 0%               Downloading: 35%    Downloading: 95%    Downloading: 100%
28-Jun-2017 15:31:34
28-Jun-2017 15:31:34   - Installing composer/ca-bundle (1.0.7)
28-Jun-2017 15:31:35     Downloading: Connecting...    Downloading: 0%               Downloading: 5%    Downloading: 10%    Downloading: 15%    Downloading: 20%    Downloading: 25%    Downloading: 30%    Downloading: 35%    Downloading: 40%    Downloading: 45%    Downloading: 50%    Downloading: 55%    Downloading: 60%    Downloading: 65%    Downloading: 70%    Downloading: 75%    Downloading: 80%    Downloading: 85%    Downloading: 90%    Downloading: 95%    Downloading: 100%    Downloading: 100%
28-Jun-2017 15:31:35
28-Jun-2017 15:31:35   - Installing composer/composer (1.4.2)
28-Jun-2017 15:31:36     Downloading: Connecting...    Downloading: 0%               Downloading: 5%    Downloading: 10%    Downloading: 15%    Downloading: 20%    Downloading: 25%    Downloading: 30%    Downloading: 35%    Downloading: 40%    Downloading: 45%    Downloading: 50%    Downloading: 55%    Downloading: 60%    Downloading: 65%    Downloading: 70%    Downloading: 75%    Downloading: 80%    Downloading: 85%    Downloading: 90%    Downloading: 95%    Downloading: 100%    Downloading: 100%
28-Jun-2017 15:31:36
28-Jun-2017 15:31:36   - Installing google/recaptcha (1.1.3)
28-Jun-2017 15:31:36     Downloading: Connecting...    Downloading: 0%               Downloading: 25%    Downloading: 30%    Downloading: 55%    Downloading: 80%    Downloading: 100%
28-Jun-2017 15:31:36
28-Jun-2017 15:31:36   - Installing guzzlehttp/promises (v1.3.1)
28-Jun-2017 15:31:37     Downloading: Connecting...    Downloading: 0%               Downloading: 30%    Downloading: 60%    Downloading: 90%    Downloading: 100%
28-Jun-2017 15:31:37
28-Jun-2017 15:31:37   - Installing psr/http-message (1.0.1)
28-Jun-2017 15:31:38     Downloading: Connecting...    Downloading: 0%               Downloading: 50%    Downloading: 100%
28-Jun-2017 15:31:38
28-Jun-2017 15:31:38   - Installing guzzlehttp/psr7 (1.4.2)
28-Jun-2017 15:31:38     Downloading: Connecting...    Downloading: 0%               Downloading: 5%    Downloading: 10%    Downloading: 15%    Downloading: 20%    Downloading: 100%
28-Jun-2017 15:31:38
28-Jun-2017 15:31:38   - Installing lusitanian/oauth (v0.8.10)
28-Jun-2017 15:31:39     Downloading: Connecting...    Downloading: 0%               Downloading: 5%    Downloading: 10%    Downloading: 15%    Downloading: 20%    Downloading: 25%    Downloading: 30%    Downloading: 35%    Downloading: 40%    Downloading: 45%    Downloading: 50%    Downloading: 60%    Downloading: 65%    Downloading: 75%    Downloading: 80%    Downloading: 90%    Downloading: 95%    Downloading: 100%
28-Jun-2017 15:31:39
28-Jun-2017 15:31:39   - Installing marc1706/fast-image-size (v1.1.3)
28-Jun-2017 15:31:39     Downloading: Connecting...    Downloading: 0%               Downloading: 20%    Downloading: 40%    Downloading: 60%    Downloading: 80%    Downloading: 100%    Downloading: 100%
28-Jun-2017 15:31:39
28-Jun-2017 15:31:39   - Installing paragonie/random_compat (v1.4.2)
28-Jun-2017 15:31:40     Downloading: Connecting...    Downloading: 0%               Downloading: 10%    Downloading: 35%    Downloading: 45%    Downloading: 70%    Downloading: 80%    Downloading: 90%    Downloading: 100%
28-Jun-2017 15:31:40
28-Jun-2017 15:31:40   - Installing patchwork/utf8 (v1.3.1)
28-Jun-2017 15:31:40     Downloading: Connecting...    Downloading: 0%               Downloading: 5%    Downloading: 10%    Downloading: 15%    Downloading: 20%    Downloading: 25%    Downloading: 30%    Downloading: 35%    Downloading: 40%    Downloading: 45%    Downloading: 50%    Downloading: 55%    Downloading: 60%    Downloading: 65%    Downloading: 70%    Downloading: 75%    Downloading: 80%    Downloading: 85%    Downloading: 90%    Downloading: 95%    Downloading: 100%    Downloading: 100%
28-Jun-2017 15:31:40
28-Jun-2017 15:31:40   - Installing psr/container (1.0.0)
28-Jun-2017 15:31:41     Downloading: Connecting...    Downloading: 0%               Downloading: 75%    Downloading: 100%    Downloading: 100%
28-Jun-2017 15:31:41
28-Jun-2017 15:31:41   - Installing s9e/text-formatter (0.9.6)
28-Jun-2017 15:31:41     Downloading: Connecting...    Downloading: 0%               Downloading: 5%    Downloading: 10%    Downloading: 15%    Downloading: 20%    Downloading: 25%    Downloading: 30%    Downloading: 35%    Downloading: 40%    Downloading: 45%    Downloading: 50%    Downloading: 55%    Downloading: 60%    Downloading: 65%    Downloading: 70%    Downloading: 75%    Downloading: 80%    Downloading: 85%    Downloading: 90%    Downloading: 95%    Downloading: 100%    Downloading: 100%
28-Jun-2017 15:31:42
28-Jun-2017 15:31:42   - Installing symfony/config (v3.3.2)
28-Jun-2017 15:31:42     Downloading: Connecting...    Downloading: 0%               Downloading: 5%    Downloading: 10%    Downloading: 15%    Downloading: 20%    Downloading: 25%    Downloading: 30%    Downloading: 35%    Downloading: 40%    Downloading: 45%    Downloading: 50%    Downloading: 55%    Downloading: 60%    Downloading: 65%    Downloading: 70%    Downloading: 75%    Downloading: 80%    Downloading: 85%    Downloading: 90%    Downloading: 95%    Downloading: 100%
28-Jun-2017 15:31:42
28-Jun-2017 15:31:42   - Installing symfony/http-foundation (v3.3.2)
28-Jun-2017 15:31:43     Downloading: Connecting...    Downloading: 0%               Downloading: 5%    Downloading: 10%    Downloading: 15%    Downloading: 20%    Downloading: 25%    Downloading: 30%    Downloading: 35%    Downloading: 40%    Downloading: 45%    Downloading: 50%    Downloading: 55%    Downloading: 60%    Downloading: 65%    Downloading: 70%    Downloading: 75%    Downloading: 80%    Downloading: 85%    Downloading: 90%    Downloading: 95%    Downloading: 100%    Downloading: 100%
28-Jun-2017 15:31:43
28-Jun-2017 15:31:43   - Installing symfony/event-dispatcher (v3.3.2)
28-Jun-2017 15:31:43     Downloading: Connecting...    Downloading: 0%               Downloading: 5%    Downloading: 65%    Downloading: 70%    Downloading: 75%    Downloading: 80%    Downloading: 100%
28-Jun-2017 15:31:43
28-Jun-2017 15:31:43   - Installing symfony/http-kernel (v3.3.2)
28-Jun-2017 15:31:44     Downloading: Connecting...    Downloading: 0%               Downloading: 5%    Downloading: 10%    Downloading: 15%    Downloading: 20%    Downloading: 25%    Downloading: 30%    Downloading: 35%    Downloading: 40%    Downloading: 45%    Downloading: 50%    Downloading: 55%    Downloading: 60%    Downloading: 65%    Downloading: 70%    Downloading: 75%    Downloading: 80%    Downloading: 85%    Downloading: 90%    Downloading: 95%    Downloading: 100%    Downloading: 100%
28-Jun-2017 15:31:44
28-Jun-2017 15:31:44   - Installing symfony/dependency-injection (v3.3.2)
28-Jun-2017 15:31:45     Downloading: Connecting...    Downloading: 0%               Downloading: 5%    Downloading: 10%    Downloading: 15%    Downloading: 20%    Downloading: 25%    Downloading: 30%    Downloading: 35%    Downloading: 40%    Downloading: 45%    Downloading: 50%    Downloading: 55%    Downloading: 60%    Downloading: 65%    Downloading: 70%    Downloading: 75%    Downloading: 80%    Downloading: 85%    Downloading: 90%    Downloading: 95%    Downloading: 100%    Downloading: 100%
28-Jun-2017 15:31:45
28-Jun-2017 15:31:45   - Installing zendframework/zend-eventmanager (3.0.1)
28-Jun-2017 15:31:45     Downloading: Connecting...    Downloading: 0%               Downloading: 15%    Downloading: 30%    Downloading: 55%    Downloading: 70%    Downloading: 85%    Downloading: 100%
28-Jun-2017 15:31:45
28-Jun-2017 15:31:46   - Installing zendframework/zend-code (2.6.3)
28-Jun-2017 15:31:46     Downloading: Connecting...    Downloading: 0%               Downloading: 5%    Downloading: 10%    Downloading: 15%    Downloading: 20%    Downloading: 25%    Downloading: 30%    Downloading: 35%    Downloading: 40%    Downloading: 45%    Downloading: 50%    Downloading: 55%    Downloading: 60%    Downloading: 65%    Downloading: 70%    Downloading: 75%    Downloading: 80%    Downloading: 90%    Downloading: 95%    Downloading: 100%
28-Jun-2017 15:31:46
28-Jun-2017 15:31:46   - Installing ocramius/proxy-manager (1.0.2)
28-Jun-2017 15:31:47     Downloading: Connecting...    Downloading: 0%               Downloading: 5%    Downloading: 10%    Downloading: 15%    Downloading: 20%    Downloading: 25%    Downloading: 30%    Downloading: 35%    Downloading: 40%    Downloading: 45%    Downloading: 50%    Downloading: 55%    Downloading: 65%    Downloading: 70%    Downloading: 75%    Downloading: 80%    Downloading: 85%    Downloading: 90%    Downloading: 95%    Downloading: 100%    Downloading: 100%
28-Jun-2017 15:31:47
28-Jun-2017 15:31:47   - Installing symfony/proxy-manager-bridge (v3.3.2)
28-Jun-2017 15:31:48     Downloading: Connecting...    Downloading: 0%               Downloading: 25%    Downloading: 100%
28-Jun-2017 15:31:48
28-Jun-2017 15:31:48   - Installing symfony/routing (v3.3.2)
28-Jun-2017 15:31:49     Downloading: Connecting...    Downloading: 0%               Downloading: 5%    Downloading: 10%    Downloading: 15%    Downloading: 20%    Downloading: 25%    Downloading: 30%    Downloading: 35%    Downloading: 40%    Downloading: 45%    Downloading: 50%    Downloading: 55%    Downloading: 60%    Downloading: 65%    Downloading: 70%    Downloading: 75%    Downloading: 80%    Downloading: 85%    Downloading: 90%    Downloading: 95%    Downloading: 100%    Downloading: 100%
28-Jun-2017 15:31:49
28-Jun-2017 15:31:49   - Installing twig/twig (v1.34.3)
28-Jun-2017 15:31:50     Downloading: Connecting...    Downloading: 0%               Downloading: 5%    Downloading: 10%    Downloading: 15%    Downloading: 20%    Downloading: 25%    Downloading: 30%    Downloading: 35%    Downloading: 40%    Downloading: 50%    Downloading: 55%    Downloading: 60%    Downloading: 65%    Downloading: 70%    Downloading: 75%    Downloading: 80%    Downloading: 85%    Downloading: 90%    Downloading: 95%    Downloading: 100%    Downloading: 100%
28-Jun-2017 15:31:50
28-Jun-2017 15:31:50   - Installing symfony/twig-bridge (v3.3.2)
28-Jun-2017 15:31:50     Downloading: Connecting...    Downloading: 0%               Downloading: 5%    Downloading: 20%    Downloading: 25%    Downloading: 30%    Downloading: 35%    Downloading: 45%    Downloading: 50%    Downloading: 55%    Downloading: 60%    Downloading: 75%    Downloading: 80%    Downloading: 85%    Downloading: 90%    Downloading: 100%
28-Jun-2017 15:31:50
28-Jun-2017 15:31:50   - Installing symfony/dom-crawler (v3.3.2)
28-Jun-2017 15:31:51     Downloading: Connecting...    Downloading: 0%               Downloading: 25%    Downloading: 30%    Downloading: 50%    Downloading: 55%    Downloading: 75%    Downloading: 80%    Downloading: 100%
28-Jun-2017 15:31:51
28-Jun-2017 15:31:51   - Installing symfony/css-selector (v3.3.2)
28-Jun-2017 15:31:52     Downloading: Connecting...    Downloading: 0%               Downloading: 5%    Downloading: 10%    Downloading: 15%    Downloading: 20%    Downloading: 25%    Downloading: 30%    Downloading: 35%    Downloading: 40%    Downloading: 45%    Downloading: 50%    Downloading: 55%    Downloading: 60%    Downloading: 65%    Downloading: 70%    Downloading: 100%    Downloading: 100%
28-Jun-2017 15:31:52
28-Jun-2017 15:31:52   - Installing symfony/browser-kit (v3.3.2)
28-Jun-2017 15:31:52     Downloading: Connecting...    Downloading: 0%               Downloading: 50%    Downloading: 55%    Downloading: 100%
28-Jun-2017 15:31:52
28-Jun-2017 15:31:52   - Installing guzzlehttp/guzzle (6.2.3)
28-Jun-2017 15:31:53     Downloading: Connecting...    Downloading: 0%               Downloading: 5%    Downloading: 10%    Downloading: 15%    Downloading: 25%    Downloading: 30%    Downloading: 40%    Downloading: 45%    Downloading: 55%    Downloading: 60%    Downloading: 70%    Downloading: 75%    Downloading: 85%    Downloading: 90%    Downloading: 100%
28-Jun-2017 15:31:53
28-Jun-2017 15:31:53   - Installing fabpot/goutte (v3.2.1)
28-Jun-2017 15:31:53     Downloading: Connecting...    Downloading: 0%               Downloading: 70%    Downloading: 100%    Downloading: 100%
28-Jun-2017 15:31:53
28-Jun-2017 15:31:53   - Installing facebook/webdriver (1.3.0)
28-Jun-2017 15:31:54     Downloading: Connecting...    Downloading: 0%               Downloading: 5%    Downloading: 10%    Downloading: 15%    Downloading: 20%    Downloading: 25%    Downloading: 30%    Downloading: 35%    Downloading: 40%    Downloading: 45%    Downloading: 50%    Downloading: 55%    Downloading: 60%    Downloading: 65%    Downloading: 70%    Downloading: 75%    Downloading: 80%    Downloading: 85%    Downloading: 90%    Downloading: 95%    Downloading: 100%    Downloading: 100%
28-Jun-2017 15:31:54
28-Jun-2017 15:31:54   - Installing laravel/homestead (v4.0.5)
28-Jun-2017 15:31:54     Downloading: Connecting...    Downloading: 0%               Downloading: 5%    Downloading: 10%    Downloading: 100%
28-Jun-2017 15:31:54
28-Jun-2017 15:31:54   - Installing phing/phing (2.4.14)
28-Jun-2017 15:32:01     Downloading: Connecting...    Downloading: 0%               Downloading: 5%    Downloading: 10%    Downloading: 15%    Downloading: 20%    Downloading: 25%    Downloading: 30%    Downloading: 35%    Downloading: 40%    Downloading: 45%    Downloading: 50%    Downloading: 55%    Downloading: 60%    Downloading: 65%    Downloading: 70%    Downloading: 75%    Downloading: 80%    Downloading: 85%    Downloading: 90%    Downloading: 95%    Downloading: 100%    Downloading: 100%
28-Jun-2017 15:32:01
28-Jun-2017 15:32:01   - Installing webmozart/assert (1.2.0)
28-Jun-2017 15:32:01     Downloading: Connecting...    Downloading: 0%               Downloading: 55%    Downloading: 95%    Downloading: 100%
28-Jun-2017 15:32:01
28-Jun-2017 15:32:01   - Installing phpdocumentor/reflection-common (1.0)
28-Jun-2017 15:32:02     Downloading: Connecting...    Downloading: 0%               Downloading: 65%    Downloading: 95%    Downloading: 100%
28-Jun-2017 15:32:02
28-Jun-2017 15:32:02   - Installing phpdocumentor/type-resolver (0.2.1)
28-Jun-2017 15:32:03     Downloading: Connecting...    Downloading: 0%               Downloading: 20%    Downloading: 35%    Downloading: 80%    Downloading: 100%    Downloading: 100%
28-Jun-2017 15:32:03
28-Jun-2017 15:32:03   - Installing phpdocumentor/reflection-docblock (3.1.1)
28-Jun-2017 15:32:03     Downloading: Connecting...    Downloading: 0%               Downloading: 5%    Downloading: 15%    Downloading: 20%    Downloading: 25%    Downloading: 30%    Downloading: 40%    Downloading: 45%    Downloading: 50%    Downloading: 60%    Downloading: 65%    Downloading: 70%    Downloading: 85%    Downloading: 90%    Downloading: 95%    Downloading: 100%
28-Jun-2017 15:32:03
28-Jun-2017 15:32:03   - Installing symfony/yaml (v3.3.2)
28-Jun-2017 15:32:04     Downloading: Connecting...    Downloading: 0%               Downloading: 5%    Downloading: 10%    Downloading: 40%    Downloading: 45%    Downloading: 50%    Downloading: 55%    Downloading: 60%    Downloading: 65%    Downloading: 70%    Downloading: 95%    Downloading: 100%
28-Jun-2017 15:32:04
28-Jun-2017 15:32:04   - Installing sebastian/version (1.0.6)
28-Jun-2017 15:32:05     Downloading: Connecting...    Downloading: 0%               Downloading: 100%    Downloading: 100%
28-Jun-2017 15:32:05
28-Jun-2017 15:32:05   - Installing sebastian/global-state (1.1.1)
28-Jun-2017 15:32:05     Downloading: Connecting...    Downloading: 0%               Downloading: 40%    Downloading: 80%    Downloading: 100%
28-Jun-2017 15:32:05
28-Jun-2017 15:32:05   - Installing sebastian/recursion-context (1.0.5)
28-Jun-2017 15:32:06     Downloading: Connecting...    Downloading: 0%               Downloading: 35%    Downloading: 70%    Downloading: 100%
28-Jun-2017 15:32:06
28-Jun-2017 15:32:06   - Installing sebastian/exporter (1.2.2)
28-Jun-2017 15:32:06     Downloading: Connecting...    Downloading: 0%               Downloading: 100%    Downloading: 100%
28-Jun-2017 15:32:06
28-Jun-2017 15:32:06   - Installing sebastian/environment (1.3.8)
28-Jun-2017 15:32:07     Downloading: Connecting...    Downloading: 0%               Downloading: 15%    Downloading: 30%    Downloading: 45%    Downloading: 60%    Downloading: 75%    Downloading: 100%
28-Jun-2017 15:32:07
28-Jun-2017 15:32:07   - Installing sebastian/diff (1.4.3)
28-Jun-2017 15:32:07     Downloading: Connecting...    Downloading: 0%               Downloading: 35%    Downloading: 40%    Downloading: 75%    Downloading: 100%
28-Jun-2017 15:32:07
28-Jun-2017 15:32:07   - Installing sebastian/comparator (1.2.4)
28-Jun-2017 15:32:08     Downloading: Connecting...    Downloading: 0%               Downloading: 10%    Downloading: 75%    Downloading: 85%    Downloading: 95%    Downloading: 100%
28-Jun-2017 15:32:08
28-Jun-2017 15:32:08   - Installing phpunit/php-text-template (1.2.1)
28-Jun-2017 15:32:08     Downloading: Connecting...    Downloading: 0%               Downloading: 35%    Downloading: 100%
28-Jun-2017 15:32:08
28-Jun-2017 15:32:08   - Installing doctrine/instantiator (1.0.5)
28-Jun-2017 15:32:09     Downloading: Connecting...    Downloading: 0%               Downloading: 15%    Downloading: 30%    Downloading: 45%    Downloading: 60%    Downloading: 75%    Downloading: 90%    Downloading: 100%
28-Jun-2017 15:32:09
28-Jun-2017 15:32:09   - Installing phpunit/phpunit-mock-objects (2.3.8)
28-Jun-2017 15:32:10     Downloading: Connecting...    Downloading: 0%               Downloading: 5%    Downloading: 20%    Downloading: 25%    Downloading: 35%    Downloading: 40%    Downloading: 45%    Downloading: 50%    Downloading: 60%    Downloading: 65%    Downloading: 70%    Downloading: 75%    Downloading: 90%    Downloading: 95%    Downloading: 100%    Downloading: 100%
28-Jun-2017 15:32:10
28-Jun-2017 15:32:10   - Installing phpunit/php-timer (1.0.9)
28-Jun-2017 15:32:10     Downloading: Connecting...    Downloading: 0%               Downloading: 45%    Downloading: 100%
28-Jun-2017 15:32:10
28-Jun-2017 15:32:10   - Installing phpunit/php-file-iterator (1.4.2)
28-Jun-2017 15:32:11     Downloading: Connecting...    Downloading: 0%               Downloading: 20%    Downloading: 40%    Downloading: 60%    Downloading: 90%    Downloading: 100%
28-Jun-2017 15:32:11
28-Jun-2017 15:32:11   - Installing phpunit/php-token-stream (1.4.11)
28-Jun-2017 15:32:12     Downloading: Connecting...    Downloading: 0%               Downloading: 5%    Downloading: 10%    Downloading: 15%    Downloading: 20%    Downloading: 100%
28-Jun-2017 15:32:12
28-Jun-2017 15:32:12   - Installing phpunit/php-code-coverage (2.2.4)
28-Jun-2017 15:32:12     Downloading: Connecting...    Downloading: 0%               Downloading: 5%    Downloading: 10%    Downloading: 15%    Downloading: 20%    Downloading: 25%    Downloading: 30%    Downloading: 35%    Downloading: 40%    Downloading: 45%    Downloading: 50%    Downloading: 55%    Downloading: 60%    Downloading: 65%    Downloading: 75%    Downloading: 85%    Downloading: 90%    Downloading: 95%    Downloading: 100%    Downloading: 100%
28-Jun-2017 15:32:12
28-Jun-2017 15:32:12   - Installing phpspec/prophecy (v1.7.0)
28-Jun-2017 15:32:13     Downloading: Connecting...    Downloading: 0%               Downloading: 5%    Downloading: 10%    Downloading: 15%    Downloading: 20%    Downloading: 25%    Downloading: 30%    Downloading: 35%    Downloading: 40%    Downloading: 45%    Downloading: 50%    Downloading: 55%    Downloading: 60%    Downloading: 65%    Downloading: 70%    Downloading: 75%    Downloading: 80%    Downloading: 85%    Downloading: 90%    Downloading: 95%    Downloading: 100%    Downloading: 100%
28-Jun-2017 15:32:13
28-Jun-2017 15:32:13   - Installing phpunit/phpunit (4.8.35)
28-Jun-2017 15:32:14     Downloading: Connecting...    Downloading: 0%               Downloading: 5%    Downloading: 10%    Downloading: 15%    Downloading: 20%    Downloading: 25%    Downloading: 30%    Downloading: 35%    Downloading: 40%    Downloading: 45%    Downloading: 50%    Downloading: 55%    Downloading: 60%    Downloading: 70%    Downloading: 80%    Downloading: 85%    Downloading: 90%    Downloading: 95%    Downloading: 100%    Downloading: 100%
28-Jun-2017 15:32:14
28-Jun-2017 15:32:14   - Installing phpunit/dbunit (2.0.3)
28-Jun-2017 15:32:15     Downloading: Connecting...    Downloading: 0%               Downloading: 5%    Downloading: 10%    Downloading: 15%    Downloading: 20%    Downloading: 25%    Downloading: 30%    Downloading: 35%    Downloading: 40%    Downloading: 45%    Downloading: 50%    Downloading: 55%    Downloading: 60%    Downloading: 65%    Downloading: 70%    Downloading: 75%    Downloading: 80%    Downloading: 85%    Downloading: 90%    Downloading: 95%    Downloading: 100%    Downloading: 100%
28-Jun-2017 15:32:15
28-Jun-2017 15:32:15   - Installing squizlabs/php_codesniffer (2.9.1)
28-Jun-2017 15:32:15     Downloading: Connecting...    Downloading: 0%               Downloading: 5%    Downloading: 10%    Downloading: 15%    Downloading: 20%    Downloading: 25%    Downloading: 30%    Downloading: 35%    Downloading: 40%    Downloading: 50%    Downloading: 55%    Downloading: 60%    Downloading: 65%    Downloading: 70%    Downloading: 75%    Downloading: 80%    Downloading: 85%    Downloading: 90%    Downloading: 100%    Downloading: 100%
28-Jun-2017 15:32:15
28-Jun-2017 15:32:16 lusitanian/oauth suggests installing predis/predis (Allows using the Redis storage backend.)
28-Jun-2017 15:32:16 paragonie/random_compat suggests installing ext-libsodium (Provides a modern crypto API that can be used to generate random bytes.)
28-Jun-2017 15:32:16 patchwork/utf8 suggests installing ext-intl (Use Intl for best performance)
28-Jun-2017 15:32:16 patchwork/utf8 suggests installing ext-wfio (Use WFIO for UTF-8 filesystem access on Windows)
28-Jun-2017 15:32:16 s9e/text-formatter suggests installing ext-intl (Allows international URLs to be accepted by the URL filter)
28-Jun-2017 15:32:16 s9e/text-formatter suggests installing ext-xsl (Enables the XSLT renderer)
28-Jun-2017 15:32:16 symfony/http-kernel suggests installing symfony/class-loader ()
28-Jun-2017 15:32:16 symfony/http-kernel suggests installing symfony/var-dumper ()
28-Jun-2017 15:32:16 symfony/dependency-injection suggests installing symfony/expression-language (For using expressions in service container configuration)
28-Jun-2017 15:32:16 zendframework/zend-eventmanager suggests installing container-interop/container-interop (^1.1.0, to use the lazy listeners feature)
28-Jun-2017 15:32:16 zendframework/zend-eventmanager suggests installing zendframework/zend-stdlib (^2.7.3 || ^3.0, to use the FilterChain feature)
28-Jun-2017 15:32:16 zendframework/zend-code suggests installing doctrine/annotations (Doctrine\Common\Annotations >=1.0 for annotation features)
28-Jun-2017 15:32:16 zendframework/zend-code suggests installing zendframework/zend-stdlib (Zend\Stdlib component)
28-Jun-2017 15:32:16 ocramius/proxy-manager suggests installing ocramius/generated-hydrator (To have very fast object to array to object conversion for ghost objects)
28-Jun-2017 15:32:16 ocramius/proxy-manager suggests installing zendframework/zend-json (To have the JsonRpc adapter (Remote Object feature))
28-Jun-2017 15:32:16 ocramius/proxy-manager suggests installing zendframework/zend-soap (To have the Soap adapter (Remote Object feature))
28-Jun-2017 15:32:16 ocramius/proxy-manager suggests installing zendframework/zend-stdlib (To use the hydrator proxy)
28-Jun-2017 15:32:16 ocramius/proxy-manager suggests installing zendframework/zend-xmlrpc (To have the XmlRpc adapter (Remote Object feature))
28-Jun-2017 15:32:16 symfony/routing suggests installing doctrine/annotations (For using the annotation loader)
28-Jun-2017 15:32:16 symfony/routing suggests installing symfony/expression-language (For using expression matching)
28-Jun-2017 15:32:16 symfony/twig-bridge suggests installing symfony/asset (For using the AssetExtension)
28-Jun-2017 15:32:16 symfony/twig-bridge suggests installing symfony/expression-language (For using the ExpressionExtension)
28-Jun-2017 15:32:16 symfony/twig-bridge suggests installing symfony/form (For using the FormExtension)
28-Jun-2017 15:32:16 symfony/twig-bridge suggests installing symfony/security (For using the SecurityExtension)
28-Jun-2017 15:32:16 symfony/twig-bridge suggests installing symfony/stopwatch (For using the StopwatchExtension)
28-Jun-2017 15:32:16 symfony/twig-bridge suggests installing symfony/templating (For using the TwigEngine)
28-Jun-2017 15:32:16 symfony/twig-bridge suggests installing symfony/translation (For using the TranslationExtension)
28-Jun-2017 15:32:16 symfony/twig-bridge suggests installing symfony/var-dumper (For using the DumpExtension)
28-Jun-2017 15:32:16 symfony/twig-bridge suggests installing symfony/web-link (For using the WebLinkExtension)
28-Jun-2017 15:32:16 facebook/webdriver suggests installing phpdocumentor/phpdocumentor (2.*)
28-Jun-2017 15:32:16 sebastian/global-state suggests installing ext-uopz (*)
28-Jun-2017 15:32:16 phpunit/phpunit-mock-objects suggests installing ext-soap (*)
28-Jun-2017 15:32:16 phpunit/phpunit suggests installing phpunit/php-invoker (~1.1)
28-Jun-2017 15:32:16 Generating autoload files
28-Jun-2017 15:32:17 Buildfile: /data/build/build.xml
28-Jun-2017 15:32:17
28-Jun-2017 15:32:17 phpBB > clean:
28-Jun-2017 15:32:17
28-Jun-2017 15:32:17    [delete] Directory /data/build/logs does not exist or is not a directory.
28-Jun-2017 15:32:17    [delete] Directory /data/build/api does not exist or is not a directory.
28-Jun-2017 15:32:17    [delete] Directory /data/build/codebrowser does not exist or is not a directory.
28-Jun-2017 15:32:17    [delete] Directory /data/build/coverage does not exist or is not a directory.
28-Jun-2017 15:32:17    [delete] Directory /data/build/cpd does not exist or is not a directory.
28-Jun-2017 15:32:17    [delete] Directory /data/build/dependencies does not exist or is not a directory.
28-Jun-2017 15:32:17    [delete] Directory /data/build/new_version does not exist or is not a directory.
28-Jun-2017 15:32:17    [delete] Directory /data/build/old_versions does not exist or is not a directory.
28-Jun-2017 15:32:17    [delete] Directory /data/build/save does not exist or is not a directory.
28-Jun-2017 15:32:17
28-Jun-2017 15:32:17 phpBB > prepare:
28-Jun-2017 15:32:17
28-Jun-2017 15:32:17     [mkdir] Created dir: /data/build/logs
28-Jun-2017 15:32:17     [mkdir] Created dir: /data/build/api
28-Jun-2017 15:32:17     [mkdir] Created dir: /data/build/codebrowser
28-Jun-2017 15:32:17     [mkdir] Created dir: /data/build/coverage
28-Jun-2017 15:32:17     [mkdir] Created dir: /data/build/cpd
28-Jun-2017 15:32:17     [mkdir] Created dir: /data/build/dependencies
28-Jun-2017 15:32:17     [mkdir] Created dir: /data/build/new_version
28-Jun-2017 15:32:17     [mkdir] Created dir: /data/build/new_version/files
28-Jun-2017 15:32:17     [mkdir] Created dir: /data/build/new_version/patches
28-Jun-2017 15:32:17     [mkdir] Created dir: /data/build/new_version/release_files
28-Jun-2017 15:32:17     [mkdir] Created dir: /data/build/new_version/update
28-Jun-2017 15:32:17     [mkdir] Created dir: /data/build/old_versions
28-Jun-2017 15:32:17     [mkdir] Created dir: /data/build/save
28-Jun-2017 15:32:17
28-Jun-2017 15:32:17 BUILD FINISHED
28-Jun-2017 15:32:17
28-Jun-2017 15:32:17 Total time: 0.1200 seconds
28-Jun-2017 15:32:17
28-Jun-2017 15:32:17 Finished task 'Prepare directory' with result: Success
28-Jun-2017 15:32:17 Skipping execution of task 'Run sniffs' as it is disabled
28-Jun-2017 15:32:17
Substituting variable: ${bamboo.working.directory} with /home/bamboo/xml-data/build-dir/PHPBB3-PR-JOB1
28-Jun-2017 15:32:17 Starting task 'Run sniffs' of type 'com.atlassian.bamboo.plugins.bamboo-docker-plugin:task.docker.cli'
28-Jun-2017 15:32:17 Running image name (phpbb:php-5.6)
28-Jun-2017 15:32:17
Beginning to execute external process for build 'phpBB3 - Pull Requests - Build and Test Job #7292 (PHPBB3-PR-JOB1-7292)'
... running command line:
/usr/bin/docker run --volume /home/bamboo/xml-data/build-dir/PHPBB3-PR-JOB1:/data --workdir /data/build --rm -u=991 phpbb:php-5.6 ../phpBB/vendor/bin/phing sniff
... in: /home/bamboo/xml-data/build-dir/PHPBB3-PR-JOB1
... using extra environment variables:
bamboo_planRepository_1_branch=3.1.x
bamboo_planRepository_1_branchDisplayName=3.1.x
bamboo_repository_revision_number=dc49a8a199df28d985e951474dc08d23cd46097c
bamboo_PRref=master
bamboo_resultsUrl=https://bamboo.phpbb.com/browse/PHPBB3-PR-JOB1-7292
bamboo_capability_system_builder_command_Git=/usr/bin/git
bamboo_repository_75956235_git_username=bantu
bamboo_planRepository_1_name=phpBB Ascraeus
bamboo_build_working_directory=/home/bamboo/xml-data/build-dir/PHPBB3-PR-JOB1
bamboo_buildKey=PHPBB3-PR-JOB1
bamboo_capability_phpbb_tests=true
bamboo_shortPlanName=Pull Requests
bamboo_capability_system_builder_command_fop=/usr/bin/fop
bamboo_capability_dbms_sqlite_2=true
bamboo_planRepository_name=phpBB Ascraeus
bamboo_PRnumber=4789
bamboo_buildNumber=7292
bamboo_repository_75956235_git_repositoryUrl=https://github.com/phpbb/phpbb.git
bamboo_capability_system_builder_phpunit_PHPUnit=/usr/bin/phpunit
bamboo_shortJobName=Build and Test Job
bamboo_buildResultsUrl=https://bamboo.phpbb.com/browse/PHPBB3-PR-JOB1-7292
bamboo_repository_75956235_branch_name=3.1.x
bamboo_planRepository_repositoryUrl=https://github.com/phpbb/phpbb.git
bamboo_agentId=131073
bamboo_planName=phpBB3 - Pull Requests
bamboo_build_commandline_com_atlassian_bamboo_plugins_scripttask_task_builder_script_7=/bin/sh /home/bamboo/temp/PHPBB3-PR-JOB1-7292-ScriptBuildTask-6456462501670185866.sh
bamboo_shortPlanKey=PR
bamboo_shortJobKey=JOB1
bamboo_capability_dbms_mysql_55=true
bamboo_capability_system_jdk_JDK_1_7_0_65=/usr/lib/jvm/java-7-openjdk-amd64
bamboo_planRepository_revision=dc49a8a199df28d985e951474dc08d23cd46097c
bamboo_repository_previous_revision_number=dc49a8a199df28d985e951474dc08d23cd46097c
bamboo_buildTimeStamp=2017-06-28T15:31:19.269Z
bamboo_planRepository_previousRevision=dc49a8a199df28d985e951474dc08d23cd46097c
bamboo_capability_system_builder_mvn2_Maven_2=/usr/share/maven2
bamboo_capability_system_jdk_JDK_1_6_0_16=/usr/lib/jvm/java-6-sun-1.6.0.16
bamboo_build_commandline_com_atlassian_bamboo_plugins_scripttask_task_builder_script_4=/bin/sh /home/bamboo/temp/PHPBB3-PR-JOB1-7292-ScriptBuildTask-2723591401902841711.sh
bamboo_buildResultKey=PHPBB3-PR-JOB1-7292
bamboo_repository_git_branch=3.1.x
bamboo_repository_branch_name=3.1.x
bamboo_buildPlanName=phpBB3 - Pull Requests - Build and Test Job
bamboo_planRepository_1_revision=dc49a8a199df28d985e951474dc08d23cd46097c
bamboo_repository_name=phpBB Ascraeus
bamboo_buildFailed=false
bamboo_capability_system_docker_executable=/usr/bin/docker
bamboo_build_commandline_com_atlassian_bamboo_plugins_bamboo_docker_plugin_task_docker_cli_12=/usr/bin/docker run --volume /home/bamboo/xml-data/build-dir/PHPBB3-PR-JOB1:/data --workdir /data/phpBB --rm -e HOME=/home/bamboo -u=991 phpbb:php-5.6 /bin/bash -c php ../composer.phar install --dev; cd ../build; ../phpBB/vendor/bin/phing clean prepare
bamboo_planRepository_branch=3.1.x
bamboo_agentWorkingDirectory=/home/bamboo/xml-data/build-dir
bamboo_capability_system_git_executable=/usr/bin/git
bamboo_planRepository_1_previousRevision=dc49a8a199df28d985e951474dc08d23cd46097c
bamboo_capability_system_builder_phpunit_PHPUnit_3_4=/usr/bin/phpunit
bamboo_repository_git_username=bantu
bamboo_repository_75956235_revision_number=dc49a8a199df28d985e951474dc08d23cd46097c
bamboo_planRepository_branchDisplayName=3.1.x
bamboo_planRepository_1_type=gitv2
bamboo_planRepository_branchName=3.1.x
bamboo_repository_75956235_previous_revision_number=dc49a8a199df28d985e951474dc08d23cd46097c
bamboo_capability_system_jdk_JDK=/usr/lib/jvm/java-6-sun
bamboo_plan_storageTag=PHPBB3-PR
bamboo_planRepository_type=gitv2
bamboo_planRepository_1_username=bantu
bamboo_ManualBuildTriggerReason_userName=Build Robot
bamboo_repository_git_repositoryUrl=https://github.com/phpbb/phpbb.git
bamboo_repository_75956235_git_branch=3.1.x
bamboo_capability_system_builder_ant_Ant=/usr/share/ant
bamboo_repository_75956235_name=phpBB Ascraeus
bamboo_working_directory=/home/bamboo/xml-data/build-dir/PHPBB3-PR-JOB1
bamboo_planKey=PHPBB3-PR
bamboo_planRepository_1_repositoryUrl=https://github.com/phpbb/phpbb.git
bamboo_planRepository_username=bantu
bamboo_capability_local=true
bamboo_capability_system_jdk_JDK_1_6=/usr/lib/jvm/java-6-sun
bamboo_capability_system_jdk_JDK_1_7=/usr/lib/jvm/java-7-openjdk-amd64
bamboo_planRepository_1_branchName=3.1.x
28-Jun-2017 15:32:17 Buildfile: /data/build/build.xml
28-Jun-2017 15:32:18
28-Jun-2017 15:32:18 phpBB > sniff:
28-Jun-2017 15:32:18
28-Jun-2017 15:32:27 ............................................................  60 / 722 (8%)
28-Jun-2017 15:32:28 ............................................................ 120 / 722 (17%)
28-Jun-2017 15:32:29 ............................................................ 180 / 722 (25%)
28-Jun-2017 15:32:30 ............................................................ 240 / 722 (33%)
28-Jun-2017 15:32:35 ...........................................E................ 300 / 722 (42%)
28-Jun-2017 15:32:40 ............................................................ 360 / 722 (50%)
28-Jun-2017 15:32:47 ............................................................ 420 / 722 (58%)
28-Jun-2017 15:32:52 ............................................................ 480 / 722 (66%)
28-Jun-2017 15:32:56 ............................................................ 540 / 722 (75%)
28-Jun-2017 15:33:00 ............................................................ 600 / 722 (83%)
28-Jun-2017 15:33:06 ............................................................ 660 / 722 (91%)
28-Jun-2017 15:33:09 ............................................................ 720 / 722 (100%)
28-Jun-2017 15:33:09 ..
28-Jun-2017 15:33:09
28-Jun-2017 15:33:09
28-Jun-2017 15:33:09 FILE: /data/phpBB/phpbb/console/command/style/install.php
28-Jun-2017 15:33:09 ----------------------------------------------------------------------
28-Jun-2017 15:33:09 FOUND 1 ERROR AFFECTING 1 LINE
28-Jun-2017 15:33:09 ----------------------------------------------------------------------
28-Jun-2017 15:33:09 16 | ERROR | There must not be unused USE statements.
28-Jun-2017 15:33:09     |       | (phpbb.Namespaces.UnusedUse.Unused)
28-Jun-2017 15:33:09 ----------------------------------------------------------------------
28-Jun-2017 15:33:09
28-Jun-2017 15:33:09 Time: 51.63 secs; Memory: 62.75Mb
28-Jun-2017 15:33:09
28-Jun-2017 15:33:19 ............................................................  60 / 206 (29%)
28-Jun-2017 15:33:43 ............................................................ 120 / 206 (58%)
28-Jun-2017 15:34:01 ............................................................ 180 / 206 (87%)
28-Jun-2017 15:34:11 ..........................
28-Jun-2017 15:34:11
28-Jun-2017 15:34:11 Time: 1 mins, 1.3 secs; Memory: 60.25Mb
28-Jun-2017 15:34:11
28-Jun-2017 15:34:11
28-Jun-2017 15:34:11
28-Jun-2017 15:34:11 Time: 20ms; Memory: 3.5Mb
28-Jun-2017 15:34:11
28-Jun-2017 15:34:11        [if] Error in IfTask
28-Jun-2017 15:34:11 Execution of target "sniff" failed for the following reason: /data/build/build.xml:109:6: /data/build/build.xml:115:9: PHP Code Sniffer failed.
28-Jun-2017 15:34:11
28-Jun-2017 15:34:11 BUILD FAILED
28-Jun-2017 15:34:11 /data/build/build.xml:109:6: /data/build/build.xml:115:9: PHP Code Sniffer failed.
28-Jun-2017 15:34:11 Total time: 2 minutes  53.28 seconds
28-Jun-2017 15:34:11
28-Jun-2017 15:34:11 Failing task since return code of [/usr/bin/docker run --volume /home/bamboo/xml-data/build-dir/PHPBB3-PR-JOB1:/data --workdir /data/build --rm -u=991 phpbb:php-5.6 ../phpBB/vendor/bin/phing sniff] was 1 while expected 0
28-Jun-2017 15:34:11 Error occurred while running Task 'Run sniffs(11)' of type com.atlassian.bamboo.plugins.bamboo-docker-plugin:task.docker.cli.
28-Jun-2017 15:34:11 com.atlassian.bamboo.task.TaskException: Failed to execute task
28-Jun-2017 15:34:11         at com.atlassian.bamboo.plugins.docker.service.RunService.execute(RunService.java:71)
28-Jun-2017 15:34:11         at com.atlassian.bamboo.plugins.docker.tasks.cli.DockerCliTask.execute(DockerCliTask.java:64)
28-Jun-2017 15:34:11         at com.atlassian.bamboo.task.TaskExecutorImpl.lambda$executeTasks$3(TaskExecutorImpl.java:284)
28-Jun-2017 15:34:11         at com.atlassian.bamboo.task.TaskExecutorImpl.executeTaskWithPrePostActions(TaskExecutorImpl.java:223)
28-Jun-2017 15:34:11         at com.atlassian.bamboo.task.TaskExecutorImpl.executeTasks(TaskExecutorImpl.java:284)
28-Jun-2017 15:34:11         at com.atlassian.bamboo.task.TaskExecutorImpl.execute(TaskExecutorImpl.java:111)
28-Jun-2017 15:34:11         at com.atlassian.bamboo.build.pipeline.tasks.ExecuteBuildTask.call(ExecuteBuildTask.java:69)
28-Jun-2017 15:34:11         at com.atlassian.bamboo.v2.build.agent.DefaultBuildAgent.build(DefaultBuildAgent.java:185)
28-Jun-2017 15:34:11         at com.atlassian.bamboo.v2.build.agent.BuildAgentControllerImpl$1.call(BuildAgentControllerImpl.java:122)
28-Jun-2017 15:34:11         at com.atlassian.bamboo.v2.build.agent.BuildAgentControllerImpl$1.call(BuildAgentControllerImpl.java:115)
28-Jun-2017 15:34:11         at com.atlassian.bamboo.variable.CustomVariableContextImpl.withVariableSubstitutor(CustomVariableContextImpl.java:185)
28-Jun-2017 15:34:11         at com.atlassian.bamboo.v2.build.agent.BuildAgentControllerImpl.waitAndPerformBuild(BuildAgentControllerImpl.java:115)
28-Jun-2017 15:34:11         at com.atlassian.bamboo.v2.build.agent.DefaultBuildAgent$1.run(DefaultBuildAgent.java:126)
28-Jun-2017 15:34:11         at com.atlassian.bamboo.utils.BambooRunnables$1.run(BambooRunnables.java:47)
28-Jun-2017 15:34:11         at com.atlassian.bamboo.security.ImpersonationHelper.runWith(ImpersonationHelper.java:26)
28-Jun-2017 15:34:11         at com.atlassian.bamboo.security.ImpersonationHelper.runWithSystemAuthority(ImpersonationHelper.java:17)
28-Jun-2017 15:34:11         at com.atlassian.bamboo.security.ImpersonationHelper$1.run(ImpersonationHelper.java:41)
28-Jun-2017 15:34:11         at java.lang.Thread.run(Thread.java:745)
28-Jun-2017 15:34:11 Caused by: com.atlassian.bamboo.plugins.docker.client.DockerException: Error running Docker run command
28-Jun-2017 15:34:11         at com.atlassian.bamboo.plugins.docker.client.DockerCmd.run(DockerCmd.java:103)
28-Jun-2017 15:34:11         at com.atlassian.bamboo.plugins.docker.service.RunService.execute(RunService.java:60)
28-Jun-2017 15:34:11         ... 17 more
28-Jun-2017 15:34:11 Caused by: com.atlassian.utils.process.ProcessException: Error executing /usr/bin/docker run --volume /home/bamboo/xml-data/build-dir/PHPBB3-PR-JOB1:/data --workdir /data/build --rm -u=991 phpbb:php-5.6 ../phpBB/vendor/bin/phing sniff
28-Jun-2017 15:34:11         at com.atlassian.bamboo.plugins.docker.process.DockerTaskProcessService.execute(DockerTaskProcessService.java:60)
28-Jun-2017 15:34:11         at com.atlassian.bamboo.plugins.docker.client.DockerCmd.run(DockerCmd.java:99)
28-Jun-2017 15:34:11         ... 18 more
28-Jun-2017 15:34:11 Starting task 'Parsing test results produced by script' of type 'com.atlassian.bamboo.plugins.testresultparser:task.testresultparser.junit'
28-Jun-2017 15:34:11 Parsing test results under /home/bamboo/xml-data/build-dir/PHPBB3-PR-JOB1...
28-Jun-2017 15:34:11 Failing task since test cases were expected but none were found.
28-Jun-2017 15:34:11 Finished task 'Parsing test results produced by script' with result: Failed
28-Jun-2017 15:34:11
Substituting variable: ${bamboo.PRnumber} with 4789
28-Jun-2017 15:34:11
Substituting variable: ${bamboo.buildResultsUrl} with https://bamboo.phpbb.com/browse/PHPBB3-PR-JOB1-7292
28-Jun-2017 15:34:11
Substituting variable: ${bamboo.buildResultsUrl} with https://bamboo.phpbb.com/browse/PHPBB3-PR-JOB1-7292
28-Jun-2017 15:34:11 Starting task 'Set result build status' of type 'com.atlassian.bamboo.plugins.scripttask:task.builder.script'
28-Jun-2017 15:34:11
Beginning to execute external process for build 'phpBB3 - Pull Requests - Build and Test Job #7292 (PHPBB3-PR-JOB1-7292)'
... running command line:
/bin/sh /home/bamboo/temp/PHPBB3-PR-JOB1-7292-ScriptBuildTask-1510467576661847489.sh
... in: /home/bamboo/xml-data/build-dir/PHPBB3-PR-JOB1
... using extra environment variables:
bamboo_planRepository_1_branch=3.1.x
bamboo_planRepository_1_branchDisplayName=3.1.x
bamboo_repository_revision_number=dc49a8a199df28d985e951474dc08d23cd46097c
bamboo_PRref=master
bamboo_resultsUrl=https://bamboo.phpbb.com/browse/PHPBB3-PR-JOB1-7292
bamboo_capability_system_builder_command_Git=/usr/bin/git
bamboo_repository_75956235_git_username=bantu
bamboo_planRepository_1_name=phpBB Ascraeus
bamboo_build_working_directory=/home/bamboo/xml-data/build-dir/PHPBB3-PR-JOB1
bamboo_buildKey=PHPBB3-PR-JOB1
bamboo_capability_phpbb_tests=true
bamboo_shortPlanName=Pull Requests
bamboo_capability_system_builder_command_fop=/usr/bin/fop
bamboo_capability_dbms_sqlite_2=true
bamboo_planRepository_name=phpBB Ascraeus
bamboo_PRnumber=4789
bamboo_buildNumber=7292
bamboo_repository_75956235_git_repositoryUrl=https://github.com/phpbb/phpbb.git
bamboo_capability_system_builder_phpunit_PHPUnit=/usr/bin/phpunit
bamboo_shortJobName=Build and Test Job
bamboo_buildResultsUrl=https://bamboo.phpbb.com/browse/PHPBB3-PR-JOB1-7292
bamboo_repository_75956235_branch_name=3.1.x
bamboo_planRepository_repositoryUrl=https://github.com/phpbb/phpbb.git
bamboo_agentId=131073
bamboo_planName=phpBB3 - Pull Requests
bamboo_build_commandline_com_atlassian_bamboo_plugins_scripttask_task_builder_script_7=/bin/sh /home/bamboo/temp/PHPBB3-PR-JOB1-7292-ScriptBuildTask-6456462501670185866.sh
bamboo_shortPlanKey=PR
bamboo_shortJobKey=JOB1
bamboo_capability_dbms_mysql_55=true
bamboo_capability_system_jdk_JDK_1_7_0_65=/usr/lib/jvm/java-7-openjdk-amd64
bamboo_planRepository_revision=dc49a8a199df28d985e951474dc08d23cd46097c
bamboo_repository_previous_revision_number=dc49a8a199df28d985e951474dc08d23cd46097c
bamboo_buildTimeStamp=2017-06-28T15:31:19.269Z
bamboo_planRepository_previousRevision=dc49a8a199df28d985e951474dc08d23cd46097c
bamboo_capability_system_builder_mvn2_Maven_2=/usr/share/maven2
bamboo_capability_system_jdk_JDK_1_6_0_16=/usr/lib/jvm/java-6-sun-1.6.0.16
bamboo_build_commandline_com_atlassian_bamboo_plugins_scripttask_task_builder_script_4=/bin/sh /home/bamboo/temp/PHPBB3-PR-JOB1-7292-ScriptBuildTask-2723591401902841711.sh
bamboo_buildResultKey=PHPBB3-PR-JOB1-7292
bamboo_repository_git_branch=3.1.x
bamboo_repository_branch_name=3.1.x
bamboo_buildPlanName=phpBB3 - Pull Requests - Build and Test Job
bamboo_planRepository_1_revision=dc49a8a199df28d985e951474dc08d23cd46097c
bamboo_repository_name=phpBB Ascraeus
bamboo_buildFailed=true
bamboo_capability_system_docker_executable=/usr/bin/docker
bamboo_build_commandline_com_atlassian_bamboo_plugins_bamboo_docker_plugin_task_docker_cli_11=/usr/bin/docker run --volume /home/bamboo/xml-data/build-dir/PHPBB3-PR-JOB1:/data --workdir /data/build --rm -u=991 phpbb:php-5.6 ../phpBB/vendor/bin/phing sniff
bamboo_build_commandline_com_atlassian_bamboo_plugins_bamboo_docker_plugin_task_docker_cli_12=/usr/bin/docker run --volume /home/bamboo/xml-data/build-dir/PHPBB3-PR-JOB1:/data --workdir /data/phpBB --rm -e HOME=/home/bamboo -u=991 phpbb:php-5.6 /bin/bash -c php ../composer.phar install --dev; cd ../build; ../phpBB/vendor/bin/phing clean prepare
bamboo_planRepository_branch=3.1.x
bamboo_jobFailed=true
bamboo_agentWorkingDirectory=/home/bamboo/xml-data/build-dir
bamboo_capability_system_git_executable=/usr/bin/git
bamboo_planRepository_1_previousRevision=dc49a8a199df28d985e951474dc08d23cd46097c
bamboo_capability_system_builder_phpunit_PHPUnit_3_4=/usr/bin/phpunit
bamboo_repository_git_username=bantu
bamboo_repository_75956235_revision_number=dc49a8a199df28d985e951474dc08d23cd46097c
bamboo_planRepository_branchDisplayName=3.1.x
bamboo_planRepository_1_type=gitv2
bamboo_planRepository_branchName=3.1.x
bamboo_repository_75956235_previous_revision_number=dc49a8a199df28d985e951474dc08d23cd46097c
bamboo_capability_system_jdk_JDK=/usr/lib/jvm/java-6-sun
bamboo_plan_storageTag=PHPBB3-PR
bamboo_planRepository_type=gitv2
bamboo_planRepository_1_username=bantu
bamboo_ManualBuildTriggerReason_userName=Build Robot
bamboo_repository_git_repositoryUrl=https://github.com/phpbb/phpbb.git
bamboo_repository_75956235_git_branch=3.1.x
bamboo_capability_system_builder_ant_Ant=/usr/share/ant
bamboo_repository_75956235_name=phpBB Ascraeus
bamboo_working_directory=/home/bamboo/xml-data/build-dir/PHPBB3-PR-JOB1
bamboo_planKey=PHPBB3-PR
bamboo_planRepository_1_repositoryUrl=https://github.com/phpbb/phpbb.git
bamboo_planRepository_username=bantu
bamboo_capability_local=true
bamboo_capability_system_jdk_JDK_1_6=/usr/lib/jvm/java-6-sun
bamboo_capability_system_jdk_JDK_1_7=/usr/lib/jvm/java-7-openjdk-amd64
bamboo_planRepository_1_branchName=3.1.x
28-Jun-2017 15:34:11 From https://github.com/phpbb/phpbb
28-Jun-2017 15:34:11 * branch            refs/pull/4789/head -> FETCH_HEAD
28-Jun-2017 15:34:11 grep: build/logs/phpunit.xml: No such file or directory
28-Jun-2017 15:34:11 grep: build/logs/phpunit.xml: No such file or directory
28-Jun-2017 15:34:11   % Total    % Received % Xferd  Average Speed   Time    Time     Time  Current
28-Jun-2017 15:34:11                                  Dload  Upload   Total   Spent    Left  Speed
28-Jun-2017 15:34:11
28-Jun-2017 15:34:12   0     0    0     0    0     0      0      0 --:--:-- --:--:-- --:--:--     0
28-Jun-2017 15:34:12   0     0    0     0    0     0      0      0 --:--:-- --:--:-- --:--:--     0
28-Jun-2017 15:34:12 100   273  100    93  100   180    171    331 --:--:-- --:--:-- --:--:--   331
28-Jun-2017 15:34:12 Finished task 'Set result build status' with result: Success
28-Jun-2017 15:34:12 Running post build plugin 'NCover Results Collector'
28-Jun-2017 15:34:12 Running post build plugin 'Artifact Copier'
28-Jun-2017 15:34:12 Running post build plugin 'npm Cache Cleanup'
28-Jun-2017 15:34:12 Running post build plugin 'Clover Results Collector'
28-Jun-2017 15:34:12 Running post build plugin 'Docker Container Cleanup'
28-Jun-2017 15:34:12 Successfully removed working directory at '/home/bamboo/xml-data/build-dir/PHPBB3-PR-JOB1'
28-Jun-2017 15:34:12 Finalising the build...
28-Jun-2017 15:34:12 Stopping timer.
28-Jun-2017 15:34:12 Build PHPBB3-PR-JOB1-7292 completed.
28-Jun-2017 15:34:12 Running on server: post build plugin 'NCover Results Collector'
28-Jun-2017 15:34:12 Running on server: post build plugin 'Build Hanging Detection Configuration'
28-Jun-2017 15:34:12 Running on server: post build plugin 'Clover Delta Calculator'
28-Jun-2017 15:34:12 Running on server: post build plugin 'Maven Dependencies Postprocessor'
28-Jun-2017 15:34:12 All post build plugins have finished
28-Jun-2017 15:34:12 Generating build results summary...
28-Jun-2017 15:34:12 Saving build results to disk...
28-Jun-2017 15:34:12 Logging substituted variables...
28-Jun-2017 15:34:12 Indexing build results...
28-Jun-2017 15:34:12 Finished building PHPBB3-PR-JOB1-7292.
28-Jun-2017 15:34:12
Substituting variable: ${bamboo.PRnumber} with 4789