Tests pending pull requests

Build: #7297 failed

Job: Build and Test Job failed

Stages & jobs

  1. Build and Test

Build log

The build generated 533 lines of output. Download or view full build log

28-Jun-2017 17:50:38 Build phpBB3 - Pull Requests - Build and Test Job #7297 (PHPBB3-PR-JOB1-7297) started building on agent Default Agent
28-Jun-2017 17:50:38
28-Jun-2017 17:50:38 Build working directory is /home/bamboo/xml-data/build-dir/PHPBB3-PR-JOB1
28-Jun-2017 17:50:38 Executing build phpBB3 - Pull Requests - Build and Test Job #7297 (PHPBB3-PR-JOB1-7297)
28-Jun-2017 17:50:38 Starting task 'Checkout develop branch' of type 'com.atlassian.bamboo.plugins.vcs:task.vcs.checkout'
28-Jun-2017 17:50:38 Build always requires a clean checkout
28-Jun-2017 17:50:38 Cleaning build directory '/home/bamboo/xml-data/build-dir/PHPBB3-PR-JOB1'
28-Jun-2017 17:50:38 Updating source code to revision: dc49a8a199df28d985e951474dc08d23cd46097c
28-Jun-2017 17:50:38 Fetching 'refs/heads/3.1.x' from 'https://github.com/phpbb/phpbb.git'.
28-Jun-2017 17:50:38 Checking out revision dc49a8a199df28d985e951474dc08d23cd46097c.
28-Jun-2017 17:50:38 Creating local git repository in '/home/bamboo/xml-data/build-dir/PHPBB3-PR-JOB1/.git'.
28-Jun-2017 17:50:38 Cloning into '/home/bamboo/xml-data/build-dir/PHPBB3-PR-JOB1'...
28-Jun-2017 17:50:38 done.
28-Jun-2017 17:50:40 Branch 3.1.x set up to track remote branch 3.1.x from origin.
28-Jun-2017 17:50:40 Switched to a new branch '3.1.x'
28-Jun-2017 17:50:40 Updated source code to revision: dc49a8a199df28d985e951474dc08d23cd46097c
28-Jun-2017 17:50:40 Finished task 'Checkout develop branch' with result: Success
28-Jun-2017 17:50:40 Running pre-build action: VCS Version Collector
28-Jun-2017 17:50:40
Substituting variable: ${bamboo.PRnumber} with 4847
28-Jun-2017 17:50:40
Substituting variable: ${bamboo.buildResultsUrl} with https://bamboo.phpbb.com/browse/PHPBB3-PR-JOB1-7297
28-Jun-2017 17:50:40 Starting task 'Set pending build status' of type 'com.atlassian.bamboo.plugins.scripttask:task.builder.script'
28-Jun-2017 17:50:40
Beginning to execute external process for build 'phpBB3 - Pull Requests - Build and Test Job #7297 (PHPBB3-PR-JOB1-7297)'
... running command line:
/bin/sh /home/bamboo/temp/PHPBB3-PR-JOB1-7297-ScriptBuildTask-2830558080592329690.sh
... in: /home/bamboo/xml-data/build-dir/PHPBB3-PR-JOB1
... using extra environment variables:
bamboo_planRepository_1_branch=3.1.x
bamboo_planRepository_1_branchDisplayName=3.1.x
bamboo_repository_revision_number=dc49a8a199df28d985e951474dc08d23cd46097c
bamboo_PRref=master
bamboo_resultsUrl=https://bamboo.phpbb.com/browse/PHPBB3-PR-JOB1-7297
bamboo_capability_system_builder_command_Git=/usr/bin/git
bamboo_repository_75956235_git_username=bantu
bamboo_planRepository_1_name=phpBB Ascraeus
bamboo_build_working_directory=/home/bamboo/xml-data/build-dir/PHPBB3-PR-JOB1
bamboo_buildKey=PHPBB3-PR-JOB1
bamboo_capability_phpbb_tests=true
bamboo_shortPlanName=Pull Requests
bamboo_capability_system_builder_command_fop=/usr/bin/fop
bamboo_capability_dbms_sqlite_2=true
bamboo_planRepository_name=phpBB Ascraeus
bamboo_PRnumber=4847
bamboo_buildNumber=7297
bamboo_repository_75956235_git_repositoryUrl=https://github.com/phpbb/phpbb.git
bamboo_capability_system_builder_phpunit_PHPUnit=/usr/bin/phpunit
bamboo_shortJobName=Build and Test Job
bamboo_buildResultsUrl=https://bamboo.phpbb.com/browse/PHPBB3-PR-JOB1-7297
bamboo_repository_75956235_branch_name=3.1.x
bamboo_planRepository_repositoryUrl=https://github.com/phpbb/phpbb.git
bamboo_agentId=131073
bamboo_planName=phpBB3 - Pull Requests
bamboo_shortPlanKey=PR
bamboo_shortJobKey=JOB1
bamboo_capability_dbms_mysql_55=true
bamboo_capability_system_jdk_JDK_1_7_0_65=/usr/lib/jvm/java-7-openjdk-amd64
bamboo_planRepository_revision=dc49a8a199df28d985e951474dc08d23cd46097c
bamboo_repository_previous_revision_number=dc49a8a199df28d985e951474dc08d23cd46097c
bamboo_buildTimeStamp=2017-06-28T17:50:38.442Z
bamboo_planRepository_previousRevision=dc49a8a199df28d985e951474dc08d23cd46097c
bamboo_capability_system_builder_mvn2_Maven_2=/usr/share/maven2
bamboo_capability_system_jdk_JDK_1_6_0_16=/usr/lib/jvm/java-6-sun-1.6.0.16
bamboo_buildResultKey=PHPBB3-PR-JOB1-7297
bamboo_repository_git_branch=3.1.x
bamboo_repository_branch_name=3.1.x
bamboo_buildPlanName=phpBB3 - Pull Requests - Build and Test Job
bamboo_planRepository_1_revision=dc49a8a199df28d985e951474dc08d23cd46097c
bamboo_repository_name=phpBB Ascraeus
bamboo_buildFailed=false
bamboo_capability_system_docker_executable=/usr/bin/docker
bamboo_planRepository_branch=3.1.x
bamboo_agentWorkingDirectory=/home/bamboo/xml-data/build-dir
bamboo_capability_system_git_executable=/usr/bin/git
bamboo_planRepository_1_previousRevision=dc49a8a199df28d985e951474dc08d23cd46097c
bamboo_capability_system_builder_phpunit_PHPUnit_3_4=/usr/bin/phpunit
bamboo_repository_git_username=bantu
bamboo_repository_75956235_revision_number=dc49a8a199df28d985e951474dc08d23cd46097c
bamboo_planRepository_branchDisplayName=3.1.x
bamboo_planRepository_1_type=gitv2
bamboo_planRepository_branchName=3.1.x
bamboo_repository_75956235_previous_revision_number=dc49a8a199df28d985e951474dc08d23cd46097c
bamboo_capability_system_jdk_JDK=/usr/lib/jvm/java-6-sun
bamboo_plan_storageTag=PHPBB3-PR
bamboo_planRepository_type=gitv2
bamboo_planRepository_1_username=bantu
bamboo_ManualBuildTriggerReason_userName=Build Robot
bamboo_repository_git_repositoryUrl=https://github.com/phpbb/phpbb.git
bamboo_repository_75956235_git_branch=3.1.x
bamboo_capability_system_builder_ant_Ant=/usr/share/ant
bamboo_repository_75956235_name=phpBB Ascraeus
bamboo_working_directory=/home/bamboo/xml-data/build-dir/PHPBB3-PR-JOB1
bamboo_planKey=PHPBB3-PR
bamboo_planRepository_1_repositoryUrl=https://github.com/phpbb/phpbb.git
bamboo_planRepository_username=bantu
bamboo_capability_local=true
bamboo_capability_system_jdk_JDK_1_6=/usr/lib/jvm/java-6-sun
bamboo_capability_system_jdk_JDK_1_7=/usr/lib/jvm/java-7-openjdk-amd64
bamboo_planRepository_1_branchName=3.1.x
28-Jun-2017 17:50:42 From https://github.com/phpbb/phpbb
28-Jun-2017 17:50:42 * branch            refs/pull/4847/head -> FETCH_HEAD
28-Jun-2017 17:50:42   % Total    % Received % Xferd  Average Speed   Time    Time     Time  Current
28-Jun-2017 17:50:42                                  Dload  Upload   Total   Spent    Left  Speed
28-Jun-2017 17:50:42
28-Jun-2017 17:50:42   0     0    0     0    0     0      0      0 --:--:-- --:--:-- --:--:--     0
28-Jun-2017 17:50:42   0     0    0     0    0     0      0      0 --:--:-- --:--:-- --:--:--     0
28-Jun-2017 17:50:42 100   275  100    93  100   182    182    357 --:--:-- --:--:-- --:--:--   357
28-Jun-2017 17:50:42 Finished task 'Set pending build status' with result: Success
28-Jun-2017 17:50:42
Substituting variable: ${bamboo.PRnumber} with 4847
28-Jun-2017 17:50:42 Starting task 'Fetch PR' of type 'com.atlassian.bamboo.plugins.scripttask:task.builder.script'
28-Jun-2017 17:50:42
Beginning to execute external process for build 'phpBB3 - Pull Requests - Build and Test Job #7297 (PHPBB3-PR-JOB1-7297)'
... running command line:
/bin/sh /home/bamboo/temp/PHPBB3-PR-JOB1-7297-ScriptBuildTask-7277996137778556290.sh
... in: /home/bamboo/xml-data/build-dir/PHPBB3-PR-JOB1
... using extra environment variables:
bamboo_planRepository_1_branch=3.1.x
bamboo_planRepository_1_branchDisplayName=3.1.x
bamboo_repository_revision_number=dc49a8a199df28d985e951474dc08d23cd46097c
bamboo_PRref=master
bamboo_resultsUrl=https://bamboo.phpbb.com/browse/PHPBB3-PR-JOB1-7297
bamboo_capability_system_builder_command_Git=/usr/bin/git
bamboo_repository_75956235_git_username=bantu
bamboo_planRepository_1_name=phpBB Ascraeus
bamboo_build_working_directory=/home/bamboo/xml-data/build-dir/PHPBB3-PR-JOB1
bamboo_buildKey=PHPBB3-PR-JOB1
bamboo_capability_phpbb_tests=true
bamboo_shortPlanName=Pull Requests
bamboo_capability_system_builder_command_fop=/usr/bin/fop
bamboo_capability_dbms_sqlite_2=true
bamboo_planRepository_name=phpBB Ascraeus
bamboo_PRnumber=4847
bamboo_buildNumber=7297
bamboo_repository_75956235_git_repositoryUrl=https://github.com/phpbb/phpbb.git
bamboo_capability_system_builder_phpunit_PHPUnit=/usr/bin/phpunit
bamboo_shortJobName=Build and Test Job
bamboo_buildResultsUrl=https://bamboo.phpbb.com/browse/PHPBB3-PR-JOB1-7297
bamboo_repository_75956235_branch_name=3.1.x
bamboo_planRepository_repositoryUrl=https://github.com/phpbb/phpbb.git
bamboo_agentId=131073
bamboo_planName=phpBB3 - Pull Requests
bamboo_build_commandline_com_atlassian_bamboo_plugins_scripttask_task_builder_script_7=/bin/sh /home/bamboo/temp/PHPBB3-PR-JOB1-7297-ScriptBuildTask-2830558080592329690.sh
bamboo_shortPlanKey=PR
bamboo_shortJobKey=JOB1
bamboo_capability_dbms_mysql_55=true
bamboo_capability_system_jdk_JDK_1_7_0_65=/usr/lib/jvm/java-7-openjdk-amd64
bamboo_planRepository_revision=dc49a8a199df28d985e951474dc08d23cd46097c
bamboo_repository_previous_revision_number=dc49a8a199df28d985e951474dc08d23cd46097c
bamboo_buildTimeStamp=2017-06-28T17:50:38.442Z
bamboo_planRepository_previousRevision=dc49a8a199df28d985e951474dc08d23cd46097c
bamboo_capability_system_builder_mvn2_Maven_2=/usr/share/maven2
bamboo_capability_system_jdk_JDK_1_6_0_16=/usr/lib/jvm/java-6-sun-1.6.0.16
bamboo_buildResultKey=PHPBB3-PR-JOB1-7297
bamboo_repository_git_branch=3.1.x
bamboo_repository_branch_name=3.1.x
bamboo_buildPlanName=phpBB3 - Pull Requests - Build and Test Job
bamboo_planRepository_1_revision=dc49a8a199df28d985e951474dc08d23cd46097c
bamboo_repository_name=phpBB Ascraeus
bamboo_buildFailed=false
bamboo_capability_system_docker_executable=/usr/bin/docker
bamboo_planRepository_branch=3.1.x
bamboo_agentWorkingDirectory=/home/bamboo/xml-data/build-dir
bamboo_capability_system_git_executable=/usr/bin/git
bamboo_planRepository_1_previousRevision=dc49a8a199df28d985e951474dc08d23cd46097c
bamboo_capability_system_builder_phpunit_PHPUnit_3_4=/usr/bin/phpunit
bamboo_repository_git_username=bantu
bamboo_repository_75956235_revision_number=dc49a8a199df28d985e951474dc08d23cd46097c
bamboo_planRepository_branchDisplayName=3.1.x
bamboo_planRepository_1_type=gitv2
bamboo_planRepository_branchName=3.1.x
bamboo_repository_75956235_previous_revision_number=dc49a8a199df28d985e951474dc08d23cd46097c
bamboo_capability_system_jdk_JDK=/usr/lib/jvm/java-6-sun
bamboo_plan_storageTag=PHPBB3-PR
bamboo_planRepository_type=gitv2
bamboo_planRepository_1_username=bantu
bamboo_ManualBuildTriggerReason_userName=Build Robot
bamboo_repository_git_repositoryUrl=https://github.com/phpbb/phpbb.git
bamboo_repository_75956235_git_branch=3.1.x
bamboo_capability_system_builder_ant_Ant=/usr/share/ant
bamboo_repository_75956235_name=phpBB Ascraeus
bamboo_working_directory=/home/bamboo/xml-data/build-dir/PHPBB3-PR-JOB1
bamboo_planKey=PHPBB3-PR
bamboo_planRepository_1_repositoryUrl=https://github.com/phpbb/phpbb.git
bamboo_planRepository_username=bantu
bamboo_capability_local=true
bamboo_capability_system_jdk_JDK_1_6=/usr/lib/jvm/java-6-sun
bamboo_capability_system_jdk_JDK_1_7=/usr/lib/jvm/java-7-openjdk-amd64
bamboo_planRepository_1_branchName=3.1.x
28-Jun-2017 17:50:43 From https://github.com/phpbb/phpbb
28-Jun-2017 17:50:43 * branch            refs/pull/4847/merge -> FETCH_HEAD
28-Jun-2017 17:50:44 Note: checking out 'FETCH_HEAD'.
28-Jun-2017 17:50:44
28-Jun-2017 17:50:44 You are in 'detached HEAD' state. You can look around, make experimental
28-Jun-2017 17:50:44 changes and commit them, and you can discard any commits you make in this
28-Jun-2017 17:50:44 state without impacting any branches by performing another checkout.
28-Jun-2017 17:50:44
28-Jun-2017 17:50:44 If you want to create a new branch to retain commits you create, you may
28-Jun-2017 17:50:44 do so (now or later) by using -b with the checkout command again. Example:
28-Jun-2017 17:50:44
28-Jun-2017 17:50:44   git checkout -b new_branch_name
28-Jun-2017 17:50:44
28-Jun-2017 17:50:44 HEAD is now at 3a4861c... Merge 99db26f108414f4d1441581b408cc43c38765b74 into 5e24508280e1fc3393966487d72f01932d92afbc
28-Jun-2017 17:50:44 Finished task 'Fetch PR' with result: Success
28-Jun-2017 17:50:44 Skipping execution of task 'Prepare directory' as it is disabled
28-Jun-2017 17:50:44
Substituting variable: ${bamboo.working.directory} with /home/bamboo/xml-data/build-dir/PHPBB3-PR-JOB1
28-Jun-2017 17:50:44 Starting task 'Prepare directory' of type 'com.atlassian.bamboo.plugins.bamboo-docker-plugin:task.docker.cli'
28-Jun-2017 17:50:44 Running image name (phpbb:php-5.6)
28-Jun-2017 17:50:44
Beginning to execute external process for build 'phpBB3 - Pull Requests - Build and Test Job #7297 (PHPBB3-PR-JOB1-7297)'
... running command line:
/usr/bin/docker run --volume /home/bamboo/xml-data/build-dir/PHPBB3-PR-JOB1:/data --workdir /data/phpBB --rm -e HOME=/home/bamboo -u=991 phpbb:php-5.6 /bin/bash -c php ../composer.phar install --dev; cd ../build; ../phpBB/vendor/bin/phing clean prepare
... in: /home/bamboo/xml-data/build-dir/PHPBB3-PR-JOB1
... using extra environment variables:
bamboo_planRepository_1_branch=3.1.x
bamboo_planRepository_1_branchDisplayName=3.1.x
bamboo_repository_revision_number=dc49a8a199df28d985e951474dc08d23cd46097c
bamboo_PRref=master
bamboo_resultsUrl=https://bamboo.phpbb.com/browse/PHPBB3-PR-JOB1-7297
bamboo_capability_system_builder_command_Git=/usr/bin/git
bamboo_repository_75956235_git_username=bantu
bamboo_planRepository_1_name=phpBB Ascraeus
bamboo_build_working_directory=/home/bamboo/xml-data/build-dir/PHPBB3-PR-JOB1
bamboo_buildKey=PHPBB3-PR-JOB1
bamboo_capability_phpbb_tests=true
bamboo_shortPlanName=Pull Requests
bamboo_capability_system_builder_command_fop=/usr/bin/fop
bamboo_capability_dbms_sqlite_2=true
bamboo_planRepository_name=phpBB Ascraeus
bamboo_PRnumber=4847
bamboo_buildNumber=7297
bamboo_repository_75956235_git_repositoryUrl=https://github.com/phpbb/phpbb.git
bamboo_capability_system_builder_phpunit_PHPUnit=/usr/bin/phpunit
bamboo_shortJobName=Build and Test Job
bamboo_buildResultsUrl=https://bamboo.phpbb.com/browse/PHPBB3-PR-JOB1-7297
bamboo_repository_75956235_branch_name=3.1.x
bamboo_planRepository_repositoryUrl=https://github.com/phpbb/phpbb.git
bamboo_agentId=131073
bamboo_planName=phpBB3 - Pull Requests
bamboo_build_commandline_com_atlassian_bamboo_plugins_scripttask_task_builder_script_7=/bin/sh /home/bamboo/temp/PHPBB3-PR-JOB1-7297-ScriptBuildTask-2830558080592329690.sh
bamboo_shortPlanKey=PR
bamboo_shortJobKey=JOB1
bamboo_capability_dbms_mysql_55=true
bamboo_capability_system_jdk_JDK_1_7_0_65=/usr/lib/jvm/java-7-openjdk-amd64
bamboo_planRepository_revision=dc49a8a199df28d985e951474dc08d23cd46097c
bamboo_repository_previous_revision_number=dc49a8a199df28d985e951474dc08d23cd46097c
bamboo_buildTimeStamp=2017-06-28T17:50:38.442Z
bamboo_planRepository_previousRevision=dc49a8a199df28d985e951474dc08d23cd46097c
bamboo_capability_system_builder_mvn2_Maven_2=/usr/share/maven2
bamboo_capability_system_jdk_JDK_1_6_0_16=/usr/lib/jvm/java-6-sun-1.6.0.16
bamboo_build_commandline_com_atlassian_bamboo_plugins_scripttask_task_builder_script_4=/bin/sh /home/bamboo/temp/PHPBB3-PR-JOB1-7297-ScriptBuildTask-7277996137778556290.sh
bamboo_buildResultKey=PHPBB3-PR-JOB1-7297
bamboo_repository_git_branch=3.1.x
bamboo_repository_branch_name=3.1.x
bamboo_buildPlanName=phpBB3 - Pull Requests - Build and Test Job
bamboo_planRepository_1_revision=dc49a8a199df28d985e951474dc08d23cd46097c
bamboo_repository_name=phpBB Ascraeus
bamboo_buildFailed=false
bamboo_capability_system_docker_executable=/usr/bin/docker
bamboo_planRepository_branch=3.1.x
bamboo_agentWorkingDirectory=/home/bamboo/xml-data/build-dir
bamboo_capability_system_git_executable=/usr/bin/git
bamboo_planRepository_1_previousRevision=dc49a8a199df28d985e951474dc08d23cd46097c
bamboo_capability_system_builder_phpunit_PHPUnit_3_4=/usr/bin/phpunit
bamboo_repository_git_username=bantu
bamboo_repository_75956235_revision_number=dc49a8a199df28d985e951474dc08d23cd46097c
bamboo_planRepository_branchDisplayName=3.1.x
bamboo_planRepository_1_type=gitv2
bamboo_planRepository_branchName=3.1.x
bamboo_repository_75956235_previous_revision_number=dc49a8a199df28d985e951474dc08d23cd46097c
bamboo_capability_system_jdk_JDK=/usr/lib/jvm/java-6-sun
bamboo_plan_storageTag=PHPBB3-PR
bamboo_planRepository_type=gitv2
bamboo_planRepository_1_username=bantu
bamboo_ManualBuildTriggerReason_userName=Build Robot
bamboo_repository_git_repositoryUrl=https://github.com/phpbb/phpbb.git
bamboo_repository_75956235_git_branch=3.1.x
bamboo_capability_system_builder_ant_Ant=/usr/share/ant
bamboo_repository_75956235_name=phpBB Ascraeus
bamboo_working_directory=/home/bamboo/xml-data/build-dir/PHPBB3-PR-JOB1
bamboo_planKey=PHPBB3-PR
bamboo_planRepository_1_repositoryUrl=https://github.com/phpbb/phpbb.git
bamboo_planRepository_username=bantu
bamboo_capability_local=true
bamboo_capability_system_jdk_JDK_1_6=/usr/lib/jvm/java-6-sun
bamboo_capability_system_jdk_JDK_1_7=/usr/lib/jvm/java-7-openjdk-amd64
bamboo_planRepository_1_branchName=3.1.x
28-Jun-2017 17:50:44 You are running composer with xdebug enabled. This has a major impact on runtime performance. See https://getcomposer.org/xdebug
28-Jun-2017 17:50:44 You are using the deprecated option "dev". Dev packages are installed by default now.
28-Jun-2017 17:50:44 Cannot create cache directory /home/bamboo/.composer/cache/repo/https---packagist.org/, or directory is not writable. Proceeding without cache
28-Jun-2017 17:50:44 Cannot create cache directory /home/bamboo/.composer/cache/files/, or directory is not writable. Proceeding without cache
28-Jun-2017 17:50:44 Loading composer repositories with package information
28-Jun-2017 17:50:44 Installing dependencies (including require-dev) from lock file
28-Jun-2017 17:50:44 Warning: The lock file is not up to date with the latest changes in composer.json. You may be getting outdated dependencies. Run update to update them.
28-Jun-2017 17:50:44   - Installing bantu/ini-get-wrapper (v1.0.1)
28-Jun-2017 17:50:45     Downloading: Connecting...    Downloading: 100%         
28-Jun-2017 17:50:45
28-Jun-2017 17:50:45   - Installing symfony/process (v3.3.2)
28-Jun-2017 17:50:46     Downloading: Connecting...    Downloading: 0%               Downloading: 25%    Downloading: 30%    Downloading: 50%    Downloading: 55%    Downloading: 60%    Downloading: 80%    Downloading: 85%    Downloading: 100%
28-Jun-2017 17:50:46
28-Jun-2017 17:50:46   - Installing symfony/finder (v3.3.2)
28-Jun-2017 17:50:47     Downloading: Connecting...    Downloading: 0%               Downloading: 5%    Downloading: 10%    Downloading: 40%    Downloading: 45%    Downloading: 50%    Downloading: 55%    Downloading: 60%    Downloading: 90%    Downloading: 95%    Downloading: 100%
28-Jun-2017 17:50:47
28-Jun-2017 17:50:47   - Installing symfony/filesystem (v3.3.2)
28-Jun-2017 17:50:47     Downloading: Connecting...    Downloading: 0%               Downloading: 50%    Downloading: 55%    Downloading: 85%    Downloading: 90%    Downloading: 100%    Downloading: 100%
28-Jun-2017 17:50:47
28-Jun-2017 17:50:47   - Installing symfony/polyfill-mbstring (v1.4.0)
28-Jun-2017 17:50:48     Downloading: Connecting...    Downloading: 0%               Downloading: 35%    Downloading: 90%    Downloading: 100%
28-Jun-2017 17:50:48
28-Jun-2017 17:50:48   - Installing psr/log (1.0.2)
28-Jun-2017 17:50:48     Downloading: Connecting...    Downloading: 0%               Downloading: 15%    Downloading: 100%
28-Jun-2017 17:50:48
28-Jun-2017 17:50:48   - Installing symfony/debug (v3.3.2)
28-Jun-2017 17:50:49     Downloading: Connecting...    Downloading: 0%               Downloading: 10%    Downloading: 20%    Downloading: 30%    Downloading: 40%    Downloading: 50%    Downloading: 60%    Downloading: 75%    Downloading: 85%    Downloading: 95%    Downloading: 100%    Downloading: 100%
28-Jun-2017 17:50:49
28-Jun-2017 17:50:49   - Installing symfony/console (v3.3.2)
28-Jun-2017 17:50:49     Downloading: Connecting...    Downloading: 0%               Downloading: 5%    Downloading: 10%    Downloading: 15%    Downloading: 20%    Downloading: 25%    Downloading: 30%    Downloading: 35%    Downloading: 40%    Downloading: 45%    Downloading: 50%    Downloading: 55%    Downloading: 60%    Downloading: 65%    Downloading: 70%    Downloading: 75%    Downloading: 80%    Downloading: 85%    Downloading: 90%    Downloading: 95%    Downloading: 100%    Downloading: 100%
28-Jun-2017 17:50:50
28-Jun-2017 17:50:50   - Installing seld/phar-utils (1.0.1)
28-Jun-2017 17:50:50     Downloading: Connecting...    Downloading: 0%               Downloading: 30%    Downloading: 60%    Downloading: 85%    Downloading: 100%
28-Jun-2017 17:50:50
28-Jun-2017 17:50:50   - Installing seld/jsonlint (1.6.0)
28-Jun-2017 17:50:51     Downloading: Connecting...    Downloading: 0%               Downloading: 40%    Downloading: 85%    Downloading: 100%    Downloading: 100%
28-Jun-2017 17:50:51
28-Jun-2017 17:50:51   - Installing seld/cli-prompt (1.0.3)
28-Jun-2017 17:50:51     Downloading: Connecting...    Downloading: 0%               Downloading: 15%    Downloading: 30%    Downloading: 100%
28-Jun-2017 17:50:51
28-Jun-2017 17:50:51   - Installing justinrainbow/json-schema (5.2.1)
28-Jun-2017 17:50:52     Downloading: Connecting...    Downloading: 0%               Downloading: 5%    Downloading: 20%    Downloading: 25%    Downloading: 45%    Downloading: 50%    Downloading: 70%    Downloading: 75%    Downloading: 90%    Downloading: 95%    Downloading: 100%
28-Jun-2017 17:50:52
28-Jun-2017 17:50:52   - Installing composer/spdx-licenses (1.1.6)
28-Jun-2017 17:50:53     Downloading: Connecting...    Downloading: 0%               Downloading: 100%    Downloading: 100%
28-Jun-2017 17:50:53
28-Jun-2017 17:50:53   - Installing composer/semver (1.4.2)
28-Jun-2017 17:50:53     Downloading: Connecting...    Downloading: 0%               Downloading: 35%    Downloading: 95%    Downloading: 100%
28-Jun-2017 17:50:53
28-Jun-2017 17:50:53   - Installing composer/ca-bundle (1.0.7)
28-Jun-2017 17:50:53     Downloading: Connecting...    Downloading: 0%               Downloading: 5%    Downloading: 10%    Downloading: 15%    Downloading: 20%    Downloading: 25%    Downloading: 30%    Downloading: 35%    Downloading: 40%    Downloading: 45%    Downloading: 50%    Downloading: 55%    Downloading: 60%    Downloading: 65%    Downloading: 70%    Downloading: 75%    Downloading: 80%    Downloading: 85%    Downloading: 90%    Downloading: 95%    Downloading: 100%    Downloading: 100%
28-Jun-2017 17:50:53
28-Jun-2017 17:50:54   - Installing composer/composer (1.4.2)
28-Jun-2017 17:50:55     Downloading: Connecting...    Downloading: 0%               Downloading: 5%    Downloading: 10%    Downloading: 15%    Downloading: 20%    Downloading: 25%    Downloading: 30%    Downloading: 35%    Downloading: 40%    Downloading: 45%    Downloading: 50%    Downloading: 55%    Downloading: 60%    Downloading: 65%    Downloading: 70%    Downloading: 75%    Downloading: 80%    Downloading: 85%    Downloading: 90%    Downloading: 95%    Downloading: 100%    Downloading: 100%
28-Jun-2017 17:50:55
28-Jun-2017 17:50:55   - Installing google/recaptcha (1.1.3)
28-Jun-2017 17:50:55     Downloading: Connecting...    Downloading: 0%               Downloading: 25%    Downloading: 30%    Downloading: 55%    Downloading: 80%    Downloading: 100%
28-Jun-2017 17:50:55
28-Jun-2017 17:50:55   - Installing guzzlehttp/promises (v1.3.1)
28-Jun-2017 17:50:56     Downloading: Connecting...    Downloading: 0%               Downloading: 30%    Downloading: 60%    Downloading: 90%    Downloading: 100%
28-Jun-2017 17:50:56
28-Jun-2017 17:50:56   - Installing psr/http-message (1.0.1)
28-Jun-2017 17:50:57     Downloading: Connecting...    Downloading: 0%               Downloading: 65%    Downloading: 100%    Downloading: 100%
28-Jun-2017 17:50:57
28-Jun-2017 17:50:57   - Installing guzzlehttp/psr7 (1.4.2)
28-Jun-2017 17:50:57     Downloading: Connecting...    Downloading: 0%               Downloading: 5%    Downloading: 10%    Downloading: 15%    Downloading: 20%    Downloading: 100%
28-Jun-2017 17:50:57
28-Jun-2017 17:50:57   - Installing lusitanian/oauth (v0.8.10)
28-Jun-2017 17:50:58     Downloading: Connecting...    Downloading: 0%               Downloading: 5%    Downloading: 10%    Downloading: 15%    Downloading: 20%    Downloading: 25%    Downloading: 30%    Downloading: 35%    Downloading: 45%    Downloading: 50%    Downloading: 55%    Downloading: 60%    Downloading: 65%    Downloading: 75%    Downloading: 80%    Downloading: 90%    Downloading: 95%    Downloading: 100%
28-Jun-2017 17:50:58
28-Jun-2017 17:50:58   - Installing marc1706/fast-image-size (v1.1.3)
28-Jun-2017 17:50:58     Downloading: Connecting...    Downloading: 0%               Downloading: 20%    Downloading: 40%    Downloading: 100%    Downloading: 100%
28-Jun-2017 17:50:58
28-Jun-2017 17:50:59   - Installing paragonie/random_compat (v1.4.2)
28-Jun-2017 17:50:59     Downloading: Connecting...    Downloading: 0%               Downloading: 10%    Downloading: 35%    Downloading: 45%    Downloading: 70%    Downloading: 80%    Downloading: 100%
28-Jun-2017 17:50:59
28-Jun-2017 17:50:59   - Installing patchwork/utf8 (v1.3.1)
28-Jun-2017 17:51:00     Downloading: Connecting...    Downloading: 0%               Downloading: 5%    Downloading: 10%    Downloading: 15%    Downloading: 20%    Downloading: 25%    Downloading: 30%    Downloading: 35%    Downloading: 40%    Downloading: 45%    Downloading: 50%    Downloading: 55%    Downloading: 60%    Downloading: 65%    Downloading: 70%    Downloading: 75%    Downloading: 80%    Downloading: 85%    Downloading: 90%    Downloading: 95%    Downloading: 100%    Downloading: 100%
28-Jun-2017 17:51:00
28-Jun-2017 17:51:00   - Installing psr/container (1.0.0)
28-Jun-2017 17:51:00     Downloading: Connecting...    Downloading: 0%               Downloading: 75%    Downloading: 100%    Downloading: 100%
28-Jun-2017 17:51:00
28-Jun-2017 17:51:00   - Installing s9e/text-formatter (0.9.6)
28-Jun-2017 17:51:01     Downloading: Connecting...    Downloading: 100%         
28-Jun-2017 17:51:01
28-Jun-2017 17:51:01   - Installing symfony/config (v3.3.2)
28-Jun-2017 17:51:02     Downloading: Connecting...    Downloading: 0%               Downloading: 5%    Downloading: 10%    Downloading: 15%    Downloading: 20%    Downloading: 25%    Downloading: 30%    Downloading: 35%    Downloading: 40%    Downloading: 45%    Downloading: 50%    Downloading: 55%    Downloading: 60%    Downloading: 65%    Downloading: 70%    Downloading: 75%    Downloading: 80%    Downloading: 85%    Downloading: 90%    Downloading: 95%    Downloading: 100%
28-Jun-2017 17:51:02
28-Jun-2017 17:51:02   - Installing symfony/http-foundation (v3.3.2)
28-Jun-2017 17:51:03     Downloading: Connecting...    Downloading: 0%               Downloading: 5%    Downloading: 10%    Downloading: 15%    Downloading: 20%    Downloading: 25%    Downloading: 30%    Downloading: 35%    Downloading: 40%    Downloading: 45%    Downloading: 50%    Downloading: 55%    Downloading: 60%    Downloading: 65%    Downloading: 70%    Downloading: 75%    Downloading: 80%    Downloading: 85%    Downloading: 90%    Downloading: 95%    Downloading: 100%    Downloading: 100%
28-Jun-2017 17:51:03
28-Jun-2017 17:51:03   - Installing symfony/event-dispatcher (v3.3.2)
28-Jun-2017 17:51:03     Downloading: Connecting...    Downloading: 0%               Downloading: 5%    Downloading: 65%    Downloading: 70%    Downloading: 75%    Downloading: 80%    Downloading: 100%
28-Jun-2017 17:51:03
28-Jun-2017 17:51:03   - Installing symfony/http-kernel (v3.3.2)
28-Jun-2017 17:51:04     Downloading: Connecting...    Downloading: 0%               Downloading: 5%    Downloading: 10%    Downloading: 15%    Downloading: 20%    Downloading: 25%    Downloading: 30%    Downloading: 35%    Downloading: 40%    Downloading: 45%    Downloading: 50%    Downloading: 55%    Downloading: 60%    Downloading: 65%    Downloading: 70%    Downloading: 75%    Downloading: 80%    Downloading: 85%    Downloading: 90%    Downloading: 95%    Downloading: 100%    Downloading: 100%
28-Jun-2017 17:51:04
28-Jun-2017 17:51:04   - Installing symfony/dependency-injection (v3.3.2)
28-Jun-2017 17:51:05     Downloading: Connecting...    Downloading: 0%               Downloading: 5%    Downloading: 10%    Downloading: 15%    Downloading: 20%    Downloading: 25%    Downloading: 30%    Downloading: 35%    Downloading: 40%    Downloading: 45%    Downloading: 50%    Downloading: 55%    Downloading: 60%    Downloading: 65%    Downloading: 70%    Downloading: 75%    Downloading: 80%    Downloading: 85%    Downloading: 90%    Downloading: 95%    Downloading: 100%    Downloading: 100%
28-Jun-2017 17:51:05
28-Jun-2017 17:51:05   - Installing zendframework/zend-eventmanager (3.0.1)
28-Jun-2017 17:51:06     Downloading: Connecting...    Downloading: 0%               Downloading: 15%    Downloading: 30%    Downloading: 55%    Downloading: 70%    Downloading: 85%    Downloading: 100%
28-Jun-2017 17:51:06
28-Jun-2017 17:51:06   - Installing zendframework/zend-code (2.6.3)
28-Jun-2017 17:51:06     Downloading: Connecting...    Downloading: 0%               Downloading: 5%    Downloading: 10%    Downloading: 15%    Downloading: 20%    Downloading: 25%    Downloading: 30%    Downloading: 35%    Downloading: 40%    Downloading: 45%    Downloading: 50%    Downloading: 55%    Downloading: 60%    Downloading: 65%    Downloading: 70%    Downloading: 75%    Downloading: 80%    Downloading: 85%    Downloading: 90%    Downloading: 95%    Downloading: 100%
28-Jun-2017 17:51:06
28-Jun-2017 17:51:06   - Installing ocramius/proxy-manager (1.0.2)
28-Jun-2017 17:51:07     Downloading: Connecting...    Downloading: 0%               Downloading: 5%    Downloading: 10%    Downloading: 15%    Downloading: 20%    Downloading: 25%    Downloading: 30%    Downloading: 35%    Downloading: 40%    Downloading: 45%    Downloading: 50%    Downloading: 55%    Downloading: 60%    Downloading: 65%    Downloading: 70%    Downloading: 75%    Downloading: 80%    Downloading: 90%    Downloading: 95%    Downloading: 100%    Downloading: 100%
28-Jun-2017 17:51:08
28-Jun-2017 17:51:08   - Installing symfony/proxy-manager-bridge (v3.3.2)
28-Jun-2017 17:51:08     Downloading: Connecting...    Downloading: 0%               Downloading: 25%    Downloading: 100%
28-Jun-2017 17:51:08
28-Jun-2017 17:51:08   - Installing symfony/routing (v3.3.2)
28-Jun-2017 17:51:08     Downloading: Connecting...    Downloading: 0%               Downloading: 5%    Downloading: 10%    Downloading: 15%    Downloading: 20%    Downloading: 25%    Downloading: 30%    Downloading: 35%    Downloading: 40%    Downloading: 45%    Downloading: 50%    Downloading: 55%    Downloading: 60%    Downloading: 65%    Downloading: 70%    Downloading: 75%    Downloading: 80%    Downloading: 85%    Downloading: 90%    Downloading: 95%    Downloading: 100%    Downloading: 100%
28-Jun-2017 17:51:09
28-Jun-2017 17:51:09   - Installing twig/twig (v1.34.3)
28-Jun-2017 17:51:10     Downloading: Connecting...    Downloading: 0%               Downloading: 5%    Downloading: 10%    Downloading: 15%    Downloading: 20%    Downloading: 25%    Downloading: 30%    Downloading: 35%    Downloading: 40%    Downloading: 45%    Downloading: 55%    Downloading: 60%    Downloading: 65%    Downloading: 70%    Downloading: 75%    Downloading: 80%    Downloading: 85%    Downloading: 90%    Downloading: 95%    Downloading: 100%    Downloading: 100%
28-Jun-2017 17:51:10
28-Jun-2017 17:51:10   - Installing symfony/twig-bridge (v3.3.2)
28-Jun-2017 17:51:10     Downloading: Connecting...    Downloading: 0%               Downloading: 5%    Downloading: 20%    Downloading: 25%    Downloading: 30%    Downloading: 35%    Downloading: 45%    Downloading: 50%    Downloading: 55%    Downloading: 60%    Downloading: 75%    Downloading: 80%    Downloading: 85%    Downloading: 90%    Downloading: 100%
28-Jun-2017 17:51:10
28-Jun-2017 17:51:10   - Installing symfony/dom-crawler (v3.3.2)
28-Jun-2017 17:51:11     Downloading: Connecting...    Downloading: 0%               Downloading: 25%    Downloading: 30%    Downloading: 50%    Downloading: 55%    Downloading: 75%    Downloading: 80%    Downloading: 100%
28-Jun-2017 17:51:11
28-Jun-2017 17:51:11   - Installing symfony/css-selector (v3.3.2)
28-Jun-2017 17:51:12     Downloading: Connecting...    Downloading: 0%               Downloading: 5%    Downloading: 10%    Downloading: 15%    Downloading: 20%    Downloading: 25%    Downloading: 30%    Downloading: 35%    Downloading: 40%    Downloading: 45%    Downloading: 50%    Downloading: 55%    Downloading: 60%    Downloading: 65%    Downloading: 85%    Downloading: 90%    Downloading: 95%    Downloading: 100%    Downloading: 100%
28-Jun-2017 17:51:12
28-Jun-2017 17:51:12   - Installing symfony/browser-kit (v3.3.2)
28-Jun-2017 17:51:12     Downloading: Connecting...    Downloading: 0%               Downloading: 50%    Downloading: 55%    Downloading: 100%
28-Jun-2017 17:51:12
28-Jun-2017 17:51:12   - Installing guzzlehttp/guzzle (6.2.3)
28-Jun-2017 17:51:13     Downloading: Connecting...    Downloading: 0%               Downloading: 5%    Downloading: 10%    Downloading: 15%    Downloading: 25%    Downloading: 30%    Downloading: 40%    Downloading: 45%    Downloading: 55%    Downloading: 60%    Downloading: 70%    Downloading: 75%    Downloading: 85%    Downloading: 90%    Downloading: 100%
28-Jun-2017 17:51:13
28-Jun-2017 17:51:13   - Installing fabpot/goutte (v3.2.1)
28-Jun-2017 17:51:13     Downloading: Connecting...    Downloading: 0%               Downloading: 70%    Downloading: 100%    Downloading: 100%
28-Jun-2017 17:51:13
28-Jun-2017 17:51:13   - Installing facebook/webdriver (1.3.0)
28-Jun-2017 17:51:14     Downloading: Connecting...    Downloading: 0%               Downloading: 5%    Downloading: 10%    Downloading: 15%    Downloading: 20%    Downloading: 25%    Downloading: 30%    Downloading: 35%    Downloading: 40%    Downloading: 45%    Downloading: 50%    Downloading: 55%    Downloading: 60%    Downloading: 65%    Downloading: 70%    Downloading: 75%    Downloading: 80%    Downloading: 85%    Downloading: 90%    Downloading: 95%    Downloading: 100%    Downloading: 100%
28-Jun-2017 17:51:14
28-Jun-2017 17:51:14   - Installing laravel/homestead (v4.0.5)
28-Jun-2017 17:51:14     Downloading: Connecting...    Downloading: 0%               Downloading: 5%    Downloading: 10%    Downloading: 100%
28-Jun-2017 17:51:14
28-Jun-2017 17:51:14   - Installing phing/phing (2.4.14)
28-Jun-2017 17:51:16     Downloading: Connecting...    Downloading: 0%               Downloading: 5%    Downloading: 10%    Downloading: 15%    Downloading: 20%    Downloading: 25%    Downloading: 30%    Downloading: 35%    Downloading: 40%    Downloading: 45%    Downloading: 50%    Downloading: 55%    Downloading: 60%    Downloading: 65%    Downloading: 70%    Downloading: 75%    Downloading: 80%    Downloading: 85%    Downloading: 90%    Downloading: 95%    Downloading: 100%    Downloading: 100%
28-Jun-2017 17:51:16
28-Jun-2017 17:51:16   - Installing webmozart/assert (1.2.0)
28-Jun-2017 17:51:16     Downloading: Connecting...    Downloading: 0%               Downloading: 55%    Downloading: 95%    Downloading: 100%
28-Jun-2017 17:51:16
28-Jun-2017 17:51:16   - Installing phpdocumentor/reflection-common (1.0)
28-Jun-2017 17:51:17     Downloading: Connecting...    Downloading: 0%               Downloading: 65%    Downloading: 95%    Downloading: 100%
28-Jun-2017 17:51:17
28-Jun-2017 17:51:17   - Installing phpdocumentor/type-resolver (0.2.1)
28-Jun-2017 17:51:17     Downloading: Connecting...    Downloading: 0%               Downloading: 20%    Downloading: 40%    Downloading: 55%    Downloading: 70%    Downloading: 90%    Downloading: 100%
28-Jun-2017 17:51:17
28-Jun-2017 17:51:18   - Installing phpdocumentor/reflection-docblock (3.1.1)
28-Jun-2017 17:51:18     Downloading: Connecting...    Downloading: 0%               Downloading: 5%    Downloading: 15%    Downloading: 20%    Downloading: 25%    Downloading: 30%    Downloading: 40%    Downloading: 45%    Downloading: 50%    Downloading: 60%    Downloading: 65%    Downloading: 70%    Downloading: 80%    Downloading: 85%    Downloading: 90%    Downloading: 95%    Downloading: 100%
28-Jun-2017 17:51:18
28-Jun-2017 17:51:18   - Installing symfony/yaml (v3.3.2)
28-Jun-2017 17:51:19     Downloading: Connecting...    Downloading: 0%               Downloading: 5%    Downloading: 10%    Downloading: 40%    Downloading: 45%    Downloading: 50%    Downloading: 55%    Downloading: 60%    Downloading: 65%    Downloading: 70%    Downloading: 95%    Downloading: 100%
28-Jun-2017 17:51:19
28-Jun-2017 17:51:19   - Installing sebastian/version (1.0.6)
28-Jun-2017 17:51:19     Downloading: Connecting...    Downloading: 0%               Downloading: 100%    Downloading: 100%
28-Jun-2017 17:51:19
28-Jun-2017 17:51:19   - Installing sebastian/global-state (1.1.1)
28-Jun-2017 17:51:20     Downloading: Connecting...    Downloading: 0%               Downloading: 40%    Downloading: 80%    Downloading: 100%
28-Jun-2017 17:51:20
28-Jun-2017 17:51:20   - Installing sebastian/recursion-context (1.0.5)
28-Jun-2017 17:51:20     Downloading: Connecting...    Downloading: 0%               Downloading: 35%    Downloading: 70%    Downloading: 100%
28-Jun-2017 17:51:20
28-Jun-2017 17:51:20   - Installing sebastian/exporter (1.2.2)
28-Jun-2017 17:51:21     Downloading: Connecting...    Downloading: 0%               Downloading: 100%    Downloading: 100%
28-Jun-2017 17:51:21
28-Jun-2017 17:51:21   - Installing sebastian/environment (1.3.8)
28-Jun-2017 17:51:21     Downloading: Connecting...    Downloading: 0%               Downloading: 15%    Downloading: 30%    Downloading: 45%    Downloading: 60%    Downloading: 75%    Downloading: 100%
28-Jun-2017 17:51:21
28-Jun-2017 17:51:21   - Installing sebastian/diff (1.4.3)
28-Jun-2017 17:51:22     Downloading: Connecting...    Downloading: 0%               Downloading: 35%    Downloading: 40%    Downloading: 75%    Downloading: 100%
28-Jun-2017 17:51:22
28-Jun-2017 17:51:22   - Installing sebastian/comparator (1.2.4)
28-Jun-2017 17:51:23     Downloading: Connecting...    Downloading: 0%               Downloading: 10%    Downloading: 70%    Downloading: 80%    Downloading: 90%    Downloading: 100%    Downloading: 100%
28-Jun-2017 17:51:23
28-Jun-2017 17:51:23   - Installing phpunit/php-text-template (1.2.1)
28-Jun-2017 17:51:23     Downloading: Connecting...    Downloading: 0%               Downloading: 35%    Downloading: 100%
28-Jun-2017 17:51:23
28-Jun-2017 17:51:23   - Installing doctrine/instantiator (1.0.5)
28-Jun-2017 17:51:24     Downloading: Connecting...    Downloading: 0%               Downloading: 15%    Downloading: 30%    Downloading: 45%    Downloading: 60%    Downloading: 75%    Downloading: 90%    Downloading: 100%
28-Jun-2017 17:51:24
28-Jun-2017 17:51:24   - Installing phpunit/phpunit-mock-objects (2.3.8)
28-Jun-2017 17:51:25     Downloading: Connecting...    Downloading: 0%               Downloading: 5%    Downloading: 20%    Downloading: 25%    Downloading: 35%    Downloading: 40%    Downloading: 45%    Downloading: 50%    Downloading: 60%    Downloading: 65%    Downloading: 70%    Downloading: 75%    Downloading: 90%    Downloading: 95%    Downloading: 100%    Downloading: 100%
28-Jun-2017 17:51:25
28-Jun-2017 17:51:25   - Installing phpunit/php-timer (1.0.9)
28-Jun-2017 17:51:25     Downloading: Connecting...    Downloading: 0%               Downloading: 45%    Downloading: 100%
28-Jun-2017 17:51:25
28-Jun-2017 17:51:25   - Installing phpunit/php-file-iterator (1.4.2)
28-Jun-2017 17:51:26     Downloading: Connecting...    Downloading: 0%               Downloading: 20%    Downloading: 40%    Downloading: 60%    Downloading: 80%    Downloading: 90%    Downloading: 100%
28-Jun-2017 17:51:26
28-Jun-2017 17:51:26   - Installing phpunit/php-token-stream (1.4.11)
28-Jun-2017 17:51:26     Downloading: Connecting...    Downloading: 0%               Downloading: 5%    Downloading: 10%    Downloading: 15%    Downloading: 20%    Downloading: 65%    Downloading: 70%    Downloading: 75%    Downloading: 80%    Downloading: 85%    Downloading: 90%    Downloading: 95%    Downloading: 100%    Downloading: 100%
28-Jun-2017 17:51:26
28-Jun-2017 17:51:26   - Installing phpunit/php-code-coverage (2.2.4)
28-Jun-2017 17:51:27     Downloading: Connecting...    Downloading: 0%               Downloading: 5%    Downloading: 10%    Downloading: 15%    Downloading: 20%    Downloading: 25%    Downloading: 30%    Downloading: 35%    Downloading: 40%    Downloading: 45%    Downloading: 50%    Downloading: 55%    Downloading: 60%    Downloading: 65%    Downloading: 70%    Downloading: 75%    Downloading: 80%    Downloading: 85%    Downloading: 90%    Downloading: 95%    Downloading: 100%    Downloading: 100%
28-Jun-2017 17:51:27
28-Jun-2017 17:51:27   - Installing phpspec/prophecy (v1.7.0)
28-Jun-2017 17:51:28     Downloading: Connecting...    Downloading: 0%               Downloading: 5%    Downloading: 10%    Downloading: 15%    Downloading: 20%    Downloading: 25%    Downloading: 30%    Downloading: 35%    Downloading: 40%    Downloading: 45%    Downloading: 50%    Downloading: 55%    Downloading: 60%    Downloading: 65%    Downloading: 70%    Downloading: 75%    Downloading: 80%    Downloading: 85%    Downloading: 90%    Downloading: 95%    Downloading: 100%    Downloading: 100%
28-Jun-2017 17:51:28
28-Jun-2017 17:51:28   - Installing phpunit/phpunit (4.8.35)
28-Jun-2017 17:51:29     Downloading: Connecting...    Downloading: 0%               Downloading: 5%    Downloading: 10%    Downloading: 15%    Downloading: 20%    Downloading: 25%    Downloading: 30%    Downloading: 35%    Downloading: 40%    Downloading: 45%    Downloading: 50%    Downloading: 55%    Downloading: 60%    Downloading: 65%    Downloading: 70%    Downloading: 75%    Downloading: 80%    Downloading: 85%    Downloading: 90%    Downloading: 95%    Downloading: 100%    Downloading: 100%
28-Jun-2017 17:51:29
28-Jun-2017 17:51:29   - Installing phpunit/dbunit (2.0.3)
28-Jun-2017 17:51:29     Downloading: Connecting...    Downloading: 0%               Downloading: 5%    Downloading: 10%    Downloading: 15%    Downloading: 20%    Downloading: 25%    Downloading: 30%    Downloading: 35%    Downloading: 40%    Downloading: 45%    Downloading: 50%    Downloading: 55%    Downloading: 60%    Downloading: 65%    Downloading: 70%    Downloading: 75%    Downloading: 80%    Downloading: 85%    Downloading: 90%    Downloading: 95%    Downloading: 100%    Downloading: 100%
28-Jun-2017 17:51:29
28-Jun-2017 17:51:29   - Installing squizlabs/php_codesniffer (2.9.1)
28-Jun-2017 17:51:30     Downloading: Connecting...    Downloading: 0%               Downloading: 5%    Downloading: 10%    Downloading: 15%    Downloading: 20%    Downloading: 25%    Downloading: 30%    Downloading: 35%    Downloading: 40%    Downloading: 45%    Downloading: 50%    Downloading: 55%    Downloading: 60%    Downloading: 65%    Downloading: 70%    Downloading: 75%    Downloading: 80%    Downloading: 85%    Downloading: 90%    Downloading: 95%    Downloading: 100%    Downloading: 100%
28-Jun-2017 17:51:30
28-Jun-2017 17:51:31 lusitanian/oauth suggests installing predis/predis (Allows using the Redis storage backend.)
28-Jun-2017 17:51:31 paragonie/random_compat suggests installing ext-libsodium (Provides a modern crypto API that can be used to generate random bytes.)
28-Jun-2017 17:51:31 patchwork/utf8 suggests installing ext-intl (Use Intl for best performance)
28-Jun-2017 17:51:31 patchwork/utf8 suggests installing ext-wfio (Use WFIO for UTF-8 filesystem access on Windows)
28-Jun-2017 17:51:31 s9e/text-formatter suggests installing ext-intl (Allows international URLs to be accepted by the URL filter)
28-Jun-2017 17:51:31 s9e/text-formatter suggests installing ext-xsl (Enables the XSLT renderer)
28-Jun-2017 17:51:31 symfony/http-kernel suggests installing symfony/class-loader ()
28-Jun-2017 17:51:31 symfony/http-kernel suggests installing symfony/var-dumper ()
28-Jun-2017 17:51:31 symfony/dependency-injection suggests installing symfony/expression-language (For using expressions in service container configuration)
28-Jun-2017 17:51:31 zendframework/zend-eventmanager suggests installing container-interop/container-interop (^1.1.0, to use the lazy listeners feature)
28-Jun-2017 17:51:31 zendframework/zend-eventmanager suggests installing zendframework/zend-stdlib (^2.7.3 || ^3.0, to use the FilterChain feature)
28-Jun-2017 17:51:31 zendframework/zend-code suggests installing doctrine/annotations (Doctrine\Common\Annotations >=1.0 for annotation features)
28-Jun-2017 17:51:31 zendframework/zend-code suggests installing zendframework/zend-stdlib (Zend\Stdlib component)
28-Jun-2017 17:51:31 ocramius/proxy-manager suggests installing ocramius/generated-hydrator (To have very fast object to array to object conversion for ghost objects)
28-Jun-2017 17:51:31 ocramius/proxy-manager suggests installing zendframework/zend-json (To have the JsonRpc adapter (Remote Object feature))
28-Jun-2017 17:51:31 ocramius/proxy-manager suggests installing zendframework/zend-soap (To have the Soap adapter (Remote Object feature))
28-Jun-2017 17:51:31 ocramius/proxy-manager suggests installing zendframework/zend-stdlib (To use the hydrator proxy)
28-Jun-2017 17:51:31 ocramius/proxy-manager suggests installing zendframework/zend-xmlrpc (To have the XmlRpc adapter (Remote Object feature))
28-Jun-2017 17:51:31 symfony/routing suggests installing doctrine/annotations (For using the annotation loader)
28-Jun-2017 17:51:31 symfony/routing suggests installing symfony/expression-language (For using expression matching)
28-Jun-2017 17:51:31 symfony/twig-bridge suggests installing symfony/asset (For using the AssetExtension)
28-Jun-2017 17:51:31 symfony/twig-bridge suggests installing symfony/expression-language (For using the ExpressionExtension)
28-Jun-2017 17:51:31 symfony/twig-bridge suggests installing symfony/form (For using the FormExtension)
28-Jun-2017 17:51:31 symfony/twig-bridge suggests installing symfony/security (For using the SecurityExtension)
28-Jun-2017 17:51:31 symfony/twig-bridge suggests installing symfony/stopwatch (For using the StopwatchExtension)
28-Jun-2017 17:51:31 symfony/twig-bridge suggests installing symfony/templating (For using the TwigEngine)
28-Jun-2017 17:51:31 symfony/twig-bridge suggests installing symfony/translation (For using the TranslationExtension)
28-Jun-2017 17:51:31 symfony/twig-bridge suggests installing symfony/var-dumper (For using the DumpExtension)
28-Jun-2017 17:51:31 symfony/twig-bridge suggests installing symfony/web-link (For using the WebLinkExtension)
28-Jun-2017 17:51:31 facebook/webdriver suggests installing phpdocumentor/phpdocumentor (2.*)
28-Jun-2017 17:51:31 sebastian/global-state suggests installing ext-uopz (*)
28-Jun-2017 17:51:31 phpunit/phpunit-mock-objects suggests installing ext-soap (*)
28-Jun-2017 17:51:31 phpunit/phpunit suggests installing phpunit/php-invoker (~1.1)
28-Jun-2017 17:51:31 Generating autoload files
28-Jun-2017 17:51:32 Buildfile: /data/build/build.xml
28-Jun-2017 17:51:32
28-Jun-2017 17:51:32 phpBB > clean:
28-Jun-2017 17:51:32
28-Jun-2017 17:51:32    [delete] Directory /data/build/logs does not exist or is not a directory.
28-Jun-2017 17:51:32    [delete] Directory /data/build/api does not exist or is not a directory.
28-Jun-2017 17:51:32    [delete] Directory /data/build/codebrowser does not exist or is not a directory.
28-Jun-2017 17:51:32    [delete] Directory /data/build/coverage does not exist or is not a directory.
28-Jun-2017 17:51:32    [delete] Directory /data/build/cpd does not exist or is not a directory.
28-Jun-2017 17:51:32    [delete] Directory /data/build/dependencies does not exist or is not a directory.
28-Jun-2017 17:51:32    [delete] Directory /data/build/new_version does not exist or is not a directory.
28-Jun-2017 17:51:32    [delete] Directory /data/build/old_versions does not exist or is not a directory.
28-Jun-2017 17:51:32    [delete] Directory /data/build/save does not exist or is not a directory.
28-Jun-2017 17:51:32
28-Jun-2017 17:51:32 phpBB > prepare:
28-Jun-2017 17:51:32
28-Jun-2017 17:51:32     [mkdir] Created dir: /data/build/logs
28-Jun-2017 17:51:32     [mkdir] Created dir: /data/build/api
28-Jun-2017 17:51:32     [mkdir] Created dir: /data/build/codebrowser
28-Jun-2017 17:51:32     [mkdir] Created dir: /data/build/coverage
28-Jun-2017 17:51:32     [mkdir] Created dir: /data/build/cpd
28-Jun-2017 17:51:32     [mkdir] Created dir: /data/build/dependencies
28-Jun-2017 17:51:32     [mkdir] Created dir: /data/build/new_version
28-Jun-2017 17:51:32     [mkdir] Created dir: /data/build/new_version/files
28-Jun-2017 17:51:32     [mkdir] Created dir: /data/build/new_version/patches
28-Jun-2017 17:51:32     [mkdir] Created dir: /data/build/new_version/release_files
28-Jun-2017 17:51:32     [mkdir] Created dir: /data/build/new_version/update
28-Jun-2017 17:51:32     [mkdir] Created dir: /data/build/old_versions
28-Jun-2017 17:51:32     [mkdir] Created dir: /data/build/save
28-Jun-2017 17:51:32
28-Jun-2017 17:51:32 BUILD FINISHED
28-Jun-2017 17:51:32
28-Jun-2017 17:51:32 Total time: 0.1198 seconds
28-Jun-2017 17:51:32
28-Jun-2017 17:51:32 Finished task 'Prepare directory' with result: Success
28-Jun-2017 17:51:32 Skipping execution of task 'Run sniffs' as it is disabled
28-Jun-2017 17:51:32
Substituting variable: ${bamboo.working.directory} with /home/bamboo/xml-data/build-dir/PHPBB3-PR-JOB1
28-Jun-2017 17:51:32 Starting task 'Run sniffs' of type 'com.atlassian.bamboo.plugins.bamboo-docker-plugin:task.docker.cli'
28-Jun-2017 17:51:32 Running image name (phpbb:php-5.6)
28-Jun-2017 17:51:32
Beginning to execute external process for build 'phpBB3 - Pull Requests - Build and Test Job #7297 (PHPBB3-PR-JOB1-7297)'
... running command line:
/usr/bin/docker run --volume /home/bamboo/xml-data/build-dir/PHPBB3-PR-JOB1:/data --workdir /data/build --rm -u=991 phpbb:php-5.6 ../phpBB/vendor/bin/phing sniff
... in: /home/bamboo/xml-data/build-dir/PHPBB3-PR-JOB1
... using extra environment variables:
bamboo_planRepository_1_branch=3.1.x
bamboo_planRepository_1_branchDisplayName=3.1.x
bamboo_repository_revision_number=dc49a8a199df28d985e951474dc08d23cd46097c
bamboo_PRref=master
bamboo_resultsUrl=https://bamboo.phpbb.com/browse/PHPBB3-PR-JOB1-7297
bamboo_capability_system_builder_command_Git=/usr/bin/git
bamboo_repository_75956235_git_username=bantu
bamboo_planRepository_1_name=phpBB Ascraeus
bamboo_build_working_directory=/home/bamboo/xml-data/build-dir/PHPBB3-PR-JOB1
bamboo_buildKey=PHPBB3-PR-JOB1
bamboo_capability_phpbb_tests=true
bamboo_shortPlanName=Pull Requests
bamboo_capability_system_builder_command_fop=/usr/bin/fop
bamboo_capability_dbms_sqlite_2=true
bamboo_planRepository_name=phpBB Ascraeus
bamboo_PRnumber=4847
bamboo_buildNumber=7297
bamboo_repository_75956235_git_repositoryUrl=https://github.com/phpbb/phpbb.git
bamboo_capability_system_builder_phpunit_PHPUnit=/usr/bin/phpunit
bamboo_shortJobName=Build and Test Job
bamboo_buildResultsUrl=https://bamboo.phpbb.com/browse/PHPBB3-PR-JOB1-7297
bamboo_repository_75956235_branch_name=3.1.x
bamboo_planRepository_repositoryUrl=https://github.com/phpbb/phpbb.git
bamboo_agentId=131073
bamboo_planName=phpBB3 - Pull Requests
bamboo_build_commandline_com_atlassian_bamboo_plugins_scripttask_task_builder_script_7=/bin/sh /home/bamboo/temp/PHPBB3-PR-JOB1-7297-ScriptBuildTask-2830558080592329690.sh
bamboo_shortPlanKey=PR
bamboo_shortJobKey=JOB1
bamboo_capability_dbms_mysql_55=true
bamboo_capability_system_jdk_JDK_1_7_0_65=/usr/lib/jvm/java-7-openjdk-amd64
bamboo_planRepository_revision=dc49a8a199df28d985e951474dc08d23cd46097c
bamboo_repository_previous_revision_number=dc49a8a199df28d985e951474dc08d23cd46097c
bamboo_buildTimeStamp=2017-06-28T17:50:38.442Z
bamboo_planRepository_previousRevision=dc49a8a199df28d985e951474dc08d23cd46097c
bamboo_capability_system_builder_mvn2_Maven_2=/usr/share/maven2
bamboo_capability_system_jdk_JDK_1_6_0_16=/usr/lib/jvm/java-6-sun-1.6.0.16
bamboo_build_commandline_com_atlassian_bamboo_plugins_scripttask_task_builder_script_4=/bin/sh /home/bamboo/temp/PHPBB3-PR-JOB1-7297-ScriptBuildTask-7277996137778556290.sh
bamboo_buildResultKey=PHPBB3-PR-JOB1-7297
bamboo_repository_git_branch=3.1.x
bamboo_repository_branch_name=3.1.x
bamboo_buildPlanName=phpBB3 - Pull Requests - Build and Test Job
bamboo_planRepository_1_revision=dc49a8a199df28d985e951474dc08d23cd46097c
bamboo_repository_name=phpBB Ascraeus
bamboo_buildFailed=false
bamboo_capability_system_docker_executable=/usr/bin/docker
bamboo_build_commandline_com_atlassian_bamboo_plugins_bamboo_docker_plugin_task_docker_cli_12=/usr/bin/docker run --volume /home/bamboo/xml-data/build-dir/PHPBB3-PR-JOB1:/data --workdir /data/phpBB --rm -e HOME=/home/bamboo -u=991 phpbb:php-5.6 /bin/bash -c php ../composer.phar install --dev; cd ../build; ../phpBB/vendor/bin/phing clean prepare
bamboo_planRepository_branch=3.1.x
bamboo_agentWorkingDirectory=/home/bamboo/xml-data/build-dir
bamboo_capability_system_git_executable=/usr/bin/git
bamboo_planRepository_1_previousRevision=dc49a8a199df28d985e951474dc08d23cd46097c
bamboo_capability_system_builder_phpunit_PHPUnit_3_4=/usr/bin/phpunit
bamboo_repository_git_username=bantu
bamboo_repository_75956235_revision_number=dc49a8a199df28d985e951474dc08d23cd46097c
bamboo_planRepository_branchDisplayName=3.1.x
bamboo_planRepository_1_type=gitv2
bamboo_planRepository_branchName=3.1.x
bamboo_repository_75956235_previous_revision_number=dc49a8a199df28d985e951474dc08d23cd46097c
bamboo_capability_system_jdk_JDK=/usr/lib/jvm/java-6-sun
bamboo_plan_storageTag=PHPBB3-PR
bamboo_planRepository_type=gitv2
bamboo_planRepository_1_username=bantu
bamboo_ManualBuildTriggerReason_userName=Build Robot
bamboo_repository_git_repositoryUrl=https://github.com/phpbb/phpbb.git
bamboo_repository_75956235_git_branch=3.1.x
bamboo_capability_system_builder_ant_Ant=/usr/share/ant
bamboo_repository_75956235_name=phpBB Ascraeus
bamboo_working_directory=/home/bamboo/xml-data/build-dir/PHPBB3-PR-JOB1
bamboo_planKey=PHPBB3-PR
bamboo_planRepository_1_repositoryUrl=https://github.com/phpbb/phpbb.git
bamboo_planRepository_username=bantu
bamboo_capability_local=true
bamboo_capability_system_jdk_JDK_1_6=/usr/lib/jvm/java-6-sun
bamboo_capability_system_jdk_JDK_1_7=/usr/lib/jvm/java-7-openjdk-amd64
bamboo_planRepository_1_branchName=3.1.x
28-Jun-2017 17:51:33 Buildfile: /data/build/build.xml
28-Jun-2017 17:51:33
28-Jun-2017 17:51:33 phpBB > sniff:
28-Jun-2017 17:51:33
28-Jun-2017 17:51:43 ............................................................  60 / 716 (8%)
28-Jun-2017 17:51:44 ............................................................ 120 / 716 (17%)
28-Jun-2017 17:51:45 ............................................................ 180 / 716 (25%)
28-Jun-2017 17:51:47 ............................................................ 240 / 716 (34%)
28-Jun-2017 17:51:51 ............................................................ 300 / 716 (42%)
28-Jun-2017 17:51:57 ............................................................ 360 / 716 (50%)
28-Jun-2017 17:51:57 .....
28-Jun-2017 17:51:57 Notice: Undefined index: copyright in /data/build/code_sniffer/phpbb/Sniffs/Commenting/FileCommentSniff.php on line 180
28-Jun-2017 17:51:57
28-Jun-2017 17:51:57 Call Stack:
28-Jun-2017 17:51:57     0.0001     225472   1. {main}() /data/phpBB/vendor/squizlabs/php_codesniffer/scripts/phpcs:0
28-Jun-2017 17:51:57     0.0164    2433856   2. PHP_CodeSniffer_CLI->runphpcs() /data/phpBB/vendor/squizlabs/php_codesniffer/scripts/phpcs:25
28-Jun-2017 17:51:57     0.0169    2492200   3. PHP_CodeSniffer_CLI->process() /data/phpBB/vendor/squizlabs/php_codesniffer/CodeSniffer/CLI.php:113
28-Jun-2017 17:51:57     0.0393    3506000   4. PHP_CodeSniffer->processFiles() /data/phpBB/vendor/squizlabs/php_codesniffer/CodeSniffer/CLI.php:998
28-Jun-2017 17:51:57    24.5970   22504656   5. PHP_CodeSniffer->processFile() /data/phpBB/vendor/squizlabs/php_codesniffer/CodeSniffer.php:653
28-Jun-2017 17:51:57    24.5971   22504904   6. PHP_CodeSniffer->_processFile() /data/phpBB/vendor/squizlabs/php_codesniffer/CodeSniffer.php:1772
28-Jun-2017 17:51:57    24.5971   22505544   7. PHP_CodeSniffer_File->start() /data/phpBB/vendor/squizlabs/php_codesniffer/CodeSniffer.php:1894
28-Jun-2017 17:51:57    24.6298   24013000   8. phpbb_Sniffs_Commenting_FileCommentSniff->process() /data/phpBB/vendor/squizlabs/php_codesniffer/CodeSniffer/File.php:576
28-Jun-2017 17:51:57    24.6298   24013144   9. phpbb_Sniffs_Commenting_FileCommentSniff->processCopyright() /data/build/code_sniffer/phpbb/Sniffs/Commenting/FileCommentSniff.php:109
28-Jun-2017 17:51:57
28-Jun-2017 17:51:58 E
28-Jun-2017 17:51:58 Notice: Undefined index: copyright in /data/build/code_sniffer/phpbb/Sniffs/Commenting/FileCommentSniff.php on line 180
28-Jun-2017 17:51:58
28-Jun-2017 17:51:58 Call Stack:
28-Jun-2017 17:51:58     0.0001     225472   1. {main}() /data/phpBB/vendor/squizlabs/php_codesniffer/scripts/phpcs:0
28-Jun-2017 17:51:58     0.0164    2433856   2. PHP_CodeSniffer_CLI->runphpcs() /data/phpBB/vendor/squizlabs/php_codesniffer/scripts/phpcs:25
28-Jun-2017 17:51:58     0.0169    2492200   3. PHP_CodeSniffer_CLI->process() /data/phpBB/vendor/squizlabs/php_codesniffer/CodeSniffer/CLI.php:113
28-Jun-2017 17:51:58     0.0393    3506000   4. PHP_CodeSniffer->processFiles() /data/phpBB/vendor/squizlabs/php_codesniffer/CodeSniffer/CLI.php:998
28-Jun-2017 17:51:58    24.6837   22733264   5. PHP_CodeSniffer->processFile() /data/phpBB/vendor/squizlabs/php_codesniffer/CodeSniffer.php:653
28-Jun-2017 17:51:58    24.6838   22733512   6. PHP_CodeSniffer->_processFile() /data/phpBB/vendor/squizlabs/php_codesniffer/CodeSniffer.php:1772
28-Jun-2017 17:51:58    24.6839   22734152   7. PHP_CodeSniffer_File->start() /data/phpBB/vendor/squizlabs/php_codesniffer/CodeSniffer.php:1894
28-Jun-2017 17:51:58    24.7004   23472560   8. phpbb_Sniffs_Commenting_FileCommentSniff->process() /data/phpBB/vendor/squizlabs/php_codesniffer/CodeSniffer/File.php:576
28-Jun-2017 17:51:58    24.7005   23472704   9. phpbb_Sniffs_Commenting_FileCommentSniff->processCopyright() /data/build/code_sniffer/phpbb/Sniffs/Commenting/FileCommentSniff.php:109
28-Jun-2017 17:51:58
28-Jun-2017 17:52:05 E..................................................... 420 / 716 (59%)
28-Jun-2017 17:52:10 ..........................................E................. 480 / 716 (67%)
28-Jun-2017 17:52:14 ............................................................ 540 / 716 (75%)
28-Jun-2017 17:52:18 ............................................................ 600 / 716 (84%)
28-Jun-2017 17:52:24 ............................................................ 660 / 716 (92%)
28-Jun-2017 17:52:27 ........................................................
28-Jun-2017 17:52:27
28-Jun-2017 17:52:27
28-Jun-2017 17:52:27 FILE: /data/phpBB/phpbb/mention/helper/mention_helper.php
28-Jun-2017 17:52:27 ----------------------------------------------------------------------
28-Jun-2017 17:52:27 FOUND 7 ERRORS AFFECTING 6 LINES
28-Jun-2017 17:52:27 ----------------------------------------------------------------------
28-Jun-2017 17:52:27    1 | ERROR | [ ] Invalid content found for the first @copyright tag,
28-Jun-2017 17:52:27      |       |     use "(c) phpBB Limited <https://www.phpbb.com>".
28-Jun-2017 17:52:27      |       |     (phpbb.Commenting.FileComment)
28-Jun-2017 17:52:27   11 | ERROR | [x] There must be one blank line after the namespace
28-Jun-2017 17:52:27      |       |     declaration
28-Jun-2017 17:52:27      |       |     (PSR2.Namespaces.NamespaceDeclaration.BlankLineAfter)
28-Jun-2017 17:52:27   13 | ERROR | [ ] There must not be unused USE statements.
28-Jun-2017 17:52:27      |       |     (phpbb.Namespaces.UnusedUse.Unused)
28-Jun-2017 17:52:27   14 | ERROR | [ ] There must not be unused USE statements.
28-Jun-2017 17:52:27      |       |     (phpbb.Namespaces.UnusedUse.Unused)
28-Jun-2017 17:52:27   15 | ERROR | [x] There must be one blank line after the last USE
28-Jun-2017 17:52:27      |       |     statement; 2 found;
28-Jun-2017 17:52:27      |       |     (PSR2.Namespaces.UseDeclaration.SpaceAfterLastUse)
28-Jun-2017 17:52:27   15 | ERROR | [ ] There must not be unused USE statements.
28-Jun-2017 17:52:27      |       |     (phpbb.Namespaces.UnusedUse.Unused)
28-Jun-2017 17:52:27 136 | ERROR | [x] Expected 1 newline at end of file; 0 found
28-Jun-2017 17:52:27      |       |     (PSR2.Files.EndFileNewline.NoneFound)
28-Jun-2017 17:52:27 ----------------------------------------------------------------------
28-Jun-2017 17:52:27 PHPCBF CAN FIX THE 3 MARKED SNIFF VIOLATIONS AUTOMATICALLY
28-Jun-2017 17:52:27 ----------------------------------------------------------------------
28-Jun-2017 17:52:27
28-Jun-2017 17:52:27
28-Jun-2017 17:52:27 FILE: /data/phpBB/phpbb/mention/controller/user_mention.php
28-Jun-2017 17:52:27 ----------------------------------------------------------------------
28-Jun-2017 17:52:27 FOUND 4 ERRORS AFFECTING 4 LINES
28-Jun-2017 17:52:27 ----------------------------------------------------------------------
28-Jun-2017 17:52:27   1 | ERROR | [ ] Invalid content found for the first @copyright tag, use
28-Jun-2017 17:52:27     |       |     "(c) phpBB Limited <https://www.phpbb.com>".
28-Jun-2017 17:52:27     |       |     (phpbb.Commenting.FileComment)
28-Jun-2017 17:52:27 16 | ERROR | [x] There must be one blank line after the last USE
28-Jun-2017 17:52:27     |       |     statement; 0 found;
28-Jun-2017 17:52:27     |       |     (PSR2.Namespaces.UseDeclaration.SpaceAfterLastUse)
28-Jun-2017 17:52:27 35 | ERROR | [x] Tabs must be used to indent lines; spaces are not
28-Jun-2017 17:52:27     |       |     allowed
28-Jun-2017 17:52:27     |       |     (Generic.WhiteSpace.DisallowSpaceIndent.SpacesUsed)
28-Jun-2017 17:52:27 36 | ERROR | [x] Tabs must be used to indent lines; spaces are not
28-Jun-2017 17:52:27     |       |     allowed
28-Jun-2017 17:52:27     |       |     (Generic.WhiteSpace.DisallowSpaceIndent.SpacesUsed)
28-Jun-2017 17:52:27 ----------------------------------------------------------------------
28-Jun-2017 17:52:27 PHPCBF CAN FIX THE 3 MARKED SNIFF VIOLATIONS AUTOMATICALLY
28-Jun-2017 17:52:27 ----------------------------------------------------------------------
28-Jun-2017 17:52:27
28-Jun-2017 17:52:27
28-Jun-2017 17:52:27 FILE: /data/phpBB/phpbb/notification/type/mention.php
28-Jun-2017 17:52:27 ----------------------------------------------------------------------
28-Jun-2017 17:52:27 FOUND 1 ERROR AFFECTING 1 LINE
28-Jun-2017 17:52:27 ----------------------------------------------------------------------
28-Jun-2017 17:52:27 401 | ERROR | [x] Expected 1 newline at end of file; 0 found
28-Jun-2017 17:52:27      |       |     (PSR2.Files.EndFileNewline.NoneFound)
28-Jun-2017 17:52:27 ----------------------------------------------------------------------
28-Jun-2017 17:52:27 PHPCBF CAN FIX THE 1 MARKED SNIFF VIOLATIONS AUTOMATICALLY
28-Jun-2017 17:52:27 ----------------------------------------------------------------------
28-Jun-2017 17:52:27
28-Jun-2017 17:52:27 Time: 54.2 secs; Memory: 62.75Mb
28-Jun-2017 17:52:27
28-Jun-2017 17:52:38 ............................................................  60 / 206 (29%)
28-Jun-2017 17:53:02 ............................................................ 120 / 206 (58%)
28-Jun-2017 17:53:20 ............................................................ 180 / 206 (87%)
28-Jun-2017 17:53:30 ..........................
28-Jun-2017 17:53:30
28-Jun-2017 17:53:30 Time: 1 mins, 2.53 secs; Memory: 60.5Mb
28-Jun-2017 17:53:30
28-Jun-2017 17:53:30
28-Jun-2017 17:53:30
28-Jun-2017 17:53:30 Time: 18ms; Memory: 3.5Mb
28-Jun-2017 17:53:30
28-Jun-2017 17:53:30        [if] Error in IfTask
28-Jun-2017 17:53:30 Execution of target "sniff" failed for the following reason: /data/build/build.xml:109:6: /data/build/build.xml:115:9: PHP Code Sniffer failed.
28-Jun-2017 17:53:30
28-Jun-2017 17:53:30 BUILD FAILED
28-Jun-2017 17:53:30 /data/build/build.xml:109:6: /data/build/build.xml:115:9: PHP Code Sniffer failed.
28-Jun-2017 17:53:30 Total time: 2 minutes  57.08 seconds
28-Jun-2017 17:53:30
28-Jun-2017 17:53:30 Failing task since return code of [/usr/bin/docker run --volume /home/bamboo/xml-data/build-dir/PHPBB3-PR-JOB1:/data --workdir /data/build --rm -u=991 phpbb:php-5.6 ../phpBB/vendor/bin/phing sniff] was 1 while expected 0
28-Jun-2017 17:53:30 Error occurred while running Task 'Run sniffs(11)' of type com.atlassian.bamboo.plugins.bamboo-docker-plugin:task.docker.cli.
28-Jun-2017 17:53:30 com.atlassian.bamboo.task.TaskException: Failed to execute task
28-Jun-2017 17:53:30         at com.atlassian.bamboo.plugins.docker.service.RunService.execute(RunService.java:71)
28-Jun-2017 17:53:30         at com.atlassian.bamboo.plugins.docker.tasks.cli.DockerCliTask.execute(DockerCliTask.java:64)
28-Jun-2017 17:53:30         at com.atlassian.bamboo.task.TaskExecutorImpl.lambda$executeTasks$3(TaskExecutorImpl.java:284)
28-Jun-2017 17:53:30         at com.atlassian.bamboo.task.TaskExecutorImpl.executeTaskWithPrePostActions(TaskExecutorImpl.java:223)
28-Jun-2017 17:53:30         at com.atlassian.bamboo.task.TaskExecutorImpl.executeTasks(TaskExecutorImpl.java:284)
28-Jun-2017 17:53:30         at com.atlassian.bamboo.task.TaskExecutorImpl.execute(TaskExecutorImpl.java:111)
28-Jun-2017 17:53:30         at com.atlassian.bamboo.build.pipeline.tasks.ExecuteBuildTask.call(ExecuteBuildTask.java:69)
28-Jun-2017 17:53:30         at com.atlassian.bamboo.v2.build.agent.DefaultBuildAgent.build(DefaultBuildAgent.java:185)
28-Jun-2017 17:53:30         at com.atlassian.bamboo.v2.build.agent.BuildAgentControllerImpl$1.call(BuildAgentControllerImpl.java:122)
28-Jun-2017 17:53:30         at com.atlassian.bamboo.v2.build.agent.BuildAgentControllerImpl$1.call(BuildAgentControllerImpl.java:115)
28-Jun-2017 17:53:30         at com.atlassian.bamboo.variable.CustomVariableContextImpl.withVariableSubstitutor(CustomVariableContextImpl.java:185)
28-Jun-2017 17:53:30         at com.atlassian.bamboo.v2.build.agent.BuildAgentControllerImpl.waitAndPerformBuild(BuildAgentControllerImpl.java:115)
28-Jun-2017 17:53:30         at com.atlassian.bamboo.v2.build.agent.DefaultBuildAgent$1.run(DefaultBuildAgent.java:126)
28-Jun-2017 17:53:30         at com.atlassian.bamboo.utils.BambooRunnables$1.run(BambooRunnables.java:47)
28-Jun-2017 17:53:30         at com.atlassian.bamboo.security.ImpersonationHelper.runWith(ImpersonationHelper.java:26)
28-Jun-2017 17:53:30         at com.atlassian.bamboo.security.ImpersonationHelper.runWithSystemAuthority(ImpersonationHelper.java:17)
28-Jun-2017 17:53:30         at com.atlassian.bamboo.security.ImpersonationHelper$1.run(ImpersonationHelper.java:41)
28-Jun-2017 17:53:30         at java.lang.Thread.run(Thread.java:745)
28-Jun-2017 17:53:30 Caused by: com.atlassian.bamboo.plugins.docker.client.DockerException: Error running Docker run command
28-Jun-2017 17:53:30         at com.atlassian.bamboo.plugins.docker.client.DockerCmd.run(DockerCmd.java:103)
28-Jun-2017 17:53:30         at com.atlassian.bamboo.plugins.docker.service.RunService.execute(RunService.java:60)
28-Jun-2017 17:53:30         ... 17 more
28-Jun-2017 17:53:30 Caused by: com.atlassian.utils.process.ProcessException: Error executing /usr/bin/docker run --volume /home/bamboo/xml-data/build-dir/PHPBB3-PR-JOB1:/data --workdir /data/build --rm -u=991 phpbb:php-5.6 ../phpBB/vendor/bin/phing sniff
28-Jun-2017 17:53:30         at com.atlassian.bamboo.plugins.docker.process.DockerTaskProcessService.execute(DockerTaskProcessService.java:60)
28-Jun-2017 17:53:30         at com.atlassian.bamboo.plugins.docker.client.DockerCmd.run(DockerCmd.java:99)
28-Jun-2017 17:53:30         ... 18 more
28-Jun-2017 17:53:30 Starting task 'Parsing test results produced by script' of type 'com.atlassian.bamboo.plugins.testresultparser:task.testresultparser.junit'
28-Jun-2017 17:53:30 Parsing test results under /home/bamboo/xml-data/build-dir/PHPBB3-PR-JOB1...
28-Jun-2017 17:53:30 Failing task since test cases were expected but none were found.
28-Jun-2017 17:53:30 Finished task 'Parsing test results produced by script' with result: Failed
28-Jun-2017 17:53:30
Substituting variable: ${bamboo.PRnumber} with 4847
28-Jun-2017 17:53:30
Substituting variable: ${bamboo.buildResultsUrl} with https://bamboo.phpbb.com/browse/PHPBB3-PR-JOB1-7297
28-Jun-2017 17:53:30
Substituting variable: ${bamboo.buildResultsUrl} with https://bamboo.phpbb.com/browse/PHPBB3-PR-JOB1-7297
28-Jun-2017 17:53:30 Starting task 'Set result build status' of type 'com.atlassian.bamboo.plugins.scripttask:task.builder.script'
28-Jun-2017 17:53:30
Beginning to execute external process for build 'phpBB3 - Pull Requests - Build and Test Job #7297 (PHPBB3-PR-JOB1-7297)'
... running command line:
/bin/sh /home/bamboo/temp/PHPBB3-PR-JOB1-7297-ScriptBuildTask-7283618340199050308.sh
... in: /home/bamboo/xml-data/build-dir/PHPBB3-PR-JOB1
... using extra environment variables:
bamboo_planRepository_1_branch=3.1.x
bamboo_planRepository_1_branchDisplayName=3.1.x
bamboo_repository_revision_number=dc49a8a199df28d985e951474dc08d23cd46097c
bamboo_PRref=master
bamboo_resultsUrl=https://bamboo.phpbb.com/browse/PHPBB3-PR-JOB1-7297
bamboo_capability_system_builder_command_Git=/usr/bin/git
bamboo_repository_75956235_git_username=bantu
bamboo_planRepository_1_name=phpBB Ascraeus
bamboo_build_working_directory=/home/bamboo/xml-data/build-dir/PHPBB3-PR-JOB1
bamboo_buildKey=PHPBB3-PR-JOB1
bamboo_capability_phpbb_tests=true
bamboo_shortPlanName=Pull Requests
bamboo_capability_system_builder_command_fop=/usr/bin/fop
bamboo_capability_dbms_sqlite_2=true
bamboo_planRepository_name=phpBB Ascraeus
bamboo_PRnumber=4847
bamboo_buildNumber=7297
bamboo_repository_75956235_git_repositoryUrl=https://github.com/phpbb/phpbb.git
bamboo_capability_system_builder_phpunit_PHPUnit=/usr/bin/phpunit
bamboo_shortJobName=Build and Test Job
bamboo_buildResultsUrl=https://bamboo.phpbb.com/browse/PHPBB3-PR-JOB1-7297
bamboo_repository_75956235_branch_name=3.1.x
bamboo_planRepository_repositoryUrl=https://github.com/phpbb/phpbb.git
bamboo_agentId=131073
bamboo_planName=phpBB3 - Pull Requests
bamboo_build_commandline_com_atlassian_bamboo_plugins_scripttask_task_builder_script_7=/bin/sh /home/bamboo/temp/PHPBB3-PR-JOB1-7297-ScriptBuildTask-2830558080592329690.sh
bamboo_shortPlanKey=PR
bamboo_shortJobKey=JOB1
bamboo_capability_dbms_mysql_55=true
bamboo_capability_system_jdk_JDK_1_7_0_65=/usr/lib/jvm/java-7-openjdk-amd64
bamboo_planRepository_revision=dc49a8a199df28d985e951474dc08d23cd46097c
bamboo_repository_previous_revision_number=dc49a8a199df28d985e951474dc08d23cd46097c
bamboo_buildTimeStamp=2017-06-28T17:50:38.442Z
bamboo_planRepository_previousRevision=dc49a8a199df28d985e951474dc08d23cd46097c
bamboo_capability_system_builder_mvn2_Maven_2=/usr/share/maven2
bamboo_capability_system_jdk_JDK_1_6_0_16=/usr/lib/jvm/java-6-sun-1.6.0.16
bamboo_build_commandline_com_atlassian_bamboo_plugins_scripttask_task_builder_script_4=/bin/sh /home/bamboo/temp/PHPBB3-PR-JOB1-7297-ScriptBuildTask-7277996137778556290.sh
bamboo_buildResultKey=PHPBB3-PR-JOB1-7297
bamboo_repository_git_branch=3.1.x
bamboo_repository_branch_name=3.1.x
bamboo_buildPlanName=phpBB3 - Pull Requests - Build and Test Job
bamboo_planRepository_1_revision=dc49a8a199df28d985e951474dc08d23cd46097c
bamboo_repository_name=phpBB Ascraeus
bamboo_buildFailed=true
bamboo_capability_system_docker_executable=/usr/bin/docker
bamboo_build_commandline_com_atlassian_bamboo_plugins_bamboo_docker_plugin_task_docker_cli_11=/usr/bin/docker run --volume /home/bamboo/xml-data/build-dir/PHPBB3-PR-JOB1:/data --workdir /data/build --rm -u=991 phpbb:php-5.6 ../phpBB/vendor/bin/phing sniff
bamboo_build_commandline_com_atlassian_bamboo_plugins_bamboo_docker_plugin_task_docker_cli_12=/usr/bin/docker run --volume /home/bamboo/xml-data/build-dir/PHPBB3-PR-JOB1:/data --workdir /data/phpBB --rm -e HOME=/home/bamboo -u=991 phpbb:php-5.6 /bin/bash -c php ../composer.phar install --dev; cd ../build; ../phpBB/vendor/bin/phing clean prepare
bamboo_planRepository_branch=3.1.x
bamboo_jobFailed=true
bamboo_agentWorkingDirectory=/home/bamboo/xml-data/build-dir
bamboo_capability_system_git_executable=/usr/bin/git
bamboo_planRepository_1_previousRevision=dc49a8a199df28d985e951474dc08d23cd46097c
bamboo_capability_system_builder_phpunit_PHPUnit_3_4=/usr/bin/phpunit
bamboo_repository_git_username=bantu
bamboo_repository_75956235_revision_number=dc49a8a199df28d985e951474dc08d23cd46097c
bamboo_planRepository_branchDisplayName=3.1.x
bamboo_planRepository_1_type=gitv2
bamboo_planRepository_branchName=3.1.x
bamboo_repository_75956235_previous_revision_number=dc49a8a199df28d985e951474dc08d23cd46097c
bamboo_capability_system_jdk_JDK=/usr/lib/jvm/java-6-sun
bamboo_plan_storageTag=PHPBB3-PR
bamboo_planRepository_type=gitv2
bamboo_planRepository_1_username=bantu
bamboo_ManualBuildTriggerReason_userName=Build Robot
bamboo_repository_git_repositoryUrl=https://github.com/phpbb/phpbb.git
bamboo_repository_75956235_git_branch=3.1.x
bamboo_capability_system_builder_ant_Ant=/usr/share/ant
bamboo_repository_75956235_name=phpBB Ascraeus
bamboo_working_directory=/home/bamboo/xml-data/build-dir/PHPBB3-PR-JOB1
bamboo_planKey=PHPBB3-PR
bamboo_planRepository_1_repositoryUrl=https://github.com/phpbb/phpbb.git
bamboo_planRepository_username=bantu
bamboo_capability_local=true
bamboo_capability_system_jdk_JDK_1_6=/usr/lib/jvm/java-6-sun
bamboo_capability_system_jdk_JDK_1_7=/usr/lib/jvm/java-7-openjdk-amd64
bamboo_planRepository_1_branchName=3.1.x
28-Jun-2017 17:53:30 From https://github.com/phpbb/phpbb
28-Jun-2017 17:53:30 * branch            refs/pull/4847/head -> FETCH_HEAD
28-Jun-2017 17:53:30 grep: build/logs/phpunit.xml: No such file or directory
28-Jun-2017 17:53:30 grep: build/logs/phpunit.xml: No such file or directory
28-Jun-2017 17:53:30   % Total    % Received % Xferd  Average Speed   Time    Time     Time  Current
28-Jun-2017 17:53:30                                  Dload  Upload   Total   Spent    Left  Speed
28-Jun-2017 17:53:30
28-Jun-2017 17:53:31   0     0    0     0    0     0      0      0 --:--:-- --:--:-- --:--:--     0
28-Jun-2017 17:53:31 100   273  100    93  100   180    323    625 --:--:-- --:--:-- --:--:--   627
28-Jun-2017 17:53:31 Finished task 'Set result build status' with result: Success
28-Jun-2017 17:53:31 Running post build plugin 'NCover Results Collector'
28-Jun-2017 17:53:31 Running post build plugin 'Artifact Copier'
28-Jun-2017 17:53:31 Running post build plugin 'npm Cache Cleanup'
28-Jun-2017 17:53:31 Running post build plugin 'Clover Results Collector'
28-Jun-2017 17:53:31 Running post build plugin 'Docker Container Cleanup'
28-Jun-2017 17:53:31 Successfully removed working directory at '/home/bamboo/xml-data/build-dir/PHPBB3-PR-JOB1'
28-Jun-2017 17:53:31 Finalising the build...
28-Jun-2017 17:53:31 Stopping timer.
28-Jun-2017 17:53:31 Build PHPBB3-PR-JOB1-7297 completed.
28-Jun-2017 17:53:31 Running on server: post build plugin 'NCover Results Collector'
28-Jun-2017 17:53:31 Running on server: post build plugin 'Build Hanging Detection Configuration'
28-Jun-2017 17:53:31 Running on server: post build plugin 'Clover Delta Calculator'
28-Jun-2017 17:53:31 Running on server: post build plugin 'Maven Dependencies Postprocessor'
28-Jun-2017 17:53:31 All post build plugins have finished
28-Jun-2017 17:53:31 Generating build results summary...
28-Jun-2017 17:53:31 Saving build results to disk...
28-Jun-2017 17:53:31 Logging substituted variables...
28-Jun-2017 17:53:31 Indexing build results...
28-Jun-2017 17:53:31 Finished building PHPBB3-PR-JOB1-7297.
28-Jun-2017 17:53:31
Substituting variable: ${bamboo.PRnumber} with 4847