Tests pending pull requests

Build: #7333 failed

Job: Build and Test Job failed

Stages & jobs

  1. Build and Test

Build log

The build generated 483 lines of output. Download or view full build log

15-Jul-2017 17:04:13 Build phpBB3 - Pull Requests - Build and Test Job #7333 (PHPBB3-PR-JOB1-7333) started building on agent Default Agent
15-Jul-2017 17:04:13
15-Jul-2017 17:04:13 Build working directory is /home/bamboo/xml-data/build-dir/PHPBB3-PR-JOB1
15-Jul-2017 17:04:13 Executing build phpBB3 - Pull Requests - Build and Test Job #7333 (PHPBB3-PR-JOB1-7333)
15-Jul-2017 17:04:13 Starting task 'Checkout develop branch' of type 'com.atlassian.bamboo.plugins.vcs:task.vcs.checkout'
15-Jul-2017 17:04:13 Build always requires a clean checkout
15-Jul-2017 17:04:13 Cleaning build directory '/home/bamboo/xml-data/build-dir/PHPBB3-PR-JOB1'
15-Jul-2017 17:04:13 Updating source code to revision: 50d2e337b02e8bdec80ed0672cf2e1fe384b6f3e
15-Jul-2017 17:04:13 Fetching 'refs/heads/3.1.x' from 'https://github.com/phpbb/phpbb.git'.
15-Jul-2017 17:04:13 Checking out revision 50d2e337b02e8bdec80ed0672cf2e1fe384b6f3e.
15-Jul-2017 17:04:13 Creating local git repository in '/home/bamboo/xml-data/build-dir/PHPBB3-PR-JOB1/.git'.
15-Jul-2017 17:04:13 Cloning into '/home/bamboo/xml-data/build-dir/PHPBB3-PR-JOB1'...
15-Jul-2017 17:04:13 done.
15-Jul-2017 17:04:15 Branch 3.1.x set up to track remote branch 3.1.x from origin.
15-Jul-2017 17:04:15 Switched to a new branch '3.1.x'
15-Jul-2017 17:04:15 Updated source code to revision: 50d2e337b02e8bdec80ed0672cf2e1fe384b6f3e
15-Jul-2017 17:04:15 Finished task 'Checkout develop branch' with result: Success
15-Jul-2017 17:04:15 Running pre-build action: VCS Version Collector
15-Jul-2017 17:04:15
Substituting variable: ${bamboo.PRnumber} with 4789
15-Jul-2017 17:04:15
Substituting variable: ${bamboo.buildResultsUrl} with https://bamboo.phpbb.com/browse/PHPBB3-PR-JOB1-7333
15-Jul-2017 17:04:15 Starting task 'Set pending build status' of type 'com.atlassian.bamboo.plugins.scripttask:task.builder.script'
15-Jul-2017 17:04:15
Beginning to execute external process for build 'phpBB3 - Pull Requests - Build and Test Job #7333 (PHPBB3-PR-JOB1-7333)'
... running command line:
/bin/sh /home/bamboo/temp/PHPBB3-PR-JOB1-7333-ScriptBuildTask-117546942990589413.sh
... in: /home/bamboo/xml-data/build-dir/PHPBB3-PR-JOB1
... using extra environment variables:
bamboo_planRepository_1_branch=3.1.x
bamboo_planRepository_1_branchDisplayName=3.1.x
bamboo_repository_revision_number=50d2e337b02e8bdec80ed0672cf2e1fe384b6f3e
bamboo_PRref=master
bamboo_resultsUrl=https://bamboo.phpbb.com/browse/PHPBB3-PR-JOB1-7333
bamboo_capability_system_builder_command_Git=/usr/bin/git
bamboo_repository_75956235_git_username=bantu
bamboo_planRepository_1_name=phpBB Ascraeus
bamboo_build_working_directory=/home/bamboo/xml-data/build-dir/PHPBB3-PR-JOB1
bamboo_buildKey=PHPBB3-PR-JOB1
bamboo_capability_phpbb_tests=true
bamboo_shortPlanName=Pull Requests
bamboo_capability_system_builder_command_fop=/usr/bin/fop
bamboo_capability_dbms_sqlite_2=true
bamboo_planRepository_name=phpBB Ascraeus
bamboo_PRnumber=4789
bamboo_buildNumber=7333
bamboo_repository_75956235_git_repositoryUrl=https://github.com/phpbb/phpbb.git
bamboo_capability_system_builder_phpunit_PHPUnit=/usr/bin/phpunit
bamboo_shortJobName=Build and Test Job
bamboo_buildResultsUrl=https://bamboo.phpbb.com/browse/PHPBB3-PR-JOB1-7333
bamboo_repository_75956235_branch_name=3.1.x
bamboo_planRepository_repositoryUrl=https://github.com/phpbb/phpbb.git
bamboo_agentId=131073
bamboo_planName=phpBB3 - Pull Requests
bamboo_shortPlanKey=PR
bamboo_shortJobKey=JOB1
bamboo_capability_dbms_mysql_55=true
bamboo_capability_system_jdk_JDK_1_7_0_65=/usr/lib/jvm/java-7-openjdk-amd64
bamboo_planRepository_revision=50d2e337b02e8bdec80ed0672cf2e1fe384b6f3e
bamboo_repository_previous_revision_number=50d2e337b02e8bdec80ed0672cf2e1fe384b6f3e
bamboo_buildTimeStamp=2017-07-15T17:04:13.528Z
bamboo_planRepository_previousRevision=50d2e337b02e8bdec80ed0672cf2e1fe384b6f3e
bamboo_capability_system_builder_mvn2_Maven_2=/usr/share/maven2
bamboo_capability_system_jdk_JDK_1_6_0_16=/usr/lib/jvm/java-6-sun-1.6.0.16
bamboo_buildResultKey=PHPBB3-PR-JOB1-7333
bamboo_repository_git_branch=3.1.x
bamboo_repository_branch_name=3.1.x
bamboo_buildPlanName=phpBB3 - Pull Requests - Build and Test Job
bamboo_planRepository_1_revision=50d2e337b02e8bdec80ed0672cf2e1fe384b6f3e
bamboo_repository_name=phpBB Ascraeus
bamboo_buildFailed=false
bamboo_capability_system_docker_executable=/usr/bin/docker
bamboo_planRepository_branch=3.1.x
bamboo_agentWorkingDirectory=/home/bamboo/xml-data/build-dir
bamboo_capability_system_git_executable=/usr/bin/git
bamboo_planRepository_1_previousRevision=50d2e337b02e8bdec80ed0672cf2e1fe384b6f3e
bamboo_capability_system_builder_phpunit_PHPUnit_3_4=/usr/bin/phpunit
bamboo_repository_git_username=bantu
bamboo_repository_75956235_revision_number=50d2e337b02e8bdec80ed0672cf2e1fe384b6f3e
bamboo_planRepository_branchDisplayName=3.1.x
bamboo_planRepository_1_type=gitv2
bamboo_planRepository_branchName=3.1.x
bamboo_repository_75956235_previous_revision_number=50d2e337b02e8bdec80ed0672cf2e1fe384b6f3e
bamboo_capability_system_jdk_JDK=/usr/lib/jvm/java-6-sun
bamboo_plan_storageTag=PHPBB3-PR
bamboo_planRepository_type=gitv2
bamboo_planRepository_1_username=bantu
bamboo_ManualBuildTriggerReason_userName=Build Robot
bamboo_repository_git_repositoryUrl=https://github.com/phpbb/phpbb.git
bamboo_repository_75956235_git_branch=3.1.x
bamboo_capability_system_builder_ant_Ant=/usr/share/ant
bamboo_repository_75956235_name=phpBB Ascraeus
bamboo_working_directory=/home/bamboo/xml-data/build-dir/PHPBB3-PR-JOB1
bamboo_planKey=PHPBB3-PR
bamboo_planRepository_1_repositoryUrl=https://github.com/phpbb/phpbb.git
bamboo_planRepository_username=bantu
bamboo_capability_local=true
bamboo_capability_system_jdk_JDK_1_6=/usr/lib/jvm/java-6-sun
bamboo_capability_system_jdk_JDK_1_7=/usr/lib/jvm/java-7-openjdk-amd64
bamboo_planRepository_1_branchName=3.1.x
15-Jul-2017 17:04:16 From https://github.com/phpbb/phpbb
15-Jul-2017 17:04:16 * branch            refs/pull/4789/head -> FETCH_HEAD
15-Jul-2017 17:04:16   % Total    % Received % Xferd  Average Speed   Time    Time     Time  Current
15-Jul-2017 17:04:16                                  Dload  Upload   Total   Spent    Left  Speed
15-Jul-2017 17:04:16
15-Jul-2017 17:04:16   0     0    0     0    0     0      0      0 --:--:-- --:--:-- --:--:--     0
15-Jul-2017 17:04:16 100   275  100    93  100   182    288    565 --:--:-- --:--:-- --:--:--   566
15-Jul-2017 17:04:16 Finished task 'Set pending build status' with result: Success
15-Jul-2017 17:04:16
Substituting variable: ${bamboo.PRnumber} with 4789
15-Jul-2017 17:04:16 Starting task 'Fetch PR' of type 'com.atlassian.bamboo.plugins.scripttask:task.builder.script'
15-Jul-2017 17:04:16
Beginning to execute external process for build 'phpBB3 - Pull Requests - Build and Test Job #7333 (PHPBB3-PR-JOB1-7333)'
... running command line:
/bin/sh /home/bamboo/temp/PHPBB3-PR-JOB1-7333-ScriptBuildTask-5980995731222345488.sh
... in: /home/bamboo/xml-data/build-dir/PHPBB3-PR-JOB1
... using extra environment variables:
bamboo_planRepository_1_branch=3.1.x
bamboo_planRepository_1_branchDisplayName=3.1.x
bamboo_repository_revision_number=50d2e337b02e8bdec80ed0672cf2e1fe384b6f3e
bamboo_PRref=master
bamboo_resultsUrl=https://bamboo.phpbb.com/browse/PHPBB3-PR-JOB1-7333
bamboo_capability_system_builder_command_Git=/usr/bin/git
bamboo_repository_75956235_git_username=bantu
bamboo_planRepository_1_name=phpBB Ascraeus
bamboo_build_working_directory=/home/bamboo/xml-data/build-dir/PHPBB3-PR-JOB1
bamboo_buildKey=PHPBB3-PR-JOB1
bamboo_capability_phpbb_tests=true
bamboo_shortPlanName=Pull Requests
bamboo_capability_system_builder_command_fop=/usr/bin/fop
bamboo_capability_dbms_sqlite_2=true
bamboo_planRepository_name=phpBB Ascraeus
bamboo_PRnumber=4789
bamboo_buildNumber=7333
bamboo_repository_75956235_git_repositoryUrl=https://github.com/phpbb/phpbb.git
bamboo_capability_system_builder_phpunit_PHPUnit=/usr/bin/phpunit
bamboo_shortJobName=Build and Test Job
bamboo_buildResultsUrl=https://bamboo.phpbb.com/browse/PHPBB3-PR-JOB1-7333
bamboo_repository_75956235_branch_name=3.1.x
bamboo_planRepository_repositoryUrl=https://github.com/phpbb/phpbb.git
bamboo_agentId=131073
bamboo_planName=phpBB3 - Pull Requests
bamboo_build_commandline_com_atlassian_bamboo_plugins_scripttask_task_builder_script_7=/bin/sh /home/bamboo/temp/PHPBB3-PR-JOB1-7333-ScriptBuildTask-117546942990589413.sh
bamboo_shortPlanKey=PR
bamboo_shortJobKey=JOB1
bamboo_capability_dbms_mysql_55=true
bamboo_capability_system_jdk_JDK_1_7_0_65=/usr/lib/jvm/java-7-openjdk-amd64
bamboo_planRepository_revision=50d2e337b02e8bdec80ed0672cf2e1fe384b6f3e
bamboo_repository_previous_revision_number=50d2e337b02e8bdec80ed0672cf2e1fe384b6f3e
bamboo_buildTimeStamp=2017-07-15T17:04:13.528Z
bamboo_planRepository_previousRevision=50d2e337b02e8bdec80ed0672cf2e1fe384b6f3e
bamboo_capability_system_builder_mvn2_Maven_2=/usr/share/maven2
bamboo_capability_system_jdk_JDK_1_6_0_16=/usr/lib/jvm/java-6-sun-1.6.0.16
bamboo_buildResultKey=PHPBB3-PR-JOB1-7333
bamboo_repository_git_branch=3.1.x
bamboo_repository_branch_name=3.1.x
bamboo_buildPlanName=phpBB3 - Pull Requests - Build and Test Job
bamboo_planRepository_1_revision=50d2e337b02e8bdec80ed0672cf2e1fe384b6f3e
bamboo_repository_name=phpBB Ascraeus
bamboo_buildFailed=false
bamboo_capability_system_docker_executable=/usr/bin/docker
bamboo_planRepository_branch=3.1.x
bamboo_agentWorkingDirectory=/home/bamboo/xml-data/build-dir
bamboo_capability_system_git_executable=/usr/bin/git
bamboo_planRepository_1_previousRevision=50d2e337b02e8bdec80ed0672cf2e1fe384b6f3e
bamboo_capability_system_builder_phpunit_PHPUnit_3_4=/usr/bin/phpunit
bamboo_repository_git_username=bantu
bamboo_repository_75956235_revision_number=50d2e337b02e8bdec80ed0672cf2e1fe384b6f3e
bamboo_planRepository_branchDisplayName=3.1.x
bamboo_planRepository_1_type=gitv2
bamboo_planRepository_branchName=3.1.x
bamboo_repository_75956235_previous_revision_number=50d2e337b02e8bdec80ed0672cf2e1fe384b6f3e
bamboo_capability_system_jdk_JDK=/usr/lib/jvm/java-6-sun
bamboo_plan_storageTag=PHPBB3-PR
bamboo_planRepository_type=gitv2
bamboo_planRepository_1_username=bantu
bamboo_ManualBuildTriggerReason_userName=Build Robot
bamboo_repository_git_repositoryUrl=https://github.com/phpbb/phpbb.git
bamboo_repository_75956235_git_branch=3.1.x
bamboo_capability_system_builder_ant_Ant=/usr/share/ant
bamboo_repository_75956235_name=phpBB Ascraeus
bamboo_working_directory=/home/bamboo/xml-data/build-dir/PHPBB3-PR-JOB1
bamboo_planKey=PHPBB3-PR
bamboo_planRepository_1_repositoryUrl=https://github.com/phpbb/phpbb.git
bamboo_planRepository_username=bantu
bamboo_capability_local=true
bamboo_capability_system_jdk_JDK_1_6=/usr/lib/jvm/java-6-sun
bamboo_capability_system_jdk_JDK_1_7=/usr/lib/jvm/java-7-openjdk-amd64
bamboo_planRepository_1_branchName=3.1.x
15-Jul-2017 17:04:18 From https://github.com/phpbb/phpbb
15-Jul-2017 17:04:18 * branch            refs/pull/4789/merge -> FETCH_HEAD
15-Jul-2017 17:04:21 Note: checking out 'FETCH_HEAD'.
15-Jul-2017 17:04:21
15-Jul-2017 17:04:21 You are in 'detached HEAD' state. You can look around, make experimental
15-Jul-2017 17:04:21 changes and commit them, and you can discard any commits you make in this
15-Jul-2017 17:04:21 state without impacting any branches by performing another checkout.
15-Jul-2017 17:04:21
15-Jul-2017 17:04:21 If you want to create a new branch to retain commits you create, you may
15-Jul-2017 17:04:21 do so (now or later) by using -b with the checkout command again. Example:
15-Jul-2017 17:04:21
15-Jul-2017 17:04:21   git checkout -b new_branch_name
15-Jul-2017 17:04:21
15-Jul-2017 17:04:21 HEAD is now at 5065b38... Merge 7d72ce9dc90bb594698ddaff43e298d40cd18174 into 8514e8be73b363ef277d53b2acd9560df08d49ec
15-Jul-2017 17:04:21 Finished task 'Fetch PR' with result: Success
15-Jul-2017 17:04:21 Skipping execution of task 'Prepare directory' as it is disabled
15-Jul-2017 17:04:21
Substituting variable: ${bamboo.working.directory} with /home/bamboo/xml-data/build-dir/PHPBB3-PR-JOB1
15-Jul-2017 17:04:21 Starting task 'Prepare directory' of type 'com.atlassian.bamboo.plugins.bamboo-docker-plugin:task.docker.cli'
15-Jul-2017 17:04:21 Running image name (phpbb:php-5.6)
15-Jul-2017 17:04:21
Beginning to execute external process for build 'phpBB3 - Pull Requests - Build and Test Job #7333 (PHPBB3-PR-JOB1-7333)'
... running command line:
/usr/bin/docker run --volume /home/bamboo/xml-data/build-dir/PHPBB3-PR-JOB1:/data --workdir /data/phpBB --rm -e HOME=/home/bamboo -u=991 phpbb:php-5.6 /bin/bash -c php ../composer.phar install --dev; cd ../build; ../phpBB/vendor/bin/phing clean prepare
... in: /home/bamboo/xml-data/build-dir/PHPBB3-PR-JOB1
... using extra environment variables:
bamboo_planRepository_1_branch=3.1.x
bamboo_planRepository_1_branchDisplayName=3.1.x
bamboo_repository_revision_number=50d2e337b02e8bdec80ed0672cf2e1fe384b6f3e
bamboo_PRref=master
bamboo_resultsUrl=https://bamboo.phpbb.com/browse/PHPBB3-PR-JOB1-7333
bamboo_capability_system_builder_command_Git=/usr/bin/git
bamboo_repository_75956235_git_username=bantu
bamboo_planRepository_1_name=phpBB Ascraeus
bamboo_build_working_directory=/home/bamboo/xml-data/build-dir/PHPBB3-PR-JOB1
bamboo_buildKey=PHPBB3-PR-JOB1
bamboo_capability_phpbb_tests=true
bamboo_shortPlanName=Pull Requests
bamboo_capability_system_builder_command_fop=/usr/bin/fop
bamboo_capability_dbms_sqlite_2=true
bamboo_planRepository_name=phpBB Ascraeus
bamboo_PRnumber=4789
bamboo_buildNumber=7333
bamboo_repository_75956235_git_repositoryUrl=https://github.com/phpbb/phpbb.git
bamboo_capability_system_builder_phpunit_PHPUnit=/usr/bin/phpunit
bamboo_shortJobName=Build and Test Job
bamboo_buildResultsUrl=https://bamboo.phpbb.com/browse/PHPBB3-PR-JOB1-7333
bamboo_repository_75956235_branch_name=3.1.x
bamboo_planRepository_repositoryUrl=https://github.com/phpbb/phpbb.git
bamboo_agentId=131073
bamboo_planName=phpBB3 - Pull Requests
bamboo_build_commandline_com_atlassian_bamboo_plugins_scripttask_task_builder_script_7=/bin/sh /home/bamboo/temp/PHPBB3-PR-JOB1-7333-ScriptBuildTask-117546942990589413.sh
bamboo_shortPlanKey=PR
bamboo_shortJobKey=JOB1
bamboo_capability_dbms_mysql_55=true
bamboo_capability_system_jdk_JDK_1_7_0_65=/usr/lib/jvm/java-7-openjdk-amd64
bamboo_planRepository_revision=50d2e337b02e8bdec80ed0672cf2e1fe384b6f3e
bamboo_repository_previous_revision_number=50d2e337b02e8bdec80ed0672cf2e1fe384b6f3e
bamboo_buildTimeStamp=2017-07-15T17:04:13.528Z
bamboo_planRepository_previousRevision=50d2e337b02e8bdec80ed0672cf2e1fe384b6f3e
bamboo_capability_system_builder_mvn2_Maven_2=/usr/share/maven2
bamboo_capability_system_jdk_JDK_1_6_0_16=/usr/lib/jvm/java-6-sun-1.6.0.16
bamboo_build_commandline_com_atlassian_bamboo_plugins_scripttask_task_builder_script_4=/bin/sh /home/bamboo/temp/PHPBB3-PR-JOB1-7333-ScriptBuildTask-5980995731222345488.sh
bamboo_buildResultKey=PHPBB3-PR-JOB1-7333
bamboo_repository_git_branch=3.1.x
bamboo_repository_branch_name=3.1.x
bamboo_buildPlanName=phpBB3 - Pull Requests - Build and Test Job
bamboo_planRepository_1_revision=50d2e337b02e8bdec80ed0672cf2e1fe384b6f3e
bamboo_repository_name=phpBB Ascraeus
bamboo_buildFailed=false
bamboo_capability_system_docker_executable=/usr/bin/docker
bamboo_planRepository_branch=3.1.x
bamboo_agentWorkingDirectory=/home/bamboo/xml-data/build-dir
bamboo_capability_system_git_executable=/usr/bin/git
bamboo_planRepository_1_previousRevision=50d2e337b02e8bdec80ed0672cf2e1fe384b6f3e
bamboo_capability_system_builder_phpunit_PHPUnit_3_4=/usr/bin/phpunit
bamboo_repository_git_username=bantu
bamboo_repository_75956235_revision_number=50d2e337b02e8bdec80ed0672cf2e1fe384b6f3e
bamboo_planRepository_branchDisplayName=3.1.x
bamboo_planRepository_1_type=gitv2
bamboo_planRepository_branchName=3.1.x
bamboo_repository_75956235_previous_revision_number=50d2e337b02e8bdec80ed0672cf2e1fe384b6f3e
bamboo_capability_system_jdk_JDK=/usr/lib/jvm/java-6-sun
bamboo_plan_storageTag=PHPBB3-PR
bamboo_planRepository_type=gitv2
bamboo_planRepository_1_username=bantu
bamboo_ManualBuildTriggerReason_userName=Build Robot
bamboo_repository_git_repositoryUrl=https://github.com/phpbb/phpbb.git
bamboo_repository_75956235_git_branch=3.1.x
bamboo_capability_system_builder_ant_Ant=/usr/share/ant
bamboo_repository_75956235_name=phpBB Ascraeus
bamboo_working_directory=/home/bamboo/xml-data/build-dir/PHPBB3-PR-JOB1
bamboo_planKey=PHPBB3-PR
bamboo_planRepository_1_repositoryUrl=https://github.com/phpbb/phpbb.git
bamboo_planRepository_username=bantu
bamboo_capability_local=true
bamboo_capability_system_jdk_JDK_1_6=/usr/lib/jvm/java-6-sun
bamboo_capability_system_jdk_JDK_1_7=/usr/lib/jvm/java-7-openjdk-amd64
bamboo_planRepository_1_branchName=3.1.x
15-Jul-2017 17:04:22 You are running composer with xdebug enabled. This has a major impact on runtime performance. See https://getcomposer.org/xdebug
15-Jul-2017 17:04:22 You are using the deprecated option "dev". Dev packages are installed by default now.
15-Jul-2017 17:04:22 Cannot create cache directory /home/bamboo/.composer/cache/repo/https---packagist.org/, or directory is not writable. Proceeding without cache
15-Jul-2017 17:04:22 Cannot create cache directory /home/bamboo/.composer/cache/files/, or directory is not writable. Proceeding without cache
15-Jul-2017 17:04:22 Loading composer repositories with package information
15-Jul-2017 17:04:22 Installing dependencies (including require-dev) from lock file
15-Jul-2017 17:04:22   - Installing bantu/ini-get-wrapper (v1.0.1)
15-Jul-2017 17:04:24     Downloading: Connecting...    Downloading: 0%               Downloading: 100%    Downloading: 100%
15-Jul-2017 17:04:24
15-Jul-2017 17:04:24   - Installing symfony/process (v3.3.2)
15-Jul-2017 17:04:24     Downloading: Connecting...    Downloading: 0%               Downloading: 25%    Downloading: 30%    Downloading: 50%    Downloading: 65%    Downloading: 75%    Downloading: 80%    Downloading: 100%    Downloading: 100%
15-Jul-2017 17:04:24
15-Jul-2017 17:04:24   - Installing symfony/finder (v3.3.2)
15-Jul-2017 17:04:25     Downloading: Connecting...    Downloading: 0%               Downloading: 5%    Downloading: 10%    Downloading: 45%    Downloading: 75%    Downloading: 80%    Downloading: 85%    Downloading: 90%    Downloading: 100%    Downloading: 100%
15-Jul-2017 17:04:25
15-Jul-2017 17:04:25   - Installing symfony/filesystem (v3.3.2)
15-Jul-2017 17:04:26     Downloading: Connecting...    Downloading: 0%               Downloading: 65%    Downloading: 70%    Downloading: 85%    Downloading: 90%    Downloading: 100%    Downloading: 100%
15-Jul-2017 17:04:26
15-Jul-2017 17:04:26   - Installing symfony/polyfill-mbstring (v1.4.0)
15-Jul-2017 17:04:26     Downloading: Connecting...    Downloading: 0%               Downloading: 35%    Downloading: 45%    Downloading: 80%    Downloading: 100%    Downloading: 100%
15-Jul-2017 17:04:26
15-Jul-2017 17:04:26   - Installing psr/log (1.0.2)
15-Jul-2017 17:04:26     Downloading: Connecting...    Downloading: 0%               Downloading: 15%    Downloading: 100%    Downloading: 100%
15-Jul-2017 17:04:26
15-Jul-2017 17:04:26   - Installing symfony/debug (v3.3.2)
15-Jul-2017 17:04:27     Downloading: Connecting...    Downloading: 0%               Downloading: 10%    Downloading: 20%    Downloading: 30%    Downloading: 40%    Downloading: 50%    Downloading: 60%    Downloading: 75%    Downloading: 85%    Downloading: 95%    Downloading: 100%    Downloading: 100%
15-Jul-2017 17:04:27
15-Jul-2017 17:04:27   - Installing symfony/console (v3.3.2)
15-Jul-2017 17:04:28     Downloading: Connecting...    Downloading: 0%               Downloading: 5%    Downloading: 10%    Downloading: 15%    Downloading: 20%    Downloading: 25%    Downloading: 30%    Downloading: 35%    Downloading: 40%    Downloading: 45%    Downloading: 50%    Downloading: 55%    Downloading: 60%    Downloading: 65%    Downloading: 70%    Downloading: 75%    Downloading: 80%    Downloading: 85%    Downloading: 90%    Downloading: 95%    Downloading: 100%    Downloading: 100%
15-Jul-2017 17:04:28
15-Jul-2017 17:04:28   - Installing seld/phar-utils (1.0.1)
15-Jul-2017 17:04:28     Downloading: Connecting...    Downloading: 0%               Downloading: 30%    Downloading: 60%    Downloading: 90%    Downloading: 100%    Downloading: 100%
15-Jul-2017 17:04:28
15-Jul-2017 17:04:28   - Installing seld/jsonlint (1.6.0)
15-Jul-2017 17:04:29     Downloading: Connecting...    Downloading: 0%               Downloading: 40%    Downloading: 65%    Downloading: 100%
15-Jul-2017 17:04:29
15-Jul-2017 17:04:29   - Installing seld/cli-prompt (1.0.3)
15-Jul-2017 17:04:29     Downloading: Connecting...    Downloading: 0%               Downloading: 15%    Downloading: 30%    Downloading: 100%    Downloading: 100%
15-Jul-2017 17:04:29
15-Jul-2017 17:04:29   - Installing justinrainbow/json-schema (5.2.1)
15-Jul-2017 17:04:30     Downloading: Connecting...    Downloading: 0%               Downloading: 5%    Downloading: 20%    Downloading: 25%    Downloading: 60%    Downloading: 65%    Downloading: 80%    Downloading: 85%    Downloading: 100%    Downloading: 100%
15-Jul-2017 17:04:30
15-Jul-2017 17:04:30   - Installing composer/spdx-licenses (1.1.6)
15-Jul-2017 17:04:31     Downloading: Connecting...    Downloading: 0%               Downloading: 100%    Downloading: 100%
15-Jul-2017 17:04:31
15-Jul-2017 17:04:31   - Installing composer/semver (1.4.2)
15-Jul-2017 17:04:31     Downloading: Connecting...    Downloading: 0%               Downloading: 35%    Downloading: 75%    Downloading: 100%    Downloading: 100%
15-Jul-2017 17:04:31
15-Jul-2017 17:04:31   - Installing composer/ca-bundle (1.0.7)
15-Jul-2017 17:04:31     Downloading: Connecting...    Downloading: 0%               Downloading: 5%    Downloading: 10%    Downloading: 15%    Downloading: 20%    Downloading: 25%    Downloading: 30%    Downloading: 35%    Downloading: 40%    Downloading: 45%    Downloading: 50%    Downloading: 55%    Downloading: 60%    Downloading: 65%    Downloading: 70%    Downloading: 75%    Downloading: 80%    Downloading: 85%    Downloading: 90%    Downloading: 95%    Downloading: 100%    Downloading: 100%
15-Jul-2017 17:04:32
15-Jul-2017 17:04:32   - Installing composer/composer (1.4.2)
15-Jul-2017 17:04:33     Downloading: Connecting...    Downloading: 0%               Downloading: 5%    Downloading: 10%    Downloading: 15%    Downloading: 20%    Downloading: 25%    Downloading: 30%    Downloading: 35%    Downloading: 40%    Downloading: 45%    Downloading: 50%    Downloading: 55%    Downloading: 60%    Downloading: 65%    Downloading: 70%    Downloading: 75%    Downloading: 80%    Downloading: 85%    Downloading: 90%    Downloading: 95%    Downloading: 100%    Downloading: 100%
15-Jul-2017 17:04:33
15-Jul-2017 17:04:33   - Installing google/recaptcha (1.1.3)
15-Jul-2017 17:04:33     Downloading: Connecting...    Downloading: 100%         
15-Jul-2017 17:04:33
15-Jul-2017 17:04:33   - Installing guzzlehttp/promises (v1.3.1)
15-Jul-2017 17:04:34     Downloading: Connecting...    Downloading: 0%               Downloading: 30%    Downloading: 60%    Downloading: 75%    Downloading: 100%
15-Jul-2017 17:04:34
15-Jul-2017 17:04:34   - Installing psr/http-message (1.0.1)
15-Jul-2017 17:04:35     Downloading: Connecting...    Downloading: 0%               Downloading: 95%    Downloading: 100%    Downloading: 100%
15-Jul-2017 17:04:35
15-Jul-2017 17:04:35   - Installing guzzlehttp/psr7 (1.4.2)
15-Jul-2017 17:04:35     Downloading: Connecting...    Downloading: 0%               Downloading: 5%    Downloading: 10%    Downloading: 15%    Downloading: 20%    Downloading: 90%    Downloading: 95%    Downloading: 100%
15-Jul-2017 17:04:35
15-Jul-2017 17:04:35   - Installing lusitanian/oauth (v0.8.10)
15-Jul-2017 17:04:35     Downloading: Connecting...    Downloading: 100%         
15-Jul-2017 17:04:35
15-Jul-2017 17:04:36   - Installing marc1706/fast-image-size (v1.1.3)
15-Jul-2017 17:04:36     Downloading: Connecting...    Downloading: 0%               Downloading: 20%    Downloading: 40%    Downloading: 60%    Downloading: 80%    Downloading: 100%    Downloading: 100%
15-Jul-2017 17:04:36
15-Jul-2017 17:04:36   - Installing paragonie/random_compat (v1.4.2)
15-Jul-2017 17:04:37     Downloading: Connecting...    Downloading: 0%               Downloading: 10%    Downloading: 35%    Downloading: 45%    Downloading: 75%    Downloading: 100%    Downloading: 100%
15-Jul-2017 17:04:37
15-Jul-2017 17:04:37   - Installing patchwork/utf8 (v1.3.1)
15-Jul-2017 17:04:37     Downloading: Connecting...    Downloading: 0%               Downloading: 5%    Downloading: 10%    Downloading: 15%    Downloading: 20%    Downloading: 25%    Downloading: 30%    Downloading: 35%    Downloading: 40%    Downloading: 45%    Downloading: 50%    Downloading: 55%    Downloading: 60%    Downloading: 65%    Downloading: 70%    Downloading: 75%    Downloading: 80%    Downloading: 85%    Downloading: 90%    Downloading: 95%    Downloading: 100%    Downloading: 100%
15-Jul-2017 17:04:37
15-Jul-2017 17:04:37   - Installing psr/container (1.0.0)
15-Jul-2017 17:04:38     Downloading: Connecting...    Downloading: 0%               Downloading: 75%    Downloading: 100%    Downloading: 100%
15-Jul-2017 17:04:38
15-Jul-2017 17:04:38   - Installing s9e/text-formatter (0.9.6)
15-Jul-2017 17:04:38     Downloading: Connecting...    Downloading: 100%         
15-Jul-2017 17:04:38
15-Jul-2017 17:04:38   - Installing symfony/config (v3.3.2)
15-Jul-2017 17:04:39     Downloading: Connecting...    Downloading: 0%               Downloading: 5%    Downloading: 10%    Downloading: 15%    Downloading: 20%    Downloading: 25%    Downloading: 30%    Downloading: 35%    Downloading: 40%    Downloading: 45%    Downloading: 50%    Downloading: 55%    Downloading: 60%    Downloading: 65%    Downloading: 70%    Downloading: 75%    Downloading: 80%    Downloading: 85%    Downloading: 90%    Downloading: 95%    Downloading: 100%    Downloading: 100%
15-Jul-2017 17:04:39
15-Jul-2017 17:04:39   - Installing symfony/http-foundation (v3.3.2)
15-Jul-2017 17:04:40     Downloading: Connecting...    Downloading: 0%               Downloading: 5%    Downloading: 10%    Downloading: 15%    Downloading: 20%    Downloading: 25%    Downloading: 30%    Downloading: 35%    Downloading: 40%    Downloading: 45%    Downloading: 50%    Downloading: 55%    Downloading: 60%    Downloading: 65%    Downloading: 70%    Downloading: 75%    Downloading: 80%    Downloading: 85%    Downloading: 90%    Downloading: 95%    Downloading: 100%    Downloading: 100%
15-Jul-2017 17:04:40
15-Jul-2017 17:04:40   - Installing symfony/event-dispatcher (v3.3.2)
15-Jul-2017 17:04:40     Downloading: Connecting...    Downloading: 0%               Downloading: 5%    Downloading: 65%    Downloading: 70%    Downloading: 75%    Downloading: 80%    Downloading: 100%    Downloading: 100%
15-Jul-2017 17:04:40
15-Jul-2017 17:04:40   - Installing symfony/http-kernel (v3.3.2)
15-Jul-2017 17:04:41     Downloading: Connecting...    Downloading: 0%               Downloading: 5%    Downloading: 10%    Downloading: 15%    Downloading: 20%    Downloading: 25%    Downloading: 30%    Downloading: 35%    Downloading: 40%    Downloading: 45%    Downloading: 50%    Downloading: 55%    Downloading: 60%    Downloading: 65%    Downloading: 70%    Downloading: 75%    Downloading: 80%    Downloading: 85%    Downloading: 90%    Downloading: 95%    Downloading: 100%    Downloading: 100%
15-Jul-2017 17:04:41
15-Jul-2017 17:04:41   - Installing symfony/dependency-injection (v3.3.2)
15-Jul-2017 17:04:42     Downloading: Connecting...    Downloading: 100%         
15-Jul-2017 17:04:42
15-Jul-2017 17:04:42   - Installing zendframework/zend-eventmanager (3.0.1)
15-Jul-2017 17:04:43     Downloading: Connecting...    Downloading: 100%         
15-Jul-2017 17:04:43
15-Jul-2017 17:04:43   - Installing zendframework/zend-code (2.6.3)
15-Jul-2017 17:04:43     Downloading: Connecting...    Downloading: 0%               Downloading: 5%    Downloading: 10%    Downloading: 15%    Downloading: 20%    Downloading: 25%    Downloading: 30%    Downloading: 40%    Downloading: 45%    Downloading: 50%    Downloading: 55%    Downloading: 60%    Downloading: 65%    Downloading: 70%    Downloading: 75%    Downloading: 80%    Downloading: 85%    Downloading: 90%    Downloading: 95%    Downloading: 100%    Downloading: 100%
15-Jul-2017 17:04:43
15-Jul-2017 17:04:43   - Installing ocramius/proxy-manager (1.0.2)
15-Jul-2017 17:04:44     Downloading: Connecting...    Downloading: 0%               Downloading: 5%    Downloading: 10%    Downloading: 15%    Downloading: 20%    Downloading: 25%    Downloading: 30%    Downloading: 35%    Downloading: 40%    Downloading: 45%    Downloading: 50%    Downloading: 55%    Downloading: 60%    Downloading: 65%    Downloading: 70%    Downloading: 75%    Downloading: 80%    Downloading: 85%    Downloading: 95%    Downloading: 100%    Downloading: 100%
15-Jul-2017 17:04:45
15-Jul-2017 17:04:45   - Installing symfony/proxy-manager-bridge (v3.3.2)
15-Jul-2017 17:04:45     Downloading: Connecting...    Downloading: 100%         
15-Jul-2017 17:04:45
15-Jul-2017 17:04:45   - Installing symfony/routing (v3.3.2)
15-Jul-2017 17:04:45     Downloading: Connecting...    Downloading: 0%               Downloading: 5%    Downloading: 10%    Downloading: 15%    Downloading: 20%    Downloading: 25%    Downloading: 30%    Downloading: 35%    Downloading: 40%    Downloading: 45%    Downloading: 50%    Downloading: 55%    Downloading: 60%    Downloading: 65%    Downloading: 70%    Downloading: 75%    Downloading: 80%    Downloading: 85%    Downloading: 90%    Downloading: 95%    Downloading: 100%    Downloading: 100%
15-Jul-2017 17:04:45
15-Jul-2017 17:04:45   - Installing twig/twig (v1.34.3)
15-Jul-2017 17:04:47     Downloading: Connecting...    Downloading: 0%               Downloading: 5%    Downloading: 10%    Downloading: 15%    Downloading: 20%    Downloading: 25%    Downloading: 30%    Downloading: 35%    Downloading: 40%    Downloading: 45%    Downloading: 50%    Downloading: 55%    Downloading: 60%    Downloading: 65%    Downloading: 70%    Downloading: 75%    Downloading: 80%    Downloading: 85%    Downloading: 90%    Downloading: 95%    Downloading: 100%    Downloading: 100%
15-Jul-2017 17:04:47
15-Jul-2017 17:04:47   - Installing symfony/twig-bridge (v3.3.2)
15-Jul-2017 17:04:47     Downloading: Connecting...    Downloading: 100%         
15-Jul-2017 17:04:47
15-Jul-2017 17:04:47   - Installing symfony/dom-crawler (v3.3.2)
15-Jul-2017 17:04:48     Downloading: Connecting...    Downloading: 0%               Downloading: 25%    Downloading: 30%    Downloading: 50%    Downloading: 60%    Downloading: 65%    Downloading: 75%    Downloading: 100%    Downloading: 100%
15-Jul-2017 17:04:48
15-Jul-2017 17:04:48   - Installing symfony/css-selector (v3.3.2)
15-Jul-2017 17:04:49     Downloading: Connecting...    Downloading: 0%               Downloading: 5%    Downloading: 10%    Downloading: 15%    Downloading: 20%    Downloading: 25%    Downloading: 30%    Downloading: 35%    Downloading: 40%    Downloading: 45%    Downloading: 50%    Downloading: 55%    Downloading: 60%    Downloading: 65%    Downloading: 70%    Downloading: 100%    Downloading: 100%
15-Jul-2017 17:04:49
15-Jul-2017 17:04:49   - Installing symfony/browser-kit (v3.3.2)
15-Jul-2017 17:04:49     Downloading: Connecting...    Downloading: 0%               Downloading: 50%    Downloading: 55%    Downloading: 100%    Downloading: 100%
15-Jul-2017 17:04:49
15-Jul-2017 17:04:49   - Installing guzzlehttp/guzzle (6.2.3)
15-Jul-2017 17:04:49     Downloading: Connecting...    Downloading: 0%               Downloading: 5%    Downloading: 10%    Downloading: 15%    Downloading: 25%    Downloading: 30%    Downloading: 35%    Downloading: 40%    Downloading: 45%    Downloading: 55%    Downloading: 60%    Downloading: 65%    Downloading: 70%    Downloading: 80%    Downloading: 85%    Downloading: 95%    Downloading: 100%    Downloading: 100%
15-Jul-2017 17:04:49
15-Jul-2017 17:04:49   - Installing fabpot/goutte (v3.2.1)
15-Jul-2017 17:04:50     Downloading: Connecting...    Downloading: 0%               Downloading: 70%    Downloading: 100%    Downloading: 100%
15-Jul-2017 17:04:50
15-Jul-2017 17:04:50   - Installing facebook/webdriver (1.3.0)
15-Jul-2017 17:04:50     Downloading: Connecting...    Downloading: 100%         
15-Jul-2017 17:04:51
15-Jul-2017 17:04:51   - Installing laravel/homestead (v4.0.5)
15-Jul-2017 17:04:51     Downloading: Connecting...    Downloading: 100%         
15-Jul-2017 17:04:51
15-Jul-2017 17:04:51   - Installing phing/phing (2.4.14)
15-Jul-2017 17:04:53     Downloading: Connecting...    Downloading: 0%               Downloading: 5%    Downloading: 10%    Downloading: 15%    Downloading: 20%    Downloading: 25%    Downloading: 30%    Downloading: 35%    Downloading: 40%    Downloading: 45%    Downloading: 50%    Downloading: 55%    Downloading: 60%    Downloading: 65%    Downloading: 70%    Downloading: 75%    Downloading: 80%    Downloading: 85%    Downloading: 90%    Downloading: 95%    Downloading: 100%    Downloading: 100%
15-Jul-2017 17:04:53
15-Jul-2017 17:04:53   - Installing webmozart/assert (1.2.0)
15-Jul-2017 17:04:53     Downloading: Connecting...    Downloading: 0%               Downloading: 55%    Downloading: 60%    Downloading: 100%    Downloading: 100%
15-Jul-2017 17:04:53
15-Jul-2017 17:04:53   - Installing phpdocumentor/reflection-common (1.0)
15-Jul-2017 17:04:54     Downloading: Connecting...    Downloading: 0%               Downloading: 65%    Downloading: 100%    Downloading: 100%
15-Jul-2017 17:04:54
15-Jul-2017 17:04:54   - Installing phpdocumentor/type-resolver (0.2.1)
15-Jul-2017 17:04:54     Downloading: Connecting...    Downloading: 0%               Downloading: 20%    Downloading: 35%    Downloading: 80%    Downloading: 100%    Downloading: 100%
15-Jul-2017 17:04:54
15-Jul-2017 17:04:54   - Installing phpdocumentor/reflection-docblock (3.1.1)
15-Jul-2017 17:04:55     Downloading: Connecting...    Downloading: 0%               Downloading: 5%    Downloading: 15%    Downloading: 20%    Downloading: 25%    Downloading: 30%    Downloading: 35%    Downloading: 45%    Downloading: 50%    Downloading: 55%    Downloading: 65%    Downloading: 70%    Downloading: 75%    Downloading: 80%    Downloading: 90%    Downloading: 95%    Downloading: 100%    Downloading: 100%
15-Jul-2017 17:04:55
15-Jul-2017 17:04:55   - Installing symfony/yaml (v3.3.2)
15-Jul-2017 17:04:55     Downloading: Connecting...    Downloading: 0%               Downloading: 5%    Downloading: 10%    Downloading: 15%    Downloading: 20%    Downloading: 25%    Downloading: 30%    Downloading: 35%    Downloading: 45%    Downloading: 50%    Downloading: 55%    Downloading: 80%    Downloading: 85%    Downloading: 90%    Downloading: 95%    Downloading: 100%    Downloading: 100%
15-Jul-2017 17:04:55
15-Jul-2017 17:04:55   - Installing sebastian/version (1.0.6)
15-Jul-2017 17:04:56     Downloading: Connecting...    Downloading: 0%               Downloading: 100%    Downloading: 100%
15-Jul-2017 17:04:56
15-Jul-2017 17:04:56   - Installing sebastian/global-state (1.1.1)
15-Jul-2017 17:04:56     Downloading: Connecting...    Downloading: 0%               Downloading: 40%    Downloading: 85%    Downloading: 100%    Downloading: 100%
15-Jul-2017 17:04:56
15-Jul-2017 17:04:56   - Installing sebastian/recursion-context (1.0.5)
15-Jul-2017 17:04:57     Downloading: Connecting...    Downloading: 0%               Downloading: 35%    Downloading: 70%    Downloading: 100%    Downloading: 100%
15-Jul-2017 17:04:57
15-Jul-2017 17:04:57   - Installing sebastian/exporter (1.2.2)
15-Jul-2017 17:04:58     Downloading: Connecting...    Downloading: 0%               Downloading: 100%
15-Jul-2017 17:04:58
15-Jul-2017 17:04:58   - Installing sebastian/environment (1.3.8)
15-Jul-2017 17:04:58     Downloading: Connecting...    Downloading: 0%               Downloading: 15%    Downloading: 30%    Downloading: 45%    Downloading: 60%    Downloading: 75%    Downloading: 100%    Downloading: 100%
15-Jul-2017 17:04:58
15-Jul-2017 17:04:58   - Installing sebastian/diff (1.4.3)
15-Jul-2017 17:04:59     Downloading: Connecting...    Downloading: 0%               Downloading: 35%    Downloading: 40%    Downloading: 75%    Downloading: 100%    Downloading: 100%
15-Jul-2017 17:04:59
15-Jul-2017 17:04:59   - Installing sebastian/comparator (1.2.4)
15-Jul-2017 17:04:59     Downloading: Connecting...    Downloading: 0%               Downloading: 10%    Downloading: 70%    Downloading: 80%    Downloading: 90%    Downloading: 95%    Downloading: 100%    Downloading: 100%
15-Jul-2017 17:04:59
15-Jul-2017 17:04:59   - Installing phpunit/php-text-template (1.2.1)
15-Jul-2017 17:05:00     Downloading: Connecting...    Downloading: 0%               Downloading: 35%    Downloading: 100%    Downloading: 100%
15-Jul-2017 17:05:00
15-Jul-2017 17:05:00   - Installing doctrine/instantiator (1.0.5)
15-Jul-2017 17:05:00     Downloading: Connecting...    Downloading: 0%               Downloading: 15%    Downloading: 30%    Downloading: 45%    Downloading: 60%    Downloading: 85%    Downloading: 100%    Downloading: 100%
15-Jul-2017 17:05:00
15-Jul-2017 17:05:00   - Installing phpunit/phpunit-mock-objects (2.3.8)
15-Jul-2017 17:05:01     Downloading: Connecting...    Downloading: 0%               Downloading: 5%    Downloading: 20%    Downloading: 25%    Downloading: 35%    Downloading: 40%    Downloading: 45%    Downloading: 50%    Downloading: 60%    Downloading: 65%    Downloading: 70%    Downloading: 75%    Downloading: 90%    Downloading: 95%    Downloading: 100%    Downloading: 100%
15-Jul-2017 17:05:01
15-Jul-2017 17:05:01   - Installing phpunit/php-timer (1.0.9)
15-Jul-2017 17:05:02     Downloading: Connecting...    Downloading: 0%               Downloading: 45%    Downloading: 90%    Downloading: 100%    Downloading: 100%
15-Jul-2017 17:05:02
15-Jul-2017 17:05:02   - Installing phpunit/php-file-iterator (1.4.2)
15-Jul-2017 17:05:02     Downloading: Connecting...    Downloading: 0%               Downloading: 20%    Downloading: 40%    Downloading: 60%    Downloading: 100%    Downloading: 100%
15-Jul-2017 17:05:02
15-Jul-2017 17:05:02   - Installing phpunit/php-token-stream (1.4.11)
15-Jul-2017 17:05:03     Downloading: Connecting...    Downloading: 0%               Downloading: 5%    Downloading: 10%    Downloading: 15%    Downloading: 20%    Downloading: 65%    Downloading: 70%    Downloading: 75%    Downloading: 80%    Downloading: 85%    Downloading: 90%    Downloading: 95%    Downloading: 100%    Downloading: 100%
15-Jul-2017 17:05:03
15-Jul-2017 17:05:03   - Installing phpunit/php-code-coverage (2.2.4)
15-Jul-2017 17:05:03     Downloading: Connecting...    Downloading: 0%               Downloading: 5%    Downloading: 10%    Downloading: 15%    Downloading: 20%    Downloading: 25%    Downloading: 30%    Downloading: 35%    Downloading: 40%    Downloading: 45%    Downloading: 50%    Downloading: 55%    Downloading: 60%    Downloading: 65%    Downloading: 70%    Downloading: 75%    Downloading: 80%    Downloading: 85%    Downloading: 90%    Downloading: 95%    Downloading: 100%    Downloading: 100%
15-Jul-2017 17:05:03
15-Jul-2017 17:05:03   - Installing phpspec/prophecy (v1.7.0)
15-Jul-2017 17:05:04     Downloading: Connecting...    Downloading: 0%               Downloading: 5%    Downloading: 10%    Downloading: 15%    Downloading: 20%    Downloading: 25%    Downloading: 30%    Downloading: 35%    Downloading: 40%    Downloading: 45%    Downloading: 50%    Downloading: 55%    Downloading: 60%    Downloading: 65%    Downloading: 70%    Downloading: 75%    Downloading: 80%    Downloading: 85%    Downloading: 90%    Downloading: 95%    Downloading: 100%    Downloading: 100%
15-Jul-2017 17:05:04
15-Jul-2017 17:05:04   - Installing phpunit/phpunit (4.8.35)
15-Jul-2017 17:05:05     Downloading: Connecting...    Downloading: 0%               Downloading: 5%    Downloading: 10%    Downloading: 15%    Downloading: 20%    Downloading: 25%    Downloading: 30%    Downloading: 35%    Downloading: 40%    Downloading: 45%    Downloading: 50%    Downloading: 55%    Downloading: 60%    Downloading: 70%    Downloading: 80%    Downloading: 85%    Downloading: 90%    Downloading: 95%    Downloading: 100%    Downloading: 100%
15-Jul-2017 17:05:05
15-Jul-2017 17:05:05   - Installing phpunit/dbunit (2.0.3)
15-Jul-2017 17:05:06     Downloading: Connecting...    Downloading: 100%         
15-Jul-2017 17:05:06
15-Jul-2017 17:05:06   - Installing squizlabs/php_codesniffer (2.9.1)
15-Jul-2017 17:05:06     Downloading: Connecting...    Downloading: 0%               Downloading: 5%    Downloading: 10%    Downloading: 15%    Downloading: 20%    Downloading: 25%    Downloading: 30%    Downloading: 35%    Downloading: 40%    Downloading: 45%    Downloading: 50%    Downloading: 55%    Downloading: 60%    Downloading: 65%    Downloading: 70%    Downloading: 75%    Downloading: 80%    Downloading: 85%    Downloading: 90%    Downloading: 95%    Downloading: 100%    Downloading: 100%
15-Jul-2017 17:05:07
15-Jul-2017 17:05:08 lusitanian/oauth suggests installing predis/predis (Allows using the Redis storage backend.)
15-Jul-2017 17:05:08 paragonie/random_compat suggests installing ext-libsodium (Provides a modern crypto API that can be used to generate random bytes.)
15-Jul-2017 17:05:08 patchwork/utf8 suggests installing ext-intl (Use Intl for best performance)
15-Jul-2017 17:05:08 patchwork/utf8 suggests installing ext-wfio (Use WFIO for UTF-8 filesystem access on Windows)
15-Jul-2017 17:05:08 s9e/text-formatter suggests installing ext-intl (Allows international URLs to be accepted by the URL filter)
15-Jul-2017 17:05:08 s9e/text-formatter suggests installing ext-xsl (Enables the XSLT renderer)
15-Jul-2017 17:05:08 symfony/http-kernel suggests installing symfony/class-loader ()
15-Jul-2017 17:05:08 symfony/http-kernel suggests installing symfony/var-dumper ()
15-Jul-2017 17:05:08 symfony/dependency-injection suggests installing symfony/expression-language (For using expressions in service container configuration)
15-Jul-2017 17:05:08 zendframework/zend-eventmanager suggests installing container-interop/container-interop (^1.1.0, to use the lazy listeners feature)
15-Jul-2017 17:05:08 zendframework/zend-eventmanager suggests installing zendframework/zend-stdlib (^2.7.3 || ^3.0, to use the FilterChain feature)
15-Jul-2017 17:05:08 zendframework/zend-code suggests installing doctrine/annotations (Doctrine\Common\Annotations >=1.0 for annotation features)
15-Jul-2017 17:05:08 zendframework/zend-code suggests installing zendframework/zend-stdlib (Zend\Stdlib component)
15-Jul-2017 17:05:08 ocramius/proxy-manager suggests installing ocramius/generated-hydrator (To have very fast object to array to object conversion for ghost objects)
15-Jul-2017 17:05:08 ocramius/proxy-manager suggests installing zendframework/zend-json (To have the JsonRpc adapter (Remote Object feature))
15-Jul-2017 17:05:08 ocramius/proxy-manager suggests installing zendframework/zend-soap (To have the Soap adapter (Remote Object feature))
15-Jul-2017 17:05:08 ocramius/proxy-manager suggests installing zendframework/zend-stdlib (To use the hydrator proxy)
15-Jul-2017 17:05:08 ocramius/proxy-manager suggests installing zendframework/zend-xmlrpc (To have the XmlRpc adapter (Remote Object feature))
15-Jul-2017 17:05:08 symfony/routing suggests installing doctrine/annotations (For using the annotation loader)
15-Jul-2017 17:05:08 symfony/routing suggests installing symfony/expression-language (For using expression matching)
15-Jul-2017 17:05:08 symfony/twig-bridge suggests installing symfony/asset (For using the AssetExtension)
15-Jul-2017 17:05:08 symfony/twig-bridge suggests installing symfony/expression-language (For using the ExpressionExtension)
15-Jul-2017 17:05:08 symfony/twig-bridge suggests installing symfony/form (For using the FormExtension)
15-Jul-2017 17:05:08 symfony/twig-bridge suggests installing symfony/security (For using the SecurityExtension)
15-Jul-2017 17:05:08 symfony/twig-bridge suggests installing symfony/stopwatch (For using the StopwatchExtension)
15-Jul-2017 17:05:08 symfony/twig-bridge suggests installing symfony/templating (For using the TwigEngine)
15-Jul-2017 17:05:08 symfony/twig-bridge suggests installing symfony/translation (For using the TranslationExtension)
15-Jul-2017 17:05:08 symfony/twig-bridge suggests installing symfony/var-dumper (For using the DumpExtension)
15-Jul-2017 17:05:08 symfony/twig-bridge suggests installing symfony/web-link (For using the WebLinkExtension)
15-Jul-2017 17:05:08 facebook/webdriver suggests installing phpdocumentor/phpdocumentor (2.*)
15-Jul-2017 17:05:08 sebastian/global-state suggests installing ext-uopz (*)
15-Jul-2017 17:05:08 phpunit/phpunit-mock-objects suggests installing ext-soap (*)
15-Jul-2017 17:05:08 phpunit/phpunit suggests installing phpunit/php-invoker (~1.1)
15-Jul-2017 17:05:08 Generating autoload files
15-Jul-2017 17:05:09 Buildfile: /data/build/build.xml
15-Jul-2017 17:05:09
15-Jul-2017 17:05:09 phpBB > clean:
15-Jul-2017 17:05:09
15-Jul-2017 17:05:09    [delete] Directory /data/build/logs does not exist or is not a directory.
15-Jul-2017 17:05:09    [delete] Directory /data/build/api does not exist or is not a directory.
15-Jul-2017 17:05:09    [delete] Directory /data/build/codebrowser does not exist or is not a directory.
15-Jul-2017 17:05:09    [delete] Directory /data/build/coverage does not exist or is not a directory.
15-Jul-2017 17:05:09    [delete] Directory /data/build/cpd does not exist or is not a directory.
15-Jul-2017 17:05:09    [delete] Directory /data/build/dependencies does not exist or is not a directory.
15-Jul-2017 17:05:09    [delete] Directory /data/build/new_version does not exist or is not a directory.
15-Jul-2017 17:05:09    [delete] Directory /data/build/old_versions does not exist or is not a directory.
15-Jul-2017 17:05:09    [delete] Directory /data/build/save does not exist or is not a directory.
15-Jul-2017 17:05:09
15-Jul-2017 17:05:09 phpBB > prepare:
15-Jul-2017 17:05:09
15-Jul-2017 17:05:09     [mkdir] Created dir: /data/build/logs
15-Jul-2017 17:05:09     [mkdir] Created dir: /data/build/api
15-Jul-2017 17:05:09     [mkdir] Created dir: /data/build/codebrowser
15-Jul-2017 17:05:09     [mkdir] Created dir: /data/build/coverage
15-Jul-2017 17:05:09     [mkdir] Created dir: /data/build/cpd
15-Jul-2017 17:05:09     [mkdir] Created dir: /data/build/dependencies
15-Jul-2017 17:05:09     [mkdir] Created dir: /data/build/new_version
15-Jul-2017 17:05:09     [mkdir] Created dir: /data/build/new_version/files
15-Jul-2017 17:05:09     [mkdir] Created dir: /data/build/new_version/patches
15-Jul-2017 17:05:09     [mkdir] Created dir: /data/build/new_version/release_files
15-Jul-2017 17:05:09     [mkdir] Created dir: /data/build/new_version/update
15-Jul-2017 17:05:09     [mkdir] Created dir: /data/build/old_versions
15-Jul-2017 17:05:09     [mkdir] Created dir: /data/build/save
15-Jul-2017 17:05:09
15-Jul-2017 17:05:09 BUILD FINISHED
15-Jul-2017 17:05:09
15-Jul-2017 17:05:09 Total time: 0.1372 seconds
15-Jul-2017 17:05:09
15-Jul-2017 17:05:09 Finished task 'Prepare directory' with result: Success
15-Jul-2017 17:05:09 Skipping execution of task 'Run sniffs' as it is disabled
15-Jul-2017 17:05:09
Substituting variable: ${bamboo.working.directory} with /home/bamboo/xml-data/build-dir/PHPBB3-PR-JOB1
15-Jul-2017 17:05:09 Starting task 'Run sniffs' of type 'com.atlassian.bamboo.plugins.bamboo-docker-plugin:task.docker.cli'
15-Jul-2017 17:05:09 Running image name (phpbb:php-5.6)
15-Jul-2017 17:05:09
Beginning to execute external process for build 'phpBB3 - Pull Requests - Build and Test Job #7333 (PHPBB3-PR-JOB1-7333)'
... running command line:
/usr/bin/docker run --volume /home/bamboo/xml-data/build-dir/PHPBB3-PR-JOB1:/data --workdir /data/build --rm -u=991 phpbb:php-5.6 ../phpBB/vendor/bin/phing sniff
... in: /home/bamboo/xml-data/build-dir/PHPBB3-PR-JOB1
... using extra environment variables:
bamboo_planRepository_1_branch=3.1.x
bamboo_planRepository_1_branchDisplayName=3.1.x
bamboo_repository_revision_number=50d2e337b02e8bdec80ed0672cf2e1fe384b6f3e
bamboo_PRref=master
bamboo_resultsUrl=https://bamboo.phpbb.com/browse/PHPBB3-PR-JOB1-7333
bamboo_capability_system_builder_command_Git=/usr/bin/git
bamboo_repository_75956235_git_username=bantu
bamboo_planRepository_1_name=phpBB Ascraeus
bamboo_build_working_directory=/home/bamboo/xml-data/build-dir/PHPBB3-PR-JOB1
bamboo_buildKey=PHPBB3-PR-JOB1
bamboo_capability_phpbb_tests=true
bamboo_shortPlanName=Pull Requests
bamboo_capability_system_builder_command_fop=/usr/bin/fop
bamboo_capability_dbms_sqlite_2=true
bamboo_planRepository_name=phpBB Ascraeus
bamboo_PRnumber=4789
bamboo_buildNumber=7333
bamboo_repository_75956235_git_repositoryUrl=https://github.com/phpbb/phpbb.git
bamboo_capability_system_builder_phpunit_PHPUnit=/usr/bin/phpunit
bamboo_shortJobName=Build and Test Job
bamboo_buildResultsUrl=https://bamboo.phpbb.com/browse/PHPBB3-PR-JOB1-7333
bamboo_repository_75956235_branch_name=3.1.x
bamboo_planRepository_repositoryUrl=https://github.com/phpbb/phpbb.git
bamboo_agentId=131073
bamboo_planName=phpBB3 - Pull Requests
bamboo_build_commandline_com_atlassian_bamboo_plugins_scripttask_task_builder_script_7=/bin/sh /home/bamboo/temp/PHPBB3-PR-JOB1-7333-ScriptBuildTask-117546942990589413.sh
bamboo_shortPlanKey=PR
bamboo_shortJobKey=JOB1
bamboo_capability_dbms_mysql_55=true
bamboo_capability_system_jdk_JDK_1_7_0_65=/usr/lib/jvm/java-7-openjdk-amd64
bamboo_planRepository_revision=50d2e337b02e8bdec80ed0672cf2e1fe384b6f3e
bamboo_repository_previous_revision_number=50d2e337b02e8bdec80ed0672cf2e1fe384b6f3e
bamboo_buildTimeStamp=2017-07-15T17:04:13.528Z
bamboo_planRepository_previousRevision=50d2e337b02e8bdec80ed0672cf2e1fe384b6f3e
bamboo_capability_system_builder_mvn2_Maven_2=/usr/share/maven2
bamboo_capability_system_jdk_JDK_1_6_0_16=/usr/lib/jvm/java-6-sun-1.6.0.16
bamboo_build_commandline_com_atlassian_bamboo_plugins_scripttask_task_builder_script_4=/bin/sh /home/bamboo/temp/PHPBB3-PR-JOB1-7333-ScriptBuildTask-5980995731222345488.sh
bamboo_buildResultKey=PHPBB3-PR-JOB1-7333
bamboo_repository_git_branch=3.1.x
bamboo_repository_branch_name=3.1.x
bamboo_buildPlanName=phpBB3 - Pull Requests - Build and Test Job
bamboo_planRepository_1_revision=50d2e337b02e8bdec80ed0672cf2e1fe384b6f3e
bamboo_repository_name=phpBB Ascraeus
bamboo_buildFailed=false
bamboo_capability_system_docker_executable=/usr/bin/docker
bamboo_build_commandline_com_atlassian_bamboo_plugins_bamboo_docker_plugin_task_docker_cli_12=/usr/bin/docker run --volume /home/bamboo/xml-data/build-dir/PHPBB3-PR-JOB1:/data --workdir /data/phpBB --rm -e HOME=/home/bamboo -u=991 phpbb:php-5.6 /bin/bash -c php ../composer.phar install --dev; cd ../build; ../phpBB/vendor/bin/phing clean prepare
bamboo_planRepository_branch=3.1.x
bamboo_agentWorkingDirectory=/home/bamboo/xml-data/build-dir
bamboo_capability_system_git_executable=/usr/bin/git
bamboo_planRepository_1_previousRevision=50d2e337b02e8bdec80ed0672cf2e1fe384b6f3e
bamboo_capability_system_builder_phpunit_PHPUnit_3_4=/usr/bin/phpunit
bamboo_repository_git_username=bantu
bamboo_repository_75956235_revision_number=50d2e337b02e8bdec80ed0672cf2e1fe384b6f3e
bamboo_planRepository_branchDisplayName=3.1.x
bamboo_planRepository_1_type=gitv2
bamboo_planRepository_branchName=3.1.x
bamboo_repository_75956235_previous_revision_number=50d2e337b02e8bdec80ed0672cf2e1fe384b6f3e
bamboo_capability_system_jdk_JDK=/usr/lib/jvm/java-6-sun
bamboo_plan_storageTag=PHPBB3-PR
bamboo_planRepository_type=gitv2
bamboo_planRepository_1_username=bantu
bamboo_ManualBuildTriggerReason_userName=Build Robot
bamboo_repository_git_repositoryUrl=https://github.com/phpbb/phpbb.git
bamboo_repository_75956235_git_branch=3.1.x
bamboo_capability_system_builder_ant_Ant=/usr/share/ant
bamboo_repository_75956235_name=phpBB Ascraeus
bamboo_working_directory=/home/bamboo/xml-data/build-dir/PHPBB3-PR-JOB1
bamboo_planKey=PHPBB3-PR
bamboo_planRepository_1_repositoryUrl=https://github.com/phpbb/phpbb.git
bamboo_planRepository_username=bantu
bamboo_capability_local=true
bamboo_capability_system_jdk_JDK_1_6=/usr/lib/jvm/java-6-sun
bamboo_capability_system_jdk_JDK_1_7=/usr/lib/jvm/java-7-openjdk-amd64
bamboo_planRepository_1_branchName=3.1.x
15-Jul-2017 17:05:09 Buildfile: /data/build/build.xml
15-Jul-2017 17:05:09
15-Jul-2017 17:05:09 phpBB > sniff:
15-Jul-2017 17:05:09
15-Jul-2017 17:05:19 ............................................................  60 / 723 (8%)
15-Jul-2017 17:05:21 ............................................................ 120 / 723 (17%)
15-Jul-2017 17:05:22 ............................................................ 180 / 723 (25%)
15-Jul-2017 17:05:23 ............................................................ 240 / 723 (33%)
15-Jul-2017 17:05:27 .............................................E.E............ 300 / 723 (41%)
15-Jul-2017 17:05:34 ............................................................ 360 / 723 (50%)
15-Jul-2017 17:05:41 ............................................................ 420 / 723 (58%)
15-Jul-2017 17:05:46 ............................................................ 480 / 723 (66%)
15-Jul-2017 17:05:50 ............................................................ 540 / 723 (75%)
15-Jul-2017 17:05:54 ............................................................ 600 / 723 (83%)
15-Jul-2017 17:06:00 ............................................................ 660 / 723 (91%)
15-Jul-2017 17:06:03 .................................E.......................... 720 / 723 (100%)
15-Jul-2017 17:06:03 ...
15-Jul-2017 17:06:03
15-Jul-2017 17:06:03
15-Jul-2017 17:06:03 FILE: /data/phpBB/phpbb/console/command/style/install.php
15-Jul-2017 17:06:03 ----------------------------------------------------------------------
15-Jul-2017 17:06:03 FOUND 1 ERROR AFFECTING 1 LINE
15-Jul-2017 17:06:03 ----------------------------------------------------------------------
15-Jul-2017 17:06:03 16 | ERROR | There must not be unused USE statements.
15-Jul-2017 17:06:03     |       | (phpbb.Namespaces.UnusedUse.Unused)
15-Jul-2017 17:06:03 ----------------------------------------------------------------------
15-Jul-2017 17:06:03
15-Jul-2017 17:06:03
15-Jul-2017 17:06:03 FILE: /data/phpBB/phpbb/console/command/style/uninstall.php
15-Jul-2017 17:06:03 ----------------------------------------------------------------------
15-Jul-2017 17:06:03 FOUND 1 ERROR AFFECTING 1 LINE
15-Jul-2017 17:06:03 ----------------------------------------------------------------------
15-Jul-2017 17:06:03 45 | ERROR | [x] Functions must not contain multiple empty lines in a
15-Jul-2017 17:06:03     |       |     row; found 2 empty lines
15-Jul-2017 17:06:03     |       |     (Squiz.WhiteSpace.SuperfluousWhitespace.EmptyLines)
15-Jul-2017 17:06:03 ----------------------------------------------------------------------
15-Jul-2017 17:06:03 PHPCBF CAN FIX THE 1 MARKED SNIFF VIOLATIONS AUTOMATICALLY
15-Jul-2017 17:06:03 ----------------------------------------------------------------------
15-Jul-2017 17:06:03
15-Jul-2017 17:06:03
15-Jul-2017 17:06:03 FILE: /data/phpBB/phpbb/style/manager.php
15-Jul-2017 17:06:03 ----------------------------------------------------------------------
15-Jul-2017 17:06:03 FOUND 3 ERRORS AFFECTING 3 LINES
15-Jul-2017 17:06:03 ----------------------------------------------------------------------
15-Jul-2017 17:06:03 198 | ERROR | There should be exactly one space between the keyword and
15-Jul-2017 17:06:03      |       | opening parenthesis
15-Jul-2017 17:06:03      |       | (phpbb.ControlStructures.OpeningParenthesis.NoSpaceBeforeOpeningParenthesis)
15-Jul-2017 17:06:03 234 | ERROR | There should be exactly one space between the keyword and
15-Jul-2017 17:06:03      |       | opening parenthesis
15-Jul-2017 17:06:03      |       | (phpbb.ControlStructures.OpeningParenthesis.NoSpaceBeforeOpeningParenthesis)
15-Jul-2017 17:06:03 254 | ERROR | There should be exactly one space between the keyword and
15-Jul-2017 17:06:03      |       | opening parenthesis
15-Jul-2017 17:06:03      |       | (phpbb.ControlStructures.OpeningParenthesis.NoSpaceBeforeOpeningParenthesis)
15-Jul-2017 17:06:03 ----------------------------------------------------------------------
15-Jul-2017 17:06:03
15-Jul-2017 17:06:03 Time: 53.39 secs; Memory: 62.75Mb
15-Jul-2017 17:06:03
15-Jul-2017 17:06:13 ............................................................  60 / 206 (29%)
15-Jul-2017 17:06:36 ............................................................ 120 / 206 (58%)
15-Jul-2017 17:06:54 ............................................................ 180 / 206 (87%)
15-Jul-2017 17:07:02 ..........................
15-Jul-2017 17:07:02
15-Jul-2017 17:07:02 Time: 59.46 secs; Memory: 60.5Mb
15-Jul-2017 17:07:02
15-Jul-2017 17:07:02
15-Jul-2017 17:07:02
15-Jul-2017 17:07:02 Time: 18ms; Memory: 3.5Mb
15-Jul-2017 17:07:02
15-Jul-2017 17:07:02        [if] Error in IfTask
15-Jul-2017 17:07:02 Execution of target "sniff" failed for the following reason: /data/build/build.xml:109:6: /data/build/build.xml:115:9: PHP Code Sniffer failed.
15-Jul-2017 17:07:02
15-Jul-2017 17:07:02 BUILD FAILED
15-Jul-2017 17:07:02 /data/build/build.xml:109:6: /data/build/build.xml:115:9: PHP Code Sniffer failed.
15-Jul-2017 17:07:02 Total time: 2 minutes  53.18 seconds
15-Jul-2017 17:07:02
15-Jul-2017 17:07:02 Failing task since return code of [/usr/bin/docker run --volume /home/bamboo/xml-data/build-dir/PHPBB3-PR-JOB1:/data --workdir /data/build --rm -u=991 phpbb:php-5.6 ../phpBB/vendor/bin/phing sniff] was 1 while expected 0
15-Jul-2017 17:07:02 Error occurred while running Task 'Run sniffs(11)' of type com.atlassian.bamboo.plugins.bamboo-docker-plugin:task.docker.cli.
15-Jul-2017 17:07:02 com.atlassian.bamboo.task.TaskException: Failed to execute task
15-Jul-2017 17:07:02         at com.atlassian.bamboo.plugins.docker.service.RunService.execute(RunService.java:71)
15-Jul-2017 17:07:02         at com.atlassian.bamboo.plugins.docker.tasks.cli.DockerCliTask.execute(DockerCliTask.java:64)
15-Jul-2017 17:07:02         at com.atlassian.bamboo.task.TaskExecutorImpl.lambda$executeTasks$3(TaskExecutorImpl.java:284)
15-Jul-2017 17:07:02         at com.atlassian.bamboo.task.TaskExecutorImpl.executeTaskWithPrePostActions(TaskExecutorImpl.java:223)
15-Jul-2017 17:07:02         at com.atlassian.bamboo.task.TaskExecutorImpl.executeTasks(TaskExecutorImpl.java:284)
15-Jul-2017 17:07:02         at com.atlassian.bamboo.task.TaskExecutorImpl.execute(TaskExecutorImpl.java:111)
15-Jul-2017 17:07:02         at com.atlassian.bamboo.build.pipeline.tasks.ExecuteBuildTask.call(ExecuteBuildTask.java:69)
15-Jul-2017 17:07:02         at com.atlassian.bamboo.v2.build.agent.DefaultBuildAgent.build(DefaultBuildAgent.java:185)
15-Jul-2017 17:07:02         at com.atlassian.bamboo.v2.build.agent.BuildAgentControllerImpl$1.call(BuildAgentControllerImpl.java:122)
15-Jul-2017 17:07:02         at com.atlassian.bamboo.v2.build.agent.BuildAgentControllerImpl$1.call(BuildAgentControllerImpl.java:115)
15-Jul-2017 17:07:02         at com.atlassian.bamboo.variable.CustomVariableContextImpl.withVariableSubstitutor(CustomVariableContextImpl.java:185)
15-Jul-2017 17:07:02         at com.atlassian.bamboo.v2.build.agent.BuildAgentControllerImpl.waitAndPerformBuild(BuildAgentControllerImpl.java:115)
15-Jul-2017 17:07:02         at com.atlassian.bamboo.v2.build.agent.DefaultBuildAgent$1.run(DefaultBuildAgent.java:126)
15-Jul-2017 17:07:02         at com.atlassian.bamboo.utils.BambooRunnables$1.run(BambooRunnables.java:47)
15-Jul-2017 17:07:02         at com.atlassian.bamboo.security.ImpersonationHelper.runWith(ImpersonationHelper.java:26)
15-Jul-2017 17:07:02         at com.atlassian.bamboo.security.ImpersonationHelper.runWithSystemAuthority(ImpersonationHelper.java:17)
15-Jul-2017 17:07:02         at com.atlassian.bamboo.security.ImpersonationHelper$1.run(ImpersonationHelper.java:41)
15-Jul-2017 17:07:02         at java.lang.Thread.run(Thread.java:748)
15-Jul-2017 17:07:02 Caused by: com.atlassian.bamboo.plugins.docker.client.DockerException: Error running Docker run command
15-Jul-2017 17:07:02         at com.atlassian.bamboo.plugins.docker.client.DockerCmd.run(DockerCmd.java:103)
15-Jul-2017 17:07:02         at com.atlassian.bamboo.plugins.docker.service.RunService.execute(RunService.java:60)
15-Jul-2017 17:07:02         ... 17 more
15-Jul-2017 17:07:02 Caused by: com.atlassian.utils.process.ProcessException: Error executing /usr/bin/docker run --volume /home/bamboo/xml-data/build-dir/PHPBB3-PR-JOB1:/data --workdir /data/build --rm -u=991 phpbb:php-5.6 ../phpBB/vendor/bin/phing sniff
15-Jul-2017 17:07:02         at com.atlassian.bamboo.plugins.docker.process.DockerTaskProcessService.execute(DockerTaskProcessService.java:60)
15-Jul-2017 17:07:02         at com.atlassian.bamboo.plugins.docker.client.DockerCmd.run(DockerCmd.java:99)
15-Jul-2017 17:07:02         ... 18 more
15-Jul-2017 17:07:02 Starting task 'Parsing test results produced by script' of type 'com.atlassian.bamboo.plugins.testresultparser:task.testresultparser.junit'
15-Jul-2017 17:07:02 Parsing test results under /home/bamboo/xml-data/build-dir/PHPBB3-PR-JOB1...
15-Jul-2017 17:07:02 Failing task since test cases were expected but none were found.
15-Jul-2017 17:07:02 Finished task 'Parsing test results produced by script' with result: Failed
15-Jul-2017 17:07:02
Substituting variable: ${bamboo.PRnumber} with 4789
15-Jul-2017 17:07:02
Substituting variable: ${bamboo.buildResultsUrl} with https://bamboo.phpbb.com/browse/PHPBB3-PR-JOB1-7333
15-Jul-2017 17:07:02
Substituting variable: ${bamboo.buildResultsUrl} with https://bamboo.phpbb.com/browse/PHPBB3-PR-JOB1-7333
15-Jul-2017 17:07:02 Starting task 'Set result build status' of type 'com.atlassian.bamboo.plugins.scripttask:task.builder.script'
15-Jul-2017 17:07:02
Beginning to execute external process for build 'phpBB3 - Pull Requests - Build and Test Job #7333 (PHPBB3-PR-JOB1-7333)'
... running command line:
/bin/sh /home/bamboo/temp/PHPBB3-PR-JOB1-7333-ScriptBuildTask-8908480412680005185.sh
... in: /home/bamboo/xml-data/build-dir/PHPBB3-PR-JOB1
... using extra environment variables:
bamboo_planRepository_1_branch=3.1.x
bamboo_planRepository_1_branchDisplayName=3.1.x
bamboo_repository_revision_number=50d2e337b02e8bdec80ed0672cf2e1fe384b6f3e
bamboo_PRref=master
bamboo_resultsUrl=https://bamboo.phpbb.com/browse/PHPBB3-PR-JOB1-7333
bamboo_capability_system_builder_command_Git=/usr/bin/git
bamboo_repository_75956235_git_username=bantu
bamboo_planRepository_1_name=phpBB Ascraeus
bamboo_build_working_directory=/home/bamboo/xml-data/build-dir/PHPBB3-PR-JOB1
bamboo_buildKey=PHPBB3-PR-JOB1
bamboo_capability_phpbb_tests=true
bamboo_shortPlanName=Pull Requests
bamboo_capability_system_builder_command_fop=/usr/bin/fop
bamboo_capability_dbms_sqlite_2=true
bamboo_planRepository_name=phpBB Ascraeus
bamboo_PRnumber=4789
bamboo_buildNumber=7333
bamboo_repository_75956235_git_repositoryUrl=https://github.com/phpbb/phpbb.git
bamboo_capability_system_builder_phpunit_PHPUnit=/usr/bin/phpunit
bamboo_shortJobName=Build and Test Job
bamboo_buildResultsUrl=https://bamboo.phpbb.com/browse/PHPBB3-PR-JOB1-7333
bamboo_repository_75956235_branch_name=3.1.x
bamboo_planRepository_repositoryUrl=https://github.com/phpbb/phpbb.git
bamboo_agentId=131073
bamboo_planName=phpBB3 - Pull Requests
bamboo_build_commandline_com_atlassian_bamboo_plugins_scripttask_task_builder_script_7=/bin/sh /home/bamboo/temp/PHPBB3-PR-JOB1-7333-ScriptBuildTask-117546942990589413.sh
bamboo_shortPlanKey=PR
bamboo_shortJobKey=JOB1
bamboo_capability_dbms_mysql_55=true
bamboo_capability_system_jdk_JDK_1_7_0_65=/usr/lib/jvm/java-7-openjdk-amd64
bamboo_planRepository_revision=50d2e337b02e8bdec80ed0672cf2e1fe384b6f3e
bamboo_repository_previous_revision_number=50d2e337b02e8bdec80ed0672cf2e1fe384b6f3e
bamboo_buildTimeStamp=2017-07-15T17:04:13.528Z
bamboo_planRepository_previousRevision=50d2e337b02e8bdec80ed0672cf2e1fe384b6f3e
bamboo_capability_system_builder_mvn2_Maven_2=/usr/share/maven2
bamboo_capability_system_jdk_JDK_1_6_0_16=/usr/lib/jvm/java-6-sun-1.6.0.16
bamboo_build_commandline_com_atlassian_bamboo_plugins_scripttask_task_builder_script_4=/bin/sh /home/bamboo/temp/PHPBB3-PR-JOB1-7333-ScriptBuildTask-5980995731222345488.sh
bamboo_buildResultKey=PHPBB3-PR-JOB1-7333
bamboo_repository_git_branch=3.1.x
bamboo_repository_branch_name=3.1.x
bamboo_buildPlanName=phpBB3 - Pull Requests - Build and Test Job
bamboo_planRepository_1_revision=50d2e337b02e8bdec80ed0672cf2e1fe384b6f3e
bamboo_repository_name=phpBB Ascraeus
bamboo_buildFailed=true
bamboo_capability_system_docker_executable=/usr/bin/docker
bamboo_build_commandline_com_atlassian_bamboo_plugins_bamboo_docker_plugin_task_docker_cli_11=/usr/bin/docker run --volume /home/bamboo/xml-data/build-dir/PHPBB3-PR-JOB1:/data --workdir /data/build --rm -u=991 phpbb:php-5.6 ../phpBB/vendor/bin/phing sniff
bamboo_build_commandline_com_atlassian_bamboo_plugins_bamboo_docker_plugin_task_docker_cli_12=/usr/bin/docker run --volume /home/bamboo/xml-data/build-dir/PHPBB3-PR-JOB1:/data --workdir /data/phpBB --rm -e HOME=/home/bamboo -u=991 phpbb:php-5.6 /bin/bash -c php ../composer.phar install --dev; cd ../build; ../phpBB/vendor/bin/phing clean prepare
bamboo_planRepository_branch=3.1.x
bamboo_jobFailed=true
bamboo_agentWorkingDirectory=/home/bamboo/xml-data/build-dir
bamboo_capability_system_git_executable=/usr/bin/git
bamboo_planRepository_1_previousRevision=50d2e337b02e8bdec80ed0672cf2e1fe384b6f3e
bamboo_capability_system_builder_phpunit_PHPUnit_3_4=/usr/bin/phpunit
bamboo_repository_git_username=bantu
bamboo_repository_75956235_revision_number=50d2e337b02e8bdec80ed0672cf2e1fe384b6f3e
bamboo_planRepository_branchDisplayName=3.1.x
bamboo_planRepository_1_type=gitv2
bamboo_planRepository_branchName=3.1.x
bamboo_repository_75956235_previous_revision_number=50d2e337b02e8bdec80ed0672cf2e1fe384b6f3e
bamboo_capability_system_jdk_JDK=/usr/lib/jvm/java-6-sun
bamboo_plan_storageTag=PHPBB3-PR
bamboo_planRepository_type=gitv2
bamboo_planRepository_1_username=bantu
bamboo_ManualBuildTriggerReason_userName=Build Robot
bamboo_repository_git_repositoryUrl=https://github.com/phpbb/phpbb.git
bamboo_repository_75956235_git_branch=3.1.x
bamboo_capability_system_builder_ant_Ant=/usr/share/ant
bamboo_repository_75956235_name=phpBB Ascraeus
bamboo_working_directory=/home/bamboo/xml-data/build-dir/PHPBB3-PR-JOB1
bamboo_planKey=PHPBB3-PR
bamboo_planRepository_1_repositoryUrl=https://github.com/phpbb/phpbb.git
bamboo_planRepository_username=bantu
bamboo_capability_local=true
bamboo_capability_system_jdk_JDK_1_6=/usr/lib/jvm/java-6-sun
bamboo_capability_system_jdk_JDK_1_7=/usr/lib/jvm/java-7-openjdk-amd64
bamboo_planRepository_1_branchName=3.1.x
15-Jul-2017 17:07:03 From https://github.com/phpbb/phpbb
15-Jul-2017 17:07:03 * branch            refs/pull/4789/head -> FETCH_HEAD
15-Jul-2017 17:07:03 grep: build/logs/phpunit.xml: No such file or directory
15-Jul-2017 17:07:03 grep: build/logs/phpunit.xml: No such file or directory
15-Jul-2017 17:07:03   % Total    % Received % Xferd  Average Speed   Time    Time     Time  Current
15-Jul-2017 17:07:03                                  Dload  Upload   Total   Spent    Left  Speed
15-Jul-2017 17:07:03
15-Jul-2017 17:07:03   0     0    0     0    0     0      0      0 --:--:-- --:--:-- --:--:--     0
15-Jul-2017 17:07:03 100   273  100    93  100   180    182    354 --:--:-- --:--:-- --:--:--   354
15-Jul-2017 17:07:03 Finished task 'Set result build status' with result: Success
15-Jul-2017 17:07:03 Running post build plugin 'NCover Results Collector'
15-Jul-2017 17:07:03 Running post build plugin 'Artifact Copier'
15-Jul-2017 17:07:03 Running post build plugin 'npm Cache Cleanup'
15-Jul-2017 17:07:03 Running post build plugin 'Clover Results Collector'
15-Jul-2017 17:07:03 Running post build plugin 'Docker Container Cleanup'
15-Jul-2017 17:07:04 Successfully removed working directory at '/home/bamboo/xml-data/build-dir/PHPBB3-PR-JOB1'
15-Jul-2017 17:07:04 Finalising the build...
15-Jul-2017 17:07:04 Stopping timer.
15-Jul-2017 17:07:04 Build PHPBB3-PR-JOB1-7333 completed.
15-Jul-2017 17:07:04 Running on server: post build plugin 'NCover Results Collector'
15-Jul-2017 17:07:04 Running on server: post build plugin 'Build Hanging Detection Configuration'
15-Jul-2017 17:07:04 Running on server: post build plugin 'Clover Delta Calculator'
15-Jul-2017 17:07:04 Running on server: post build plugin 'Maven Dependencies Postprocessor'
15-Jul-2017 17:07:04 All post build plugins have finished
15-Jul-2017 17:07:04 Generating build results summary...
15-Jul-2017 17:07:04 Saving build results to disk...
15-Jul-2017 17:07:04 Logging substituted variables...
15-Jul-2017 17:07:04 Indexing build results...
15-Jul-2017 17:07:04 Finished building PHPBB3-PR-JOB1-7333.
15-Jul-2017 17:07:04
Substituting variable: ${bamboo.PRnumber} with 4789