Tests pending pull requests

Build: #7335 failed

Job: Build and Test Job failed

Stages & jobs

  1. Build and Test

Build log

The build generated 483 lines of output. Download or view full build log

15-Jul-2017 17:38:15 Build phpBB3 - Pull Requests - Build and Test Job #7335 (PHPBB3-PR-JOB1-7335) started building on agent Default Agent
15-Jul-2017 17:38:15
15-Jul-2017 17:38:15 Build working directory is /home/bamboo/xml-data/build-dir/PHPBB3-PR-JOB1
15-Jul-2017 17:38:15 Executing build phpBB3 - Pull Requests - Build and Test Job #7335 (PHPBB3-PR-JOB1-7335)
15-Jul-2017 17:38:15 Starting task 'Checkout develop branch' of type 'com.atlassian.bamboo.plugins.vcs:task.vcs.checkout'
15-Jul-2017 17:38:15 Build always requires a clean checkout
15-Jul-2017 17:38:15 Cleaning build directory '/home/bamboo/xml-data/build-dir/PHPBB3-PR-JOB1'
15-Jul-2017 17:38:15 Updating source code to revision: 50d2e337b02e8bdec80ed0672cf2e1fe384b6f3e
15-Jul-2017 17:38:15 Fetching 'refs/heads/3.1.x' from 'https://github.com/phpbb/phpbb.git'.
15-Jul-2017 17:38:16 Checking out revision 50d2e337b02e8bdec80ed0672cf2e1fe384b6f3e.
15-Jul-2017 17:38:16 Creating local git repository in '/home/bamboo/xml-data/build-dir/PHPBB3-PR-JOB1/.git'.
15-Jul-2017 17:38:16 Cloning into '/home/bamboo/xml-data/build-dir/PHPBB3-PR-JOB1'...
15-Jul-2017 17:38:16 done.
15-Jul-2017 17:38:17 Branch 3.1.x set up to track remote branch 3.1.x from origin.
15-Jul-2017 17:38:17 Switched to a new branch '3.1.x'
15-Jul-2017 17:38:17 Updated source code to revision: 50d2e337b02e8bdec80ed0672cf2e1fe384b6f3e
15-Jul-2017 17:38:17 Finished task 'Checkout develop branch' with result: Success
15-Jul-2017 17:38:17 Running pre-build action: VCS Version Collector
15-Jul-2017 17:38:17
Substituting variable: ${bamboo.PRnumber} with 4789
15-Jul-2017 17:38:17
Substituting variable: ${bamboo.buildResultsUrl} with https://bamboo.phpbb.com/browse/PHPBB3-PR-JOB1-7335
15-Jul-2017 17:38:17 Starting task 'Set pending build status' of type 'com.atlassian.bamboo.plugins.scripttask:task.builder.script'
15-Jul-2017 17:38:17
Beginning to execute external process for build 'phpBB3 - Pull Requests - Build and Test Job #7335 (PHPBB3-PR-JOB1-7335)'
... running command line:
/bin/sh /home/bamboo/temp/PHPBB3-PR-JOB1-7335-ScriptBuildTask-7312899095792867455.sh
... in: /home/bamboo/xml-data/build-dir/PHPBB3-PR-JOB1
... using extra environment variables:
bamboo_planRepository_1_branch=3.1.x
bamboo_planRepository_1_branchDisplayName=3.1.x
bamboo_repository_revision_number=50d2e337b02e8bdec80ed0672cf2e1fe384b6f3e
bamboo_PRref=master
bamboo_resultsUrl=https://bamboo.phpbb.com/browse/PHPBB3-PR-JOB1-7335
bamboo_capability_system_builder_command_Git=/usr/bin/git
bamboo_repository_75956235_git_username=bantu
bamboo_planRepository_1_name=phpBB Ascraeus
bamboo_build_working_directory=/home/bamboo/xml-data/build-dir/PHPBB3-PR-JOB1
bamboo_buildKey=PHPBB3-PR-JOB1
bamboo_capability_phpbb_tests=true
bamboo_shortPlanName=Pull Requests
bamboo_capability_system_builder_command_fop=/usr/bin/fop
bamboo_capability_dbms_sqlite_2=true
bamboo_planRepository_name=phpBB Ascraeus
bamboo_PRnumber=4789
bamboo_buildNumber=7335
bamboo_repository_75956235_git_repositoryUrl=https://github.com/phpbb/phpbb.git
bamboo_capability_system_builder_phpunit_PHPUnit=/usr/bin/phpunit
bamboo_shortJobName=Build and Test Job
bamboo_buildResultsUrl=https://bamboo.phpbb.com/browse/PHPBB3-PR-JOB1-7335
bamboo_repository_75956235_branch_name=3.1.x
bamboo_planRepository_repositoryUrl=https://github.com/phpbb/phpbb.git
bamboo_agentId=131073
bamboo_planName=phpBB3 - Pull Requests
bamboo_shortPlanKey=PR
bamboo_shortJobKey=JOB1
bamboo_capability_dbms_mysql_55=true
bamboo_capability_system_jdk_JDK_1_7_0_65=/usr/lib/jvm/java-7-openjdk-amd64
bamboo_planRepository_revision=50d2e337b02e8bdec80ed0672cf2e1fe384b6f3e
bamboo_repository_previous_revision_number=50d2e337b02e8bdec80ed0672cf2e1fe384b6f3e
bamboo_buildTimeStamp=2017-07-15T17:38:15.640Z
bamboo_planRepository_previousRevision=50d2e337b02e8bdec80ed0672cf2e1fe384b6f3e
bamboo_capability_system_builder_mvn2_Maven_2=/usr/share/maven2
bamboo_capability_system_jdk_JDK_1_6_0_16=/usr/lib/jvm/java-6-sun-1.6.0.16
bamboo_buildResultKey=PHPBB3-PR-JOB1-7335
bamboo_repository_git_branch=3.1.x
bamboo_repository_branch_name=3.1.x
bamboo_buildPlanName=phpBB3 - Pull Requests - Build and Test Job
bamboo_planRepository_1_revision=50d2e337b02e8bdec80ed0672cf2e1fe384b6f3e
bamboo_repository_name=phpBB Ascraeus
bamboo_buildFailed=false
bamboo_capability_system_docker_executable=/usr/bin/docker
bamboo_planRepository_branch=3.1.x
bamboo_agentWorkingDirectory=/home/bamboo/xml-data/build-dir
bamboo_capability_system_git_executable=/usr/bin/git
bamboo_planRepository_1_previousRevision=50d2e337b02e8bdec80ed0672cf2e1fe384b6f3e
bamboo_capability_system_builder_phpunit_PHPUnit_3_4=/usr/bin/phpunit
bamboo_repository_git_username=bantu
bamboo_repository_75956235_revision_number=50d2e337b02e8bdec80ed0672cf2e1fe384b6f3e
bamboo_planRepository_branchDisplayName=3.1.x
bamboo_planRepository_1_type=gitv2
bamboo_planRepository_branchName=3.1.x
bamboo_repository_75956235_previous_revision_number=50d2e337b02e8bdec80ed0672cf2e1fe384b6f3e
bamboo_capability_system_jdk_JDK=/usr/lib/jvm/java-6-sun
bamboo_plan_storageTag=PHPBB3-PR
bamboo_planRepository_type=gitv2
bamboo_planRepository_1_username=bantu
bamboo_ManualBuildTriggerReason_userName=Build Robot
bamboo_repository_git_repositoryUrl=https://github.com/phpbb/phpbb.git
bamboo_repository_75956235_git_branch=3.1.x
bamboo_capability_system_builder_ant_Ant=/usr/share/ant
bamboo_repository_75956235_name=phpBB Ascraeus
bamboo_working_directory=/home/bamboo/xml-data/build-dir/PHPBB3-PR-JOB1
bamboo_planKey=PHPBB3-PR
bamboo_planRepository_1_repositoryUrl=https://github.com/phpbb/phpbb.git
bamboo_planRepository_username=bantu
bamboo_capability_local=true
bamboo_capability_system_jdk_JDK_1_6=/usr/lib/jvm/java-6-sun
bamboo_capability_system_jdk_JDK_1_7=/usr/lib/jvm/java-7-openjdk-amd64
bamboo_planRepository_1_branchName=3.1.x
15-Jul-2017 17:38:18 From https://github.com/phpbb/phpbb
15-Jul-2017 17:38:18 * branch            refs/pull/4789/head -> FETCH_HEAD
15-Jul-2017 17:38:18   % Total    % Received % Xferd  Average Speed   Time    Time     Time  Current
15-Jul-2017 17:38:18                                  Dload  Upload   Total   Spent    Left  Speed
15-Jul-2017 17:38:18
15-Jul-2017 17:38:19   0     0    0     0    0     0      0      0 --:--:-- --:--:-- --:--:--     0
15-Jul-2017 17:38:19 100   275  100    93  100   182    322    631 --:--:-- --:--:-- --:--:--   631
15-Jul-2017 17:38:19 Finished task 'Set pending build status' with result: Success
15-Jul-2017 17:38:19
Substituting variable: ${bamboo.PRnumber} with 4789
15-Jul-2017 17:38:19 Starting task 'Fetch PR' of type 'com.atlassian.bamboo.plugins.scripttask:task.builder.script'
15-Jul-2017 17:38:19
Beginning to execute external process for build 'phpBB3 - Pull Requests - Build and Test Job #7335 (PHPBB3-PR-JOB1-7335)'
... running command line:
/bin/sh /home/bamboo/temp/PHPBB3-PR-JOB1-7335-ScriptBuildTask-6256468304288650707.sh
... in: /home/bamboo/xml-data/build-dir/PHPBB3-PR-JOB1
... using extra environment variables:
bamboo_planRepository_1_branch=3.1.x
bamboo_planRepository_1_branchDisplayName=3.1.x
bamboo_repository_revision_number=50d2e337b02e8bdec80ed0672cf2e1fe384b6f3e
bamboo_PRref=master
bamboo_resultsUrl=https://bamboo.phpbb.com/browse/PHPBB3-PR-JOB1-7335
bamboo_capability_system_builder_command_Git=/usr/bin/git
bamboo_repository_75956235_git_username=bantu
bamboo_planRepository_1_name=phpBB Ascraeus
bamboo_build_working_directory=/home/bamboo/xml-data/build-dir/PHPBB3-PR-JOB1
bamboo_buildKey=PHPBB3-PR-JOB1
bamboo_capability_phpbb_tests=true
bamboo_shortPlanName=Pull Requests
bamboo_capability_system_builder_command_fop=/usr/bin/fop
bamboo_capability_dbms_sqlite_2=true
bamboo_planRepository_name=phpBB Ascraeus
bamboo_PRnumber=4789
bamboo_buildNumber=7335
bamboo_repository_75956235_git_repositoryUrl=https://github.com/phpbb/phpbb.git
bamboo_capability_system_builder_phpunit_PHPUnit=/usr/bin/phpunit
bamboo_shortJobName=Build and Test Job
bamboo_buildResultsUrl=https://bamboo.phpbb.com/browse/PHPBB3-PR-JOB1-7335
bamboo_repository_75956235_branch_name=3.1.x
bamboo_planRepository_repositoryUrl=https://github.com/phpbb/phpbb.git
bamboo_agentId=131073
bamboo_planName=phpBB3 - Pull Requests
bamboo_build_commandline_com_atlassian_bamboo_plugins_scripttask_task_builder_script_7=/bin/sh /home/bamboo/temp/PHPBB3-PR-JOB1-7335-ScriptBuildTask-7312899095792867455.sh
bamboo_shortPlanKey=PR
bamboo_shortJobKey=JOB1
bamboo_capability_dbms_mysql_55=true
bamboo_capability_system_jdk_JDK_1_7_0_65=/usr/lib/jvm/java-7-openjdk-amd64
bamboo_planRepository_revision=50d2e337b02e8bdec80ed0672cf2e1fe384b6f3e
bamboo_repository_previous_revision_number=50d2e337b02e8bdec80ed0672cf2e1fe384b6f3e
bamboo_buildTimeStamp=2017-07-15T17:38:15.640Z
bamboo_planRepository_previousRevision=50d2e337b02e8bdec80ed0672cf2e1fe384b6f3e
bamboo_capability_system_builder_mvn2_Maven_2=/usr/share/maven2
bamboo_capability_system_jdk_JDK_1_6_0_16=/usr/lib/jvm/java-6-sun-1.6.0.16
bamboo_buildResultKey=PHPBB3-PR-JOB1-7335
bamboo_repository_git_branch=3.1.x
bamboo_repository_branch_name=3.1.x
bamboo_buildPlanName=phpBB3 - Pull Requests - Build and Test Job
bamboo_planRepository_1_revision=50d2e337b02e8bdec80ed0672cf2e1fe384b6f3e
bamboo_repository_name=phpBB Ascraeus
bamboo_buildFailed=false
bamboo_capability_system_docker_executable=/usr/bin/docker
bamboo_planRepository_branch=3.1.x
bamboo_agentWorkingDirectory=/home/bamboo/xml-data/build-dir
bamboo_capability_system_git_executable=/usr/bin/git
bamboo_planRepository_1_previousRevision=50d2e337b02e8bdec80ed0672cf2e1fe384b6f3e
bamboo_capability_system_builder_phpunit_PHPUnit_3_4=/usr/bin/phpunit
bamboo_repository_git_username=bantu
bamboo_repository_75956235_revision_number=50d2e337b02e8bdec80ed0672cf2e1fe384b6f3e
bamboo_planRepository_branchDisplayName=3.1.x
bamboo_planRepository_1_type=gitv2
bamboo_planRepository_branchName=3.1.x
bamboo_repository_75956235_previous_revision_number=50d2e337b02e8bdec80ed0672cf2e1fe384b6f3e
bamboo_capability_system_jdk_JDK=/usr/lib/jvm/java-6-sun
bamboo_plan_storageTag=PHPBB3-PR
bamboo_planRepository_type=gitv2
bamboo_planRepository_1_username=bantu
bamboo_ManualBuildTriggerReason_userName=Build Robot
bamboo_repository_git_repositoryUrl=https://github.com/phpbb/phpbb.git
bamboo_repository_75956235_git_branch=3.1.x
bamboo_capability_system_builder_ant_Ant=/usr/share/ant
bamboo_repository_75956235_name=phpBB Ascraeus
bamboo_working_directory=/home/bamboo/xml-data/build-dir/PHPBB3-PR-JOB1
bamboo_planKey=PHPBB3-PR
bamboo_planRepository_1_repositoryUrl=https://github.com/phpbb/phpbb.git
bamboo_planRepository_username=bantu
bamboo_capability_local=true
bamboo_capability_system_jdk_JDK_1_6=/usr/lib/jvm/java-6-sun
bamboo_capability_system_jdk_JDK_1_7=/usr/lib/jvm/java-7-openjdk-amd64
bamboo_planRepository_1_branchName=3.1.x
15-Jul-2017 17:38:20 From https://github.com/phpbb/phpbb
15-Jul-2017 17:38:20 * branch            refs/pull/4789/merge -> FETCH_HEAD
15-Jul-2017 17:38:20 Note: checking out 'FETCH_HEAD'.
15-Jul-2017 17:38:20
15-Jul-2017 17:38:20 You are in 'detached HEAD' state. You can look around, make experimental
15-Jul-2017 17:38:20 changes and commit them, and you can discard any commits you make in this
15-Jul-2017 17:38:20 state without impacting any branches by performing another checkout.
15-Jul-2017 17:38:20
15-Jul-2017 17:38:20 If you want to create a new branch to retain commits you create, you may
15-Jul-2017 17:38:20 do so (now or later) by using -b with the checkout command again. Example:
15-Jul-2017 17:38:20
15-Jul-2017 17:38:20   git checkout -b new_branch_name
15-Jul-2017 17:38:20
15-Jul-2017 17:38:20 HEAD is now at 573b80b... Merge a178b591fef1dbfe5dab269269399c7f32320a1d into 8514e8be73b363ef277d53b2acd9560df08d49ec
15-Jul-2017 17:38:20 Finished task 'Fetch PR' with result: Success
15-Jul-2017 17:38:20 Skipping execution of task 'Prepare directory' as it is disabled
15-Jul-2017 17:38:20
Substituting variable: ${bamboo.working.directory} with /home/bamboo/xml-data/build-dir/PHPBB3-PR-JOB1
15-Jul-2017 17:38:20 Starting task 'Prepare directory' of type 'com.atlassian.bamboo.plugins.bamboo-docker-plugin:task.docker.cli'
15-Jul-2017 17:38:20 Running image name (phpbb:php-5.6)
15-Jul-2017 17:38:20
Beginning to execute external process for build 'phpBB3 - Pull Requests - Build and Test Job #7335 (PHPBB3-PR-JOB1-7335)'
... running command line:
/usr/bin/docker run --volume /home/bamboo/xml-data/build-dir/PHPBB3-PR-JOB1:/data --workdir /data/phpBB --rm -e HOME=/home/bamboo -u=991 phpbb:php-5.6 /bin/bash -c php ../composer.phar install --dev; cd ../build; ../phpBB/vendor/bin/phing clean prepare
... in: /home/bamboo/xml-data/build-dir/PHPBB3-PR-JOB1
... using extra environment variables:
bamboo_planRepository_1_branch=3.1.x
bamboo_planRepository_1_branchDisplayName=3.1.x
bamboo_repository_revision_number=50d2e337b02e8bdec80ed0672cf2e1fe384b6f3e
bamboo_PRref=master
bamboo_resultsUrl=https://bamboo.phpbb.com/browse/PHPBB3-PR-JOB1-7335
bamboo_capability_system_builder_command_Git=/usr/bin/git
bamboo_repository_75956235_git_username=bantu
bamboo_planRepository_1_name=phpBB Ascraeus
bamboo_build_working_directory=/home/bamboo/xml-data/build-dir/PHPBB3-PR-JOB1
bamboo_buildKey=PHPBB3-PR-JOB1
bamboo_capability_phpbb_tests=true
bamboo_shortPlanName=Pull Requests
bamboo_capability_system_builder_command_fop=/usr/bin/fop
bamboo_capability_dbms_sqlite_2=true
bamboo_planRepository_name=phpBB Ascraeus
bamboo_PRnumber=4789
bamboo_buildNumber=7335
bamboo_repository_75956235_git_repositoryUrl=https://github.com/phpbb/phpbb.git
bamboo_capability_system_builder_phpunit_PHPUnit=/usr/bin/phpunit
bamboo_shortJobName=Build and Test Job
bamboo_buildResultsUrl=https://bamboo.phpbb.com/browse/PHPBB3-PR-JOB1-7335
bamboo_repository_75956235_branch_name=3.1.x
bamboo_planRepository_repositoryUrl=https://github.com/phpbb/phpbb.git
bamboo_agentId=131073
bamboo_planName=phpBB3 - Pull Requests
bamboo_build_commandline_com_atlassian_bamboo_plugins_scripttask_task_builder_script_7=/bin/sh /home/bamboo/temp/PHPBB3-PR-JOB1-7335-ScriptBuildTask-7312899095792867455.sh
bamboo_shortPlanKey=PR
bamboo_shortJobKey=JOB1
bamboo_capability_dbms_mysql_55=true
bamboo_capability_system_jdk_JDK_1_7_0_65=/usr/lib/jvm/java-7-openjdk-amd64
bamboo_planRepository_revision=50d2e337b02e8bdec80ed0672cf2e1fe384b6f3e
bamboo_repository_previous_revision_number=50d2e337b02e8bdec80ed0672cf2e1fe384b6f3e
bamboo_buildTimeStamp=2017-07-15T17:38:15.640Z
bamboo_planRepository_previousRevision=50d2e337b02e8bdec80ed0672cf2e1fe384b6f3e
bamboo_capability_system_builder_mvn2_Maven_2=/usr/share/maven2
bamboo_capability_system_jdk_JDK_1_6_0_16=/usr/lib/jvm/java-6-sun-1.6.0.16
bamboo_build_commandline_com_atlassian_bamboo_plugins_scripttask_task_builder_script_4=/bin/sh /home/bamboo/temp/PHPBB3-PR-JOB1-7335-ScriptBuildTask-6256468304288650707.sh
bamboo_buildResultKey=PHPBB3-PR-JOB1-7335
bamboo_repository_git_branch=3.1.x
bamboo_repository_branch_name=3.1.x
bamboo_buildPlanName=phpBB3 - Pull Requests - Build and Test Job
bamboo_planRepository_1_revision=50d2e337b02e8bdec80ed0672cf2e1fe384b6f3e
bamboo_repository_name=phpBB Ascraeus
bamboo_buildFailed=false
bamboo_capability_system_docker_executable=/usr/bin/docker
bamboo_planRepository_branch=3.1.x
bamboo_agentWorkingDirectory=/home/bamboo/xml-data/build-dir
bamboo_capability_system_git_executable=/usr/bin/git
bamboo_planRepository_1_previousRevision=50d2e337b02e8bdec80ed0672cf2e1fe384b6f3e
bamboo_capability_system_builder_phpunit_PHPUnit_3_4=/usr/bin/phpunit
bamboo_repository_git_username=bantu
bamboo_repository_75956235_revision_number=50d2e337b02e8bdec80ed0672cf2e1fe384b6f3e
bamboo_planRepository_branchDisplayName=3.1.x
bamboo_planRepository_1_type=gitv2
bamboo_planRepository_branchName=3.1.x
bamboo_repository_75956235_previous_revision_number=50d2e337b02e8bdec80ed0672cf2e1fe384b6f3e
bamboo_capability_system_jdk_JDK=/usr/lib/jvm/java-6-sun
bamboo_plan_storageTag=PHPBB3-PR
bamboo_planRepository_type=gitv2
bamboo_planRepository_1_username=bantu
bamboo_ManualBuildTriggerReason_userName=Build Robot
bamboo_repository_git_repositoryUrl=https://github.com/phpbb/phpbb.git
bamboo_repository_75956235_git_branch=3.1.x
bamboo_capability_system_builder_ant_Ant=/usr/share/ant
bamboo_repository_75956235_name=phpBB Ascraeus
bamboo_working_directory=/home/bamboo/xml-data/build-dir/PHPBB3-PR-JOB1
bamboo_planKey=PHPBB3-PR
bamboo_planRepository_1_repositoryUrl=https://github.com/phpbb/phpbb.git
bamboo_planRepository_username=bantu
bamboo_capability_local=true
bamboo_capability_system_jdk_JDK_1_6=/usr/lib/jvm/java-6-sun
bamboo_capability_system_jdk_JDK_1_7=/usr/lib/jvm/java-7-openjdk-amd64
bamboo_planRepository_1_branchName=3.1.x
15-Jul-2017 17:38:20 You are running composer with xdebug enabled. This has a major impact on runtime performance. See https://getcomposer.org/xdebug
15-Jul-2017 17:38:20 You are using the deprecated option "dev". Dev packages are installed by default now.
15-Jul-2017 17:38:20 Cannot create cache directory /home/bamboo/.composer/cache/repo/https---packagist.org/, or directory is not writable. Proceeding without cache
15-Jul-2017 17:38:20 Cannot create cache directory /home/bamboo/.composer/cache/files/, or directory is not writable. Proceeding without cache
15-Jul-2017 17:38:20 Loading composer repositories with package information
15-Jul-2017 17:38:21 Installing dependencies (including require-dev) from lock file
15-Jul-2017 17:38:21   - Installing bantu/ini-get-wrapper (v1.0.1)
15-Jul-2017 17:38:22     Downloading: Connecting...    Downloading: 100%         
15-Jul-2017 17:38:22
15-Jul-2017 17:38:22   - Installing symfony/process (v3.3.2)
15-Jul-2017 17:38:22     Downloading: Connecting...    Downloading: 0%               Downloading: 25%    Downloading: 30%    Downloading: 50%    Downloading: 65%    Downloading: 75%    Downloading: 80%    Downloading: 100%    Downloading: 100%
15-Jul-2017 17:38:22
15-Jul-2017 17:38:22   - Installing symfony/finder (v3.3.2)
15-Jul-2017 17:38:23     Downloading: Connecting...    Downloading: 0%               Downloading: 5%    Downloading: 10%    Downloading: 45%    Downloading: 50%    Downloading: 55%    Downloading: 60%    Downloading: 65%    Downloading: 100%
15-Jul-2017 17:38:23
15-Jul-2017 17:38:23   - Installing symfony/filesystem (v3.3.2)
15-Jul-2017 17:38:24     Downloading: Connecting...    Downloading: 0%               Downloading: 50%    Downloading: 55%    Downloading: 85%    Downloading: 90%    Downloading: 100%    Downloading: 100%
15-Jul-2017 17:38:24
15-Jul-2017 17:38:24   - Installing symfony/polyfill-mbstring (v1.4.0)
15-Jul-2017 17:38:24     Downloading: Connecting...    Downloading: 0%               Downloading: 35%    Downloading: 90%    Downloading: 100%    Downloading: 100%
15-Jul-2017 17:38:24
15-Jul-2017 17:38:24   - Installing psr/log (1.0.2)
15-Jul-2017 17:38:25     Downloading: Connecting...    Downloading: 0%               Downloading: 15%    Downloading: 100%
15-Jul-2017 17:38:25
15-Jul-2017 17:38:25   - Installing symfony/debug (v3.3.2)
15-Jul-2017 17:38:25     Downloading: Connecting...    Downloading: 0%               Downloading: 10%    Downloading: 20%    Downloading: 30%    Downloading: 40%    Downloading: 50%    Downloading: 60%    Downloading: 75%    Downloading: 85%    Downloading: 95%    Downloading: 100%    Downloading: 100%
15-Jul-2017 17:38:25
15-Jul-2017 17:38:25   - Installing symfony/console (v3.3.2)
15-Jul-2017 17:38:26     Downloading: Connecting...    Downloading: 0%               Downloading: 5%    Downloading: 10%    Downloading: 15%    Downloading: 20%    Downloading: 25%    Downloading: 30%    Downloading: 35%    Downloading: 40%    Downloading: 45%    Downloading: 50%    Downloading: 55%    Downloading: 60%    Downloading: 65%    Downloading: 70%    Downloading: 75%    Downloading: 80%    Downloading: 85%    Downloading: 90%    Downloading: 95%    Downloading: 100%    Downloading: 100%
15-Jul-2017 17:38:26
15-Jul-2017 17:38:26   - Installing seld/phar-utils (1.0.1)
15-Jul-2017 17:38:26     Downloading: Connecting...    Downloading: 0%               Downloading: 30%    Downloading: 60%    Downloading: 90%    Downloading: 100%    Downloading: 100%
15-Jul-2017 17:38:26
15-Jul-2017 17:38:26   - Installing seld/jsonlint (1.6.0)
15-Jul-2017 17:38:27     Downloading: Connecting...    Downloading: 0%               Downloading: 40%    Downloading: 85%    Downloading: 100%    Downloading: 100%
15-Jul-2017 17:38:27
15-Jul-2017 17:38:27   - Installing seld/cli-prompt (1.0.3)
15-Jul-2017 17:38:28     Downloading: Connecting...    Downloading: 0%               Downloading: 15%    Downloading: 30%    Downloading: 100%    Downloading: 100%
15-Jul-2017 17:38:28
15-Jul-2017 17:38:28   - Installing justinrainbow/json-schema (5.2.1)
15-Jul-2017 17:38:28     Downloading: Connecting...    Downloading: 0%               Downloading: 5%    Downloading: 20%    Downloading: 25%    Downloading: 70%    Downloading: 75%    Downloading: 95%    Downloading: 100%    Downloading: 100%
15-Jul-2017 17:38:28
15-Jul-2017 17:38:28   - Installing composer/spdx-licenses (1.1.6)
15-Jul-2017 17:38:29     Downloading: Connecting...    Downloading: 0%               Downloading: 100%    Downloading: 100%
15-Jul-2017 17:38:29
15-Jul-2017 17:38:29   - Installing composer/semver (1.4.2)
15-Jul-2017 17:38:29     Downloading: Connecting...    Downloading: 0%               Downloading: 35%    Downloading: 75%    Downloading: 100%    Downloading: 100%
15-Jul-2017 17:38:29
15-Jul-2017 17:38:29   - Installing composer/ca-bundle (1.0.7)
15-Jul-2017 17:38:30     Downloading: Connecting...    Downloading: 0%               Downloading: 5%    Downloading: 10%    Downloading: 15%    Downloading: 20%    Downloading: 25%    Downloading: 30%    Downloading: 35%    Downloading: 40%    Downloading: 45%    Downloading: 50%    Downloading: 55%    Downloading: 60%    Downloading: 65%    Downloading: 70%    Downloading: 75%    Downloading: 80%    Downloading: 85%    Downloading: 90%    Downloading: 95%    Downloading: 100%    Downloading: 100%
15-Jul-2017 17:38:30
15-Jul-2017 17:38:30   - Installing composer/composer (1.4.2)
15-Jul-2017 17:38:31     Downloading: Connecting...    Downloading: 0%               Downloading: 5%    Downloading: 10%    Downloading: 15%    Downloading: 20%    Downloading: 25%    Downloading: 30%    Downloading: 35%    Downloading: 40%    Downloading: 45%    Downloading: 50%    Downloading: 55%    Downloading: 60%    Downloading: 65%    Downloading: 70%    Downloading: 75%    Downloading: 80%    Downloading: 85%    Downloading: 90%    Downloading: 95%    Downloading: 100%    Downloading: 100%
15-Jul-2017 17:38:31
15-Jul-2017 17:38:31   - Installing google/recaptcha (1.1.3)
15-Jul-2017 17:38:31     Downloading: Connecting...    Downloading: 100%         
15-Jul-2017 17:38:31
15-Jul-2017 17:38:31   - Installing guzzlehttp/promises (v1.3.1)
15-Jul-2017 17:38:32     Downloading: Connecting...    Downloading: 0%               Downloading: 30%    Downloading: 60%    Downloading: 85%    Downloading: 100%    Downloading: 100%
15-Jul-2017 17:38:32
15-Jul-2017 17:38:32   - Installing psr/http-message (1.0.1)
15-Jul-2017 17:38:33     Downloading: Connecting...    Downloading: 0%               Downloading: 95%    Downloading: 100%    Downloading: 100%
15-Jul-2017 17:38:33
15-Jul-2017 17:38:33   - Installing guzzlehttp/psr7 (1.4.2)
15-Jul-2017 17:38:33     Downloading: Connecting...    Downloading: 0%               Downloading: 5%    Downloading: 10%    Downloading: 15%    Downloading: 35%    Downloading: 40%    Downloading: 45%    Downloading: 50%    Downloading: 55%    Downloading: 60%    Downloading: 65%    Downloading: 85%    Downloading: 90%    Downloading: 95%    Downloading: 100%    Downloading: 100%
15-Jul-2017 17:38:33
15-Jul-2017 17:38:33   - Installing lusitanian/oauth (v0.8.10)
15-Jul-2017 17:38:34     Downloading: Connecting...    Downloading: 100%         
15-Jul-2017 17:38:34
15-Jul-2017 17:38:34   - Installing marc1706/fast-image-size (v1.1.3)
15-Jul-2017 17:38:34     Downloading: Connecting...    Downloading: 0%               Downloading: 20%    Downloading: 40%    Downloading: 60%    Downloading: 80%    Downloading: 100%    Downloading: 100%
15-Jul-2017 17:38:34
15-Jul-2017 17:38:34   - Installing paragonie/random_compat (v1.4.2)
15-Jul-2017 17:38:35     Downloading: Connecting...    Downloading: 0%               Downloading: 10%    Downloading: 35%    Downloading: 45%    Downloading: 70%    Downloading: 80%    Downloading: 100%    Downloading: 100%
15-Jul-2017 17:38:35
15-Jul-2017 17:38:35   - Installing patchwork/utf8 (v1.3.1)
15-Jul-2017 17:38:35     Downloading: Connecting...    Downloading: 0%               Downloading: 5%    Downloading: 10%    Downloading: 15%    Downloading: 20%    Downloading: 25%    Downloading: 30%    Downloading: 35%    Downloading: 40%    Downloading: 45%    Downloading: 50%    Downloading: 55%    Downloading: 60%    Downloading: 65%    Downloading: 70%    Downloading: 75%    Downloading: 80%    Downloading: 85%    Downloading: 90%    Downloading: 95%    Downloading: 100%    Downloading: 100%
15-Jul-2017 17:38:35
15-Jul-2017 17:38:35   - Installing psr/container (1.0.0)
15-Jul-2017 17:38:36     Downloading: Connecting...    Downloading: 0%               Downloading: 75%    Downloading: 100%    Downloading: 100%
15-Jul-2017 17:38:36
15-Jul-2017 17:38:36   - Installing s9e/text-formatter (0.9.6)
15-Jul-2017 17:38:36     Downloading: Connecting...    Downloading: 100%         
15-Jul-2017 17:38:36
15-Jul-2017 17:38:36   - Installing symfony/config (v3.3.2)
15-Jul-2017 17:38:37     Downloading: Connecting...    Downloading: 0%               Downloading: 5%    Downloading: 10%    Downloading: 15%    Downloading: 20%    Downloading: 25%    Downloading: 30%    Downloading: 35%    Downloading: 40%    Downloading: 45%    Downloading: 50%    Downloading: 55%    Downloading: 60%    Downloading: 65%    Downloading: 70%    Downloading: 75%    Downloading: 80%    Downloading: 85%    Downloading: 90%    Downloading: 95%    Downloading: 100%    Downloading: 100%
15-Jul-2017 17:38:37
15-Jul-2017 17:38:37   - Installing symfony/http-foundation (v3.3.2)
15-Jul-2017 17:38:38     Downloading: Connecting...    Downloading: 0%               Downloading: 5%    Downloading: 10%    Downloading: 15%    Downloading: 20%    Downloading: 25%    Downloading: 30%    Downloading: 35%    Downloading: 40%    Downloading: 45%    Downloading: 50%    Downloading: 55%    Downloading: 60%    Downloading: 65%    Downloading: 70%    Downloading: 75%    Downloading: 80%    Downloading: 85%    Downloading: 90%    Downloading: 95%    Downloading: 100%    Downloading: 100%
15-Jul-2017 17:38:38
15-Jul-2017 17:38:38   - Installing symfony/event-dispatcher (v3.3.2)
15-Jul-2017 17:38:38     Downloading: Connecting...    Downloading: 0%               Downloading: 5%    Downloading: 65%    Downloading: 70%    Downloading: 75%    Downloading: 80%    Downloading: 100%    Downloading: 100%
15-Jul-2017 17:38:38
15-Jul-2017 17:38:38   - Installing symfony/http-kernel (v3.3.2)
15-Jul-2017 17:38:39     Downloading: Connecting...    Downloading: 0%               Downloading: 5%    Downloading: 10%    Downloading: 15%    Downloading: 20%    Downloading: 25%    Downloading: 30%    Downloading: 35%    Downloading: 40%    Downloading: 45%    Downloading: 50%    Downloading: 55%    Downloading: 60%    Downloading: 65%    Downloading: 70%    Downloading: 75%    Downloading: 80%    Downloading: 85%    Downloading: 90%    Downloading: 95%    Downloading: 100%    Downloading: 100%
15-Jul-2017 17:38:39
15-Jul-2017 17:38:39   - Installing symfony/dependency-injection (v3.3.2)
15-Jul-2017 17:38:40     Downloading: Connecting...    Downloading: 0%               Downloading: 5%    Downloading: 10%    Downloading: 15%    Downloading: 20%    Downloading: 25%    Downloading: 30%    Downloading: 35%    Downloading: 40%    Downloading: 45%    Downloading: 50%    Downloading: 55%    Downloading: 60%    Downloading: 65%    Downloading: 70%    Downloading: 75%    Downloading: 80%    Downloading: 85%    Downloading: 90%    Downloading: 95%    Downloading: 100%    Downloading: 100%
15-Jul-2017 17:38:40
15-Jul-2017 17:38:40   - Installing zendframework/zend-eventmanager (3.0.1)
15-Jul-2017 17:38:40     Downloading: Connecting...    Downloading: 100%         
15-Jul-2017 17:38:40
15-Jul-2017 17:38:40   - Installing zendframework/zend-code (2.6.3)
15-Jul-2017 17:38:41     Downloading: Connecting...    Downloading: 100%         
15-Jul-2017 17:38:41
15-Jul-2017 17:38:41   - Installing ocramius/proxy-manager (1.0.2)
15-Jul-2017 17:38:42     Downloading: Connecting...    Downloading: 0%               Downloading: 5%    Downloading: 10%    Downloading: 15%    Downloading: 20%    Downloading: 25%    Downloading: 30%    Downloading: 35%    Downloading: 40%    Downloading: 45%    Downloading: 50%    Downloading: 55%    Downloading: 60%    Downloading: 65%    Downloading: 70%    Downloading: 75%    Downloading: 80%    Downloading: 85%    Downloading: 90%    Downloading: 95%    Downloading: 100%    Downloading: 100%
15-Jul-2017 17:38:42
15-Jul-2017 17:38:42   - Installing symfony/proxy-manager-bridge (v3.3.2)
15-Jul-2017 17:38:42     Downloading: Connecting...    Downloading: 100%         
15-Jul-2017 17:38:42
15-Jul-2017 17:38:42   - Installing symfony/routing (v3.3.2)
15-Jul-2017 17:38:43     Downloading: Connecting...    Downloading: 0%               Downloading: 5%    Downloading: 10%    Downloading: 15%    Downloading: 20%    Downloading: 25%    Downloading: 30%    Downloading: 35%    Downloading: 40%    Downloading: 45%    Downloading: 50%    Downloading: 55%    Downloading: 60%    Downloading: 65%    Downloading: 70%    Downloading: 75%    Downloading: 80%    Downloading: 85%    Downloading: 90%    Downloading: 95%    Downloading: 100%    Downloading: 100%
15-Jul-2017 17:38:43
15-Jul-2017 17:38:43   - Installing twig/twig (v1.34.3)
15-Jul-2017 17:38:44     Downloading: Connecting...    Downloading: 0%               Downloading: 5%    Downloading: 10%    Downloading: 15%    Downloading: 20%    Downloading: 25%    Downloading: 30%    Downloading: 35%    Downloading: 40%    Downloading: 50%    Downloading: 55%    Downloading: 60%    Downloading: 65%    Downloading: 70%    Downloading: 75%    Downloading: 80%    Downloading: 85%    Downloading: 95%    Downloading: 100%    Downloading: 100%
15-Jul-2017 17:38:44
15-Jul-2017 17:38:44   - Installing symfony/twig-bridge (v3.3.2)
15-Jul-2017 17:38:44     Downloading: Connecting...    Downloading: 100%         
15-Jul-2017 17:38:44
15-Jul-2017 17:38:44   - Installing symfony/dom-crawler (v3.3.2)
15-Jul-2017 17:38:45     Downloading: Connecting...    Downloading: 0%               Downloading: 25%    Downloading: 30%    Downloading: 50%    Downloading: 60%    Downloading: 65%    Downloading: 75%    Downloading: 100%    Downloading: 100%
15-Jul-2017 17:38:45
15-Jul-2017 17:38:45   - Installing symfony/css-selector (v3.3.2)
15-Jul-2017 17:38:45     Downloading: Connecting...    Downloading: 0%               Downloading: 5%    Downloading: 10%    Downloading: 15%    Downloading: 20%    Downloading: 25%    Downloading: 30%    Downloading: 35%    Downloading: 40%    Downloading: 50%    Downloading: 55%    Downloading: 60%    Downloading: 65%    Downloading: 70%    Downloading: 75%    Downloading: 80%    Downloading: 85%    Downloading: 90%    Downloading: 95%    Downloading: 100%    Downloading: 100%
15-Jul-2017 17:38:46
15-Jul-2017 17:38:46   - Installing symfony/browser-kit (v3.3.2)
15-Jul-2017 17:38:46     Downloading: Connecting...    Downloading: 100%         
15-Jul-2017 17:38:46
15-Jul-2017 17:38:46   - Installing guzzlehttp/guzzle (6.2.3)
15-Jul-2017 17:38:46     Downloading: Connecting...    Downloading: 0%               Downloading: 5%    Downloading: 10%    Downloading: 15%    Downloading: 25%    Downloading: 30%    Downloading: 35%    Downloading: 40%    Downloading: 45%    Downloading: 55%    Downloading: 65%    Downloading: 70%    Downloading: 80%    Downloading: 85%    Downloading: 95%    Downloading: 100%    Downloading: 100%
15-Jul-2017 17:38:46
15-Jul-2017 17:38:46   - Installing fabpot/goutte (v3.2.1)
15-Jul-2017 17:38:47     Downloading: Connecting...    Downloading: 0%               Downloading: 70%    Downloading: 100%    Downloading: 100%
15-Jul-2017 17:38:47
15-Jul-2017 17:38:47   - Installing facebook/webdriver (1.3.0)
15-Jul-2017 17:38:47     Downloading: Connecting...    Downloading: 100%         
15-Jul-2017 17:38:47
15-Jul-2017 17:38:47   - Installing laravel/homestead (v4.0.5)
15-Jul-2017 17:38:48     Downloading: Connecting...    Downloading: 100%         
15-Jul-2017 17:38:48
15-Jul-2017 17:38:48   - Installing phing/phing (2.4.14)
15-Jul-2017 17:38:49     Downloading: Connecting...    Downloading: 0%               Downloading: 5%    Downloading: 10%    Downloading: 15%    Downloading: 20%    Downloading: 25%    Downloading: 30%    Downloading: 35%    Downloading: 40%    Downloading: 45%    Downloading: 50%    Downloading: 55%    Downloading: 60%    Downloading: 65%    Downloading: 70%    Downloading: 75%    Downloading: 80%    Downloading: 85%    Downloading: 90%    Downloading: 95%    Downloading: 100%    Downloading: 100%
15-Jul-2017 17:38:49
15-Jul-2017 17:38:49   - Installing webmozart/assert (1.2.0)
15-Jul-2017 17:38:50     Downloading: Connecting...    Downloading: 0%               Downloading: 55%    Downloading: 60%    Downloading: 100%    Downloading: 100%
15-Jul-2017 17:38:50
15-Jul-2017 17:38:50   - Installing phpdocumentor/reflection-common (1.0)
15-Jul-2017 17:38:50     Downloading: Connecting...    Downloading: 0%               Downloading: 65%    Downloading: 100%    Downloading: 100%
15-Jul-2017 17:38:50
15-Jul-2017 17:38:50   - Installing phpdocumentor/type-resolver (0.2.1)
15-Jul-2017 17:38:51     Downloading: Connecting...    Downloading: 0%               Downloading: 20%    Downloading: 35%    Downloading: 55%    Downloading: 75%    Downloading: 100%
15-Jul-2017 17:38:51
15-Jul-2017 17:38:51   - Installing phpdocumentor/reflection-docblock (3.1.1)
15-Jul-2017 17:38:51     Downloading: Connecting...    Downloading: 0%               Downloading: 5%    Downloading: 15%    Downloading: 20%    Downloading: 25%    Downloading: 30%    Downloading: 35%    Downloading: 45%    Downloading: 50%    Downloading: 55%    Downloading: 65%    Downloading: 70%    Downloading: 75%    Downloading: 80%    Downloading: 90%    Downloading: 95%    Downloading: 100%    Downloading: 100%
15-Jul-2017 17:38:51
15-Jul-2017 17:38:51   - Installing symfony/yaml (v3.3.2)
15-Jul-2017 17:38:52     Downloading: Connecting...    Downloading: 0%               Downloading: 5%    Downloading: 10%    Downloading: 35%    Downloading: 60%    Downloading: 65%    Downloading: 70%    Downloading: 75%    Downloading: 80%    Downloading: 85%    Downloading: 100%    Downloading: 100%
15-Jul-2017 17:38:52
15-Jul-2017 17:38:52   - Installing sebastian/version (1.0.6)
15-Jul-2017 17:38:52     Downloading: Connecting...    Downloading: 0%               Downloading: 100%    Downloading: 100%
15-Jul-2017 17:38:52
15-Jul-2017 17:38:52   - Installing sebastian/global-state (1.1.1)
15-Jul-2017 17:38:53     Downloading: Connecting...    Downloading: 0%               Downloading: 40%    Downloading: 85%    Downloading: 100%    Downloading: 100%
15-Jul-2017 17:38:53
15-Jul-2017 17:38:53   - Installing sebastian/recursion-context (1.0.5)
15-Jul-2017 17:38:53     Downloading: Connecting...    Downloading: 0%               Downloading: 35%    Downloading: 70%    Downloading: 100%    Downloading: 100%
15-Jul-2017 17:38:53
15-Jul-2017 17:38:53   - Installing sebastian/exporter (1.2.2)
15-Jul-2017 17:38:54     Downloading: Connecting...    Downloading: 0%               Downloading: 100%    Downloading: 100%
15-Jul-2017 17:38:54
15-Jul-2017 17:38:54   - Installing sebastian/environment (1.3.8)
15-Jul-2017 17:38:54     Downloading: Connecting...    Downloading: 0%               Downloading: 15%    Downloading: 30%    Downloading: 45%    Downloading: 60%    Downloading: 75%    Downloading: 100%    Downloading: 100%
15-Jul-2017 17:38:54
15-Jul-2017 17:38:54   - Installing sebastian/diff (1.4.3)
15-Jul-2017 17:38:55     Downloading: Connecting...    Downloading: 0%               Downloading: 35%    Downloading: 40%    Downloading: 75%    Downloading: 100%    Downloading: 100%
15-Jul-2017 17:38:55
15-Jul-2017 17:38:55   - Installing sebastian/comparator (1.2.4)
15-Jul-2017 17:38:55     Downloading: Connecting...    Downloading: 0%               Downloading: 10%    Downloading: 70%    Downloading: 80%    Downloading: 90%    Downloading: 100%    Downloading: 100%
15-Jul-2017 17:38:55
15-Jul-2017 17:38:55   - Installing phpunit/php-text-template (1.2.1)
15-Jul-2017 17:38:56     Downloading: Connecting...    Downloading: 0%               Downloading: 35%    Downloading: 100%    Downloading: 100%
15-Jul-2017 17:38:56
15-Jul-2017 17:38:56   - Installing doctrine/instantiator (1.0.5)
15-Jul-2017 17:38:56     Downloading: Connecting...    Downloading: 0%               Downloading: 15%    Downloading: 30%    Downloading: 45%    Downloading: 60%    Downloading: 85%    Downloading: 100%    Downloading: 100%
15-Jul-2017 17:38:56
15-Jul-2017 17:38:56   - Installing phpunit/phpunit-mock-objects (2.3.8)
15-Jul-2017 17:38:57     Downloading: Connecting...    Downloading: 0%               Downloading: 5%    Downloading: 20%    Downloading: 25%    Downloading: 35%    Downloading: 40%    Downloading: 45%    Downloading: 50%    Downloading: 60%    Downloading: 65%    Downloading: 70%    Downloading: 75%    Downloading: 90%    Downloading: 95%    Downloading: 100%    Downloading: 100%
15-Jul-2017 17:38:57
15-Jul-2017 17:38:57   - Installing phpunit/php-timer (1.0.9)
15-Jul-2017 17:38:58     Downloading: Connecting...    Downloading: 0%               Downloading: 45%    Downloading: 90%    Downloading: 100%    Downloading: 100%
15-Jul-2017 17:38:58
15-Jul-2017 17:38:58   - Installing phpunit/php-file-iterator (1.4.2)
15-Jul-2017 17:38:58     Downloading: Connecting...    Downloading: 0%               Downloading: 20%    Downloading: 40%    Downloading: 60%    Downloading: 100%    Downloading: 100%
15-Jul-2017 17:38:58
15-Jul-2017 17:38:58   - Installing phpunit/php-token-stream (1.4.11)
15-Jul-2017 17:38:59     Downloading: Connecting...    Downloading: 0%               Downloading: 5%    Downloading: 10%    Downloading: 15%    Downloading: 20%    Downloading: 65%    Downloading: 70%    Downloading: 75%    Downloading: 80%    Downloading: 85%    Downloading: 90%    Downloading: 95%    Downloading: 100%    Downloading: 100%
15-Jul-2017 17:38:59
15-Jul-2017 17:38:59   - Installing phpunit/php-code-coverage (2.2.4)
15-Jul-2017 17:38:59     Downloading: Connecting...    Downloading: 0%               Downloading: 5%    Downloading: 10%    Downloading: 15%    Downloading: 20%    Downloading: 25%    Downloading: 30%    Downloading: 35%    Downloading: 40%    Downloading: 45%    Downloading: 50%    Downloading: 55%    Downloading: 60%    Downloading: 65%    Downloading: 70%    Downloading: 75%    Downloading: 80%    Downloading: 85%    Downloading: 90%    Downloading: 95%    Downloading: 100%    Downloading: 100%
15-Jul-2017 17:38:59
15-Jul-2017 17:38:59   - Installing phpspec/prophecy (v1.7.0)
15-Jul-2017 17:39:00     Downloading: Connecting...    Downloading: 0%               Downloading: 5%    Downloading: 10%    Downloading: 15%    Downloading: 20%    Downloading: 25%    Downloading: 30%    Downloading: 35%    Downloading: 40%    Downloading: 45%    Downloading: 50%    Downloading: 55%    Downloading: 60%    Downloading: 65%    Downloading: 70%    Downloading: 75%    Downloading: 80%    Downloading: 85%    Downloading: 90%    Downloading: 95%    Downloading: 100%    Downloading: 100%
15-Jul-2017 17:39:00
15-Jul-2017 17:39:00   - Installing phpunit/phpunit (4.8.35)
15-Jul-2017 17:39:01     Downloading: Connecting...    Downloading: 0%               Downloading: 5%    Downloading: 10%    Downloading: 15%    Downloading: 20%    Downloading: 25%    Downloading: 30%    Downloading: 35%    Downloading: 40%    Downloading: 45%    Downloading: 50%    Downloading: 55%    Downloading: 60%    Downloading: 65%    Downloading: 70%    Downloading: 75%    Downloading: 85%    Downloading: 95%    Downloading: 100%    Downloading: 100%
15-Jul-2017 17:39:01
15-Jul-2017 17:39:01   - Installing phpunit/dbunit (2.0.3)
15-Jul-2017 17:39:01     Downloading: Connecting...    Downloading: 100%         
15-Jul-2017 17:39:01
15-Jul-2017 17:39:01   - Installing squizlabs/php_codesniffer (2.9.1)
15-Jul-2017 17:39:02     Downloading: Connecting...    Downloading: 0%               Downloading: 5%    Downloading: 10%    Downloading: 15%    Downloading: 20%    Downloading: 25%    Downloading: 30%    Downloading: 35%    Downloading: 40%    Downloading: 45%    Downloading: 50%    Downloading: 55%    Downloading: 60%    Downloading: 65%    Downloading: 70%    Downloading: 75%    Downloading: 80%    Downloading: 85%    Downloading: 90%    Downloading: 100%    Downloading: 100%
15-Jul-2017 17:39:02
15-Jul-2017 17:39:03 lusitanian/oauth suggests installing predis/predis (Allows using the Redis storage backend.)
15-Jul-2017 17:39:03 paragonie/random_compat suggests installing ext-libsodium (Provides a modern crypto API that can be used to generate random bytes.)
15-Jul-2017 17:39:03 patchwork/utf8 suggests installing ext-intl (Use Intl for best performance)
15-Jul-2017 17:39:03 patchwork/utf8 suggests installing ext-wfio (Use WFIO for UTF-8 filesystem access on Windows)
15-Jul-2017 17:39:03 s9e/text-formatter suggests installing ext-intl (Allows international URLs to be accepted by the URL filter)
15-Jul-2017 17:39:03 s9e/text-formatter suggests installing ext-xsl (Enables the XSLT renderer)
15-Jul-2017 17:39:03 symfony/http-kernel suggests installing symfony/class-loader ()
15-Jul-2017 17:39:03 symfony/http-kernel suggests installing symfony/var-dumper ()
15-Jul-2017 17:39:03 symfony/dependency-injection suggests installing symfony/expression-language (For using expressions in service container configuration)
15-Jul-2017 17:39:03 zendframework/zend-eventmanager suggests installing container-interop/container-interop (^1.1.0, to use the lazy listeners feature)
15-Jul-2017 17:39:03 zendframework/zend-eventmanager suggests installing zendframework/zend-stdlib (^2.7.3 || ^3.0, to use the FilterChain feature)
15-Jul-2017 17:39:03 zendframework/zend-code suggests installing doctrine/annotations (Doctrine\Common\Annotations >=1.0 for annotation features)
15-Jul-2017 17:39:03 zendframework/zend-code suggests installing zendframework/zend-stdlib (Zend\Stdlib component)
15-Jul-2017 17:39:03 ocramius/proxy-manager suggests installing ocramius/generated-hydrator (To have very fast object to array to object conversion for ghost objects)
15-Jul-2017 17:39:03 ocramius/proxy-manager suggests installing zendframework/zend-json (To have the JsonRpc adapter (Remote Object feature))
15-Jul-2017 17:39:03 ocramius/proxy-manager suggests installing zendframework/zend-soap (To have the Soap adapter (Remote Object feature))
15-Jul-2017 17:39:03 ocramius/proxy-manager suggests installing zendframework/zend-stdlib (To use the hydrator proxy)
15-Jul-2017 17:39:03 ocramius/proxy-manager suggests installing zendframework/zend-xmlrpc (To have the XmlRpc adapter (Remote Object feature))
15-Jul-2017 17:39:03 symfony/routing suggests installing doctrine/annotations (For using the annotation loader)
15-Jul-2017 17:39:03 symfony/routing suggests installing symfony/expression-language (For using expression matching)
15-Jul-2017 17:39:03 symfony/twig-bridge suggests installing symfony/asset (For using the AssetExtension)
15-Jul-2017 17:39:03 symfony/twig-bridge suggests installing symfony/expression-language (For using the ExpressionExtension)
15-Jul-2017 17:39:03 symfony/twig-bridge suggests installing symfony/form (For using the FormExtension)
15-Jul-2017 17:39:03 symfony/twig-bridge suggests installing symfony/security (For using the SecurityExtension)
15-Jul-2017 17:39:03 symfony/twig-bridge suggests installing symfony/stopwatch (For using the StopwatchExtension)
15-Jul-2017 17:39:03 symfony/twig-bridge suggests installing symfony/templating (For using the TwigEngine)
15-Jul-2017 17:39:03 symfony/twig-bridge suggests installing symfony/translation (For using the TranslationExtension)
15-Jul-2017 17:39:03 symfony/twig-bridge suggests installing symfony/var-dumper (For using the DumpExtension)
15-Jul-2017 17:39:03 symfony/twig-bridge suggests installing symfony/web-link (For using the WebLinkExtension)
15-Jul-2017 17:39:03 facebook/webdriver suggests installing phpdocumentor/phpdocumentor (2.*)
15-Jul-2017 17:39:03 sebastian/global-state suggests installing ext-uopz (*)
15-Jul-2017 17:39:03 phpunit/phpunit-mock-objects suggests installing ext-soap (*)
15-Jul-2017 17:39:03 phpunit/phpunit suggests installing phpunit/php-invoker (~1.1)
15-Jul-2017 17:39:03 Generating autoload files
15-Jul-2017 17:39:04 Buildfile: /data/build/build.xml
15-Jul-2017 17:39:04
15-Jul-2017 17:39:04 phpBB > clean:
15-Jul-2017 17:39:04
15-Jul-2017 17:39:04    [delete] Directory /data/build/logs does not exist or is not a directory.
15-Jul-2017 17:39:04    [delete] Directory /data/build/api does not exist or is not a directory.
15-Jul-2017 17:39:04    [delete] Directory /data/build/codebrowser does not exist or is not a directory.
15-Jul-2017 17:39:04    [delete] Directory /data/build/coverage does not exist or is not a directory.
15-Jul-2017 17:39:04    [delete] Directory /data/build/cpd does not exist or is not a directory.
15-Jul-2017 17:39:04    [delete] Directory /data/build/dependencies does not exist or is not a directory.
15-Jul-2017 17:39:04    [delete] Directory /data/build/new_version does not exist or is not a directory.
15-Jul-2017 17:39:04    [delete] Directory /data/build/old_versions does not exist or is not a directory.
15-Jul-2017 17:39:04    [delete] Directory /data/build/save does not exist or is not a directory.
15-Jul-2017 17:39:04
15-Jul-2017 17:39:04 phpBB > prepare:
15-Jul-2017 17:39:04
15-Jul-2017 17:39:04     [mkdir] Created dir: /data/build/logs
15-Jul-2017 17:39:04     [mkdir] Created dir: /data/build/api
15-Jul-2017 17:39:04     [mkdir] Created dir: /data/build/codebrowser
15-Jul-2017 17:39:04     [mkdir] Created dir: /data/build/coverage
15-Jul-2017 17:39:04     [mkdir] Created dir: /data/build/cpd
15-Jul-2017 17:39:04     [mkdir] Created dir: /data/build/dependencies
15-Jul-2017 17:39:04     [mkdir] Created dir: /data/build/new_version
15-Jul-2017 17:39:04     [mkdir] Created dir: /data/build/new_version/files
15-Jul-2017 17:39:04     [mkdir] Created dir: /data/build/new_version/patches
15-Jul-2017 17:39:04     [mkdir] Created dir: /data/build/new_version/release_files
15-Jul-2017 17:39:04     [mkdir] Created dir: /data/build/new_version/update
15-Jul-2017 17:39:04     [mkdir] Created dir: /data/build/old_versions
15-Jul-2017 17:39:04     [mkdir] Created dir: /data/build/save
15-Jul-2017 17:39:04
15-Jul-2017 17:39:04 BUILD FINISHED
15-Jul-2017 17:39:04
15-Jul-2017 17:39:04 Total time: 0.1238 seconds
15-Jul-2017 17:39:04
15-Jul-2017 17:39:04 Finished task 'Prepare directory' with result: Success
15-Jul-2017 17:39:04 Skipping execution of task 'Run sniffs' as it is disabled
15-Jul-2017 17:39:04
Substituting variable: ${bamboo.working.directory} with /home/bamboo/xml-data/build-dir/PHPBB3-PR-JOB1
15-Jul-2017 17:39:04 Starting task 'Run sniffs' of type 'com.atlassian.bamboo.plugins.bamboo-docker-plugin:task.docker.cli'
15-Jul-2017 17:39:04 Running image name (phpbb:php-5.6)
15-Jul-2017 17:39:04
Beginning to execute external process for build 'phpBB3 - Pull Requests - Build and Test Job #7335 (PHPBB3-PR-JOB1-7335)'
... running command line:
/usr/bin/docker run --volume /home/bamboo/xml-data/build-dir/PHPBB3-PR-JOB1:/data --workdir /data/build --rm -u=991 phpbb:php-5.6 ../phpBB/vendor/bin/phing sniff
... in: /home/bamboo/xml-data/build-dir/PHPBB3-PR-JOB1
... using extra environment variables:
bamboo_planRepository_1_branch=3.1.x
bamboo_planRepository_1_branchDisplayName=3.1.x
bamboo_repository_revision_number=50d2e337b02e8bdec80ed0672cf2e1fe384b6f3e
bamboo_PRref=master
bamboo_resultsUrl=https://bamboo.phpbb.com/browse/PHPBB3-PR-JOB1-7335
bamboo_capability_system_builder_command_Git=/usr/bin/git
bamboo_repository_75956235_git_username=bantu
bamboo_planRepository_1_name=phpBB Ascraeus
bamboo_build_working_directory=/home/bamboo/xml-data/build-dir/PHPBB3-PR-JOB1
bamboo_buildKey=PHPBB3-PR-JOB1
bamboo_capability_phpbb_tests=true
bamboo_shortPlanName=Pull Requests
bamboo_capability_system_builder_command_fop=/usr/bin/fop
bamboo_capability_dbms_sqlite_2=true
bamboo_planRepository_name=phpBB Ascraeus
bamboo_PRnumber=4789
bamboo_buildNumber=7335
bamboo_repository_75956235_git_repositoryUrl=https://github.com/phpbb/phpbb.git
bamboo_capability_system_builder_phpunit_PHPUnit=/usr/bin/phpunit
bamboo_shortJobName=Build and Test Job
bamboo_buildResultsUrl=https://bamboo.phpbb.com/browse/PHPBB3-PR-JOB1-7335
bamboo_repository_75956235_branch_name=3.1.x
bamboo_planRepository_repositoryUrl=https://github.com/phpbb/phpbb.git
bamboo_agentId=131073
bamboo_planName=phpBB3 - Pull Requests
bamboo_build_commandline_com_atlassian_bamboo_plugins_scripttask_task_builder_script_7=/bin/sh /home/bamboo/temp/PHPBB3-PR-JOB1-7335-ScriptBuildTask-7312899095792867455.sh
bamboo_shortPlanKey=PR
bamboo_shortJobKey=JOB1
bamboo_capability_dbms_mysql_55=true
bamboo_capability_system_jdk_JDK_1_7_0_65=/usr/lib/jvm/java-7-openjdk-amd64
bamboo_planRepository_revision=50d2e337b02e8bdec80ed0672cf2e1fe384b6f3e
bamboo_repository_previous_revision_number=50d2e337b02e8bdec80ed0672cf2e1fe384b6f3e
bamboo_buildTimeStamp=2017-07-15T17:38:15.640Z
bamboo_planRepository_previousRevision=50d2e337b02e8bdec80ed0672cf2e1fe384b6f3e
bamboo_capability_system_builder_mvn2_Maven_2=/usr/share/maven2
bamboo_capability_system_jdk_JDK_1_6_0_16=/usr/lib/jvm/java-6-sun-1.6.0.16
bamboo_build_commandline_com_atlassian_bamboo_plugins_scripttask_task_builder_script_4=/bin/sh /home/bamboo/temp/PHPBB3-PR-JOB1-7335-ScriptBuildTask-6256468304288650707.sh
bamboo_buildResultKey=PHPBB3-PR-JOB1-7335
bamboo_repository_git_branch=3.1.x
bamboo_repository_branch_name=3.1.x
bamboo_buildPlanName=phpBB3 - Pull Requests - Build and Test Job
bamboo_planRepository_1_revision=50d2e337b02e8bdec80ed0672cf2e1fe384b6f3e
bamboo_repository_name=phpBB Ascraeus
bamboo_buildFailed=false
bamboo_capability_system_docker_executable=/usr/bin/docker
bamboo_build_commandline_com_atlassian_bamboo_plugins_bamboo_docker_plugin_task_docker_cli_12=/usr/bin/docker run --volume /home/bamboo/xml-data/build-dir/PHPBB3-PR-JOB1:/data --workdir /data/phpBB --rm -e HOME=/home/bamboo -u=991 phpbb:php-5.6 /bin/bash -c php ../composer.phar install --dev; cd ../build; ../phpBB/vendor/bin/phing clean prepare
bamboo_planRepository_branch=3.1.x
bamboo_agentWorkingDirectory=/home/bamboo/xml-data/build-dir
bamboo_capability_system_git_executable=/usr/bin/git
bamboo_planRepository_1_previousRevision=50d2e337b02e8bdec80ed0672cf2e1fe384b6f3e
bamboo_capability_system_builder_phpunit_PHPUnit_3_4=/usr/bin/phpunit
bamboo_repository_git_username=bantu
bamboo_repository_75956235_revision_number=50d2e337b02e8bdec80ed0672cf2e1fe384b6f3e
bamboo_planRepository_branchDisplayName=3.1.x
bamboo_planRepository_1_type=gitv2
bamboo_planRepository_branchName=3.1.x
bamboo_repository_75956235_previous_revision_number=50d2e337b02e8bdec80ed0672cf2e1fe384b6f3e
bamboo_capability_system_jdk_JDK=/usr/lib/jvm/java-6-sun
bamboo_plan_storageTag=PHPBB3-PR
bamboo_planRepository_type=gitv2
bamboo_planRepository_1_username=bantu
bamboo_ManualBuildTriggerReason_userName=Build Robot
bamboo_repository_git_repositoryUrl=https://github.com/phpbb/phpbb.git
bamboo_repository_75956235_git_branch=3.1.x
bamboo_capability_system_builder_ant_Ant=/usr/share/ant
bamboo_repository_75956235_name=phpBB Ascraeus
bamboo_working_directory=/home/bamboo/xml-data/build-dir/PHPBB3-PR-JOB1
bamboo_planKey=PHPBB3-PR
bamboo_planRepository_1_repositoryUrl=https://github.com/phpbb/phpbb.git
bamboo_planRepository_username=bantu
bamboo_capability_local=true
bamboo_capability_system_jdk_JDK_1_6=/usr/lib/jvm/java-6-sun
bamboo_capability_system_jdk_JDK_1_7=/usr/lib/jvm/java-7-openjdk-amd64
bamboo_planRepository_1_branchName=3.1.x
15-Jul-2017 17:39:04 Buildfile: /data/build/build.xml
15-Jul-2017 17:39:05
15-Jul-2017 17:39:05 phpBB > sniff:
15-Jul-2017 17:39:05
15-Jul-2017 17:39:14 ............................................................  60 / 723 (8%)
15-Jul-2017 17:39:15 ............................................................ 120 / 723 (17%)
15-Jul-2017 17:39:16 ............................................................ 180 / 723 (25%)
15-Jul-2017 17:39:17 ............................................................ 240 / 723 (33%)
15-Jul-2017 17:39:22 .............................................E.E............ 300 / 723 (41%)
15-Jul-2017 17:39:28 ............................................................ 360 / 723 (50%)
15-Jul-2017 17:39:35 ............................................................ 420 / 723 (58%)
15-Jul-2017 17:39:40 ............................................................ 480 / 723 (66%)
15-Jul-2017 17:39:44 ............................................................ 540 / 723 (75%)
15-Jul-2017 17:39:48 ............................................................ 600 / 723 (83%)
15-Jul-2017 17:39:53 ............................................................ 660 / 723 (91%)
15-Jul-2017 17:39:57 .................................E.......................... 720 / 723 (100%)
15-Jul-2017 17:39:57 ...
15-Jul-2017 17:39:57
15-Jul-2017 17:39:57
15-Jul-2017 17:39:57 FILE: /data/phpBB/phpbb/console/command/style/install.php
15-Jul-2017 17:39:57 ----------------------------------------------------------------------
15-Jul-2017 17:39:57 FOUND 1 ERROR AFFECTING 1 LINE
15-Jul-2017 17:39:57 ----------------------------------------------------------------------
15-Jul-2017 17:39:57 16 | ERROR | There must not be unused USE statements.
15-Jul-2017 17:39:57     |       | (phpbb.Namespaces.UnusedUse.Unused)
15-Jul-2017 17:39:57 ----------------------------------------------------------------------
15-Jul-2017 17:39:57
15-Jul-2017 17:39:57
15-Jul-2017 17:39:57 FILE: /data/phpBB/phpbb/console/command/style/uninstall.php
15-Jul-2017 17:39:57 ----------------------------------------------------------------------
15-Jul-2017 17:39:57 FOUND 1 ERROR AFFECTING 1 LINE
15-Jul-2017 17:39:57 ----------------------------------------------------------------------
15-Jul-2017 17:39:57 45 | ERROR | [x] Functions must not contain multiple empty lines in a
15-Jul-2017 17:39:57     |       |     row; found 2 empty lines
15-Jul-2017 17:39:57     |       |     (Squiz.WhiteSpace.SuperfluousWhitespace.EmptyLines)
15-Jul-2017 17:39:57 ----------------------------------------------------------------------
15-Jul-2017 17:39:57 PHPCBF CAN FIX THE 1 MARKED SNIFF VIOLATIONS AUTOMATICALLY
15-Jul-2017 17:39:57 ----------------------------------------------------------------------
15-Jul-2017 17:39:57
15-Jul-2017 17:39:57
15-Jul-2017 17:39:57 FILE: /data/phpBB/phpbb/style/manager.php
15-Jul-2017 17:39:57 ----------------------------------------------------------------------
15-Jul-2017 17:39:57 FOUND 3 ERRORS AFFECTING 3 LINES
15-Jul-2017 17:39:57 ----------------------------------------------------------------------
15-Jul-2017 17:39:57 198 | ERROR | There should be exactly one space between the keyword and
15-Jul-2017 17:39:57      |       | opening parenthesis
15-Jul-2017 17:39:57      |       | (phpbb.ControlStructures.OpeningParenthesis.NoSpaceBeforeOpeningParenthesis)
15-Jul-2017 17:39:57 234 | ERROR | There should be exactly one space between the keyword and
15-Jul-2017 17:39:57      |       | opening parenthesis
15-Jul-2017 17:39:57      |       | (phpbb.ControlStructures.OpeningParenthesis.NoSpaceBeforeOpeningParenthesis)
15-Jul-2017 17:39:57 254 | ERROR | There should be exactly one space between the keyword and
15-Jul-2017 17:39:57      |       | opening parenthesis
15-Jul-2017 17:39:57      |       | (phpbb.ControlStructures.OpeningParenthesis.NoSpaceBeforeOpeningParenthesis)
15-Jul-2017 17:39:57 ----------------------------------------------------------------------
15-Jul-2017 17:39:57
15-Jul-2017 17:39:57 Time: 52.17 secs; Memory: 62.75Mb
15-Jul-2017 17:39:57
15-Jul-2017 17:40:07 ............................................................  60 / 206 (29%)
15-Jul-2017 17:40:30 ............................................................ 120 / 206 (58%)
15-Jul-2017 17:40:46 ............................................................ 180 / 206 (87%)
15-Jul-2017 17:40:54 ..........................
15-Jul-2017 17:40:54
15-Jul-2017 17:40:54 Time: 56.99 secs; Memory: 60.5Mb
15-Jul-2017 17:40:54
15-Jul-2017 17:40:54
15-Jul-2017 17:40:54
15-Jul-2017 17:40:54 Time: 17ms; Memory: 3.5Mb
15-Jul-2017 17:40:54
15-Jul-2017 17:40:54        [if] Error in IfTask
15-Jul-2017 17:40:54 Execution of target "sniff" failed for the following reason: /data/build/build.xml:109:6: /data/build/build.xml:115:9: PHP Code Sniffer failed.
15-Jul-2017 17:40:54
15-Jul-2017 17:40:54 BUILD FAILED
15-Jul-2017 17:40:54 /data/build/build.xml:109:6: /data/build/build.xml:115:9: PHP Code Sniffer failed.
15-Jul-2017 17:40:54 Total time: 2 minutes  49.49 seconds
15-Jul-2017 17:40:54
15-Jul-2017 17:40:54 Failing task since return code of [/usr/bin/docker run --volume /home/bamboo/xml-data/build-dir/PHPBB3-PR-JOB1:/data --workdir /data/build --rm -u=991 phpbb:php-5.6 ../phpBB/vendor/bin/phing sniff] was 1 while expected 0
15-Jul-2017 17:40:54 Error occurred while running Task 'Run sniffs(11)' of type com.atlassian.bamboo.plugins.bamboo-docker-plugin:task.docker.cli.
15-Jul-2017 17:40:54 com.atlassian.bamboo.task.TaskException: Failed to execute task
15-Jul-2017 17:40:54         at com.atlassian.bamboo.plugins.docker.service.RunService.execute(RunService.java:71)
15-Jul-2017 17:40:54         at com.atlassian.bamboo.plugins.docker.tasks.cli.DockerCliTask.execute(DockerCliTask.java:64)
15-Jul-2017 17:40:54         at com.atlassian.bamboo.task.TaskExecutorImpl.lambda$executeTasks$3(TaskExecutorImpl.java:284)
15-Jul-2017 17:40:54         at com.atlassian.bamboo.task.TaskExecutorImpl.executeTaskWithPrePostActions(TaskExecutorImpl.java:223)
15-Jul-2017 17:40:54         at com.atlassian.bamboo.task.TaskExecutorImpl.executeTasks(TaskExecutorImpl.java:284)
15-Jul-2017 17:40:54         at com.atlassian.bamboo.task.TaskExecutorImpl.execute(TaskExecutorImpl.java:111)
15-Jul-2017 17:40:54         at com.atlassian.bamboo.build.pipeline.tasks.ExecuteBuildTask.call(ExecuteBuildTask.java:69)
15-Jul-2017 17:40:54         at com.atlassian.bamboo.v2.build.agent.DefaultBuildAgent.build(DefaultBuildAgent.java:185)
15-Jul-2017 17:40:54         at com.atlassian.bamboo.v2.build.agent.BuildAgentControllerImpl$1.call(BuildAgentControllerImpl.java:122)
15-Jul-2017 17:40:54         at com.atlassian.bamboo.v2.build.agent.BuildAgentControllerImpl$1.call(BuildAgentControllerImpl.java:115)
15-Jul-2017 17:40:54         at com.atlassian.bamboo.variable.CustomVariableContextImpl.withVariableSubstitutor(CustomVariableContextImpl.java:185)
15-Jul-2017 17:40:54         at com.atlassian.bamboo.v2.build.agent.BuildAgentControllerImpl.waitAndPerformBuild(BuildAgentControllerImpl.java:115)
15-Jul-2017 17:40:54         at com.atlassian.bamboo.v2.build.agent.DefaultBuildAgent$1.run(DefaultBuildAgent.java:126)
15-Jul-2017 17:40:54         at com.atlassian.bamboo.utils.BambooRunnables$1.run(BambooRunnables.java:47)
15-Jul-2017 17:40:54         at com.atlassian.bamboo.security.ImpersonationHelper.runWith(ImpersonationHelper.java:26)
15-Jul-2017 17:40:54         at com.atlassian.bamboo.security.ImpersonationHelper.runWithSystemAuthority(ImpersonationHelper.java:17)
15-Jul-2017 17:40:54         at com.atlassian.bamboo.security.ImpersonationHelper$1.run(ImpersonationHelper.java:41)
15-Jul-2017 17:40:54         at java.lang.Thread.run(Thread.java:748)
15-Jul-2017 17:40:54 Caused by: com.atlassian.bamboo.plugins.docker.client.DockerException: Error running Docker run command
15-Jul-2017 17:40:54         at com.atlassian.bamboo.plugins.docker.client.DockerCmd.run(DockerCmd.java:103)
15-Jul-2017 17:40:54         at com.atlassian.bamboo.plugins.docker.service.RunService.execute(RunService.java:60)
15-Jul-2017 17:40:54         ... 17 more
15-Jul-2017 17:40:54 Caused by: com.atlassian.utils.process.ProcessException: Error executing /usr/bin/docker run --volume /home/bamboo/xml-data/build-dir/PHPBB3-PR-JOB1:/data --workdir /data/build --rm -u=991 phpbb:php-5.6 ../phpBB/vendor/bin/phing sniff
15-Jul-2017 17:40:54         at com.atlassian.bamboo.plugins.docker.process.DockerTaskProcessService.execute(DockerTaskProcessService.java:60)
15-Jul-2017 17:40:54         at com.atlassian.bamboo.plugins.docker.client.DockerCmd.run(DockerCmd.java:99)
15-Jul-2017 17:40:54         ... 18 more
15-Jul-2017 17:40:54 Starting task 'Parsing test results produced by script' of type 'com.atlassian.bamboo.plugins.testresultparser:task.testresultparser.junit'
15-Jul-2017 17:40:54 Parsing test results under /home/bamboo/xml-data/build-dir/PHPBB3-PR-JOB1...
15-Jul-2017 17:40:54 Failing task since test cases were expected but none were found.
15-Jul-2017 17:40:54 Finished task 'Parsing test results produced by script' with result: Failed
15-Jul-2017 17:40:54
Substituting variable: ${bamboo.PRnumber} with 4789
15-Jul-2017 17:40:54
Substituting variable: ${bamboo.buildResultsUrl} with https://bamboo.phpbb.com/browse/PHPBB3-PR-JOB1-7335
15-Jul-2017 17:40:54
Substituting variable: ${bamboo.buildResultsUrl} with https://bamboo.phpbb.com/browse/PHPBB3-PR-JOB1-7335
15-Jul-2017 17:40:54 Starting task 'Set result build status' of type 'com.atlassian.bamboo.plugins.scripttask:task.builder.script'
15-Jul-2017 17:40:54
Beginning to execute external process for build 'phpBB3 - Pull Requests - Build and Test Job #7335 (PHPBB3-PR-JOB1-7335)'
... running command line:
/bin/sh /home/bamboo/temp/PHPBB3-PR-JOB1-7335-ScriptBuildTask-7187549116413326482.sh
... in: /home/bamboo/xml-data/build-dir/PHPBB3-PR-JOB1
... using extra environment variables:
bamboo_planRepository_1_branch=3.1.x
bamboo_planRepository_1_branchDisplayName=3.1.x
bamboo_repository_revision_number=50d2e337b02e8bdec80ed0672cf2e1fe384b6f3e
bamboo_PRref=master
bamboo_resultsUrl=https://bamboo.phpbb.com/browse/PHPBB3-PR-JOB1-7335
bamboo_capability_system_builder_command_Git=/usr/bin/git
bamboo_repository_75956235_git_username=bantu
bamboo_planRepository_1_name=phpBB Ascraeus
bamboo_build_working_directory=/home/bamboo/xml-data/build-dir/PHPBB3-PR-JOB1
bamboo_buildKey=PHPBB3-PR-JOB1
bamboo_capability_phpbb_tests=true
bamboo_shortPlanName=Pull Requests
bamboo_capability_system_builder_command_fop=/usr/bin/fop
bamboo_capability_dbms_sqlite_2=true
bamboo_planRepository_name=phpBB Ascraeus
bamboo_PRnumber=4789
bamboo_buildNumber=7335
bamboo_repository_75956235_git_repositoryUrl=https://github.com/phpbb/phpbb.git
bamboo_capability_system_builder_phpunit_PHPUnit=/usr/bin/phpunit
bamboo_shortJobName=Build and Test Job
bamboo_buildResultsUrl=https://bamboo.phpbb.com/browse/PHPBB3-PR-JOB1-7335
bamboo_repository_75956235_branch_name=3.1.x
bamboo_planRepository_repositoryUrl=https://github.com/phpbb/phpbb.git
bamboo_agentId=131073
bamboo_planName=phpBB3 - Pull Requests
bamboo_build_commandline_com_atlassian_bamboo_plugins_scripttask_task_builder_script_7=/bin/sh /home/bamboo/temp/PHPBB3-PR-JOB1-7335-ScriptBuildTask-7312899095792867455.sh
bamboo_shortPlanKey=PR
bamboo_shortJobKey=JOB1
bamboo_capability_dbms_mysql_55=true
bamboo_capability_system_jdk_JDK_1_7_0_65=/usr/lib/jvm/java-7-openjdk-amd64
bamboo_planRepository_revision=50d2e337b02e8bdec80ed0672cf2e1fe384b6f3e
bamboo_repository_previous_revision_number=50d2e337b02e8bdec80ed0672cf2e1fe384b6f3e
bamboo_buildTimeStamp=2017-07-15T17:38:15.640Z
bamboo_planRepository_previousRevision=50d2e337b02e8bdec80ed0672cf2e1fe384b6f3e
bamboo_capability_system_builder_mvn2_Maven_2=/usr/share/maven2
bamboo_capability_system_jdk_JDK_1_6_0_16=/usr/lib/jvm/java-6-sun-1.6.0.16
bamboo_build_commandline_com_atlassian_bamboo_plugins_scripttask_task_builder_script_4=/bin/sh /home/bamboo/temp/PHPBB3-PR-JOB1-7335-ScriptBuildTask-6256468304288650707.sh
bamboo_buildResultKey=PHPBB3-PR-JOB1-7335
bamboo_repository_git_branch=3.1.x
bamboo_repository_branch_name=3.1.x
bamboo_buildPlanName=phpBB3 - Pull Requests - Build and Test Job
bamboo_planRepository_1_revision=50d2e337b02e8bdec80ed0672cf2e1fe384b6f3e
bamboo_repository_name=phpBB Ascraeus
bamboo_buildFailed=true
bamboo_capability_system_docker_executable=/usr/bin/docker
bamboo_build_commandline_com_atlassian_bamboo_plugins_bamboo_docker_plugin_task_docker_cli_11=/usr/bin/docker run --volume /home/bamboo/xml-data/build-dir/PHPBB3-PR-JOB1:/data --workdir /data/build --rm -u=991 phpbb:php-5.6 ../phpBB/vendor/bin/phing sniff
bamboo_build_commandline_com_atlassian_bamboo_plugins_bamboo_docker_plugin_task_docker_cli_12=/usr/bin/docker run --volume /home/bamboo/xml-data/build-dir/PHPBB3-PR-JOB1:/data --workdir /data/phpBB --rm -e HOME=/home/bamboo -u=991 phpbb:php-5.6 /bin/bash -c php ../composer.phar install --dev; cd ../build; ../phpBB/vendor/bin/phing clean prepare
bamboo_planRepository_branch=3.1.x
bamboo_jobFailed=true
bamboo_agentWorkingDirectory=/home/bamboo/xml-data/build-dir
bamboo_capability_system_git_executable=/usr/bin/git
bamboo_planRepository_1_previousRevision=50d2e337b02e8bdec80ed0672cf2e1fe384b6f3e
bamboo_capability_system_builder_phpunit_PHPUnit_3_4=/usr/bin/phpunit
bamboo_repository_git_username=bantu
bamboo_repository_75956235_revision_number=50d2e337b02e8bdec80ed0672cf2e1fe384b6f3e
bamboo_planRepository_branchDisplayName=3.1.x
bamboo_planRepository_1_type=gitv2
bamboo_planRepository_branchName=3.1.x
bamboo_repository_75956235_previous_revision_number=50d2e337b02e8bdec80ed0672cf2e1fe384b6f3e
bamboo_capability_system_jdk_JDK=/usr/lib/jvm/java-6-sun
bamboo_plan_storageTag=PHPBB3-PR
bamboo_planRepository_type=gitv2
bamboo_planRepository_1_username=bantu
bamboo_ManualBuildTriggerReason_userName=Build Robot
bamboo_repository_git_repositoryUrl=https://github.com/phpbb/phpbb.git
bamboo_repository_75956235_git_branch=3.1.x
bamboo_capability_system_builder_ant_Ant=/usr/share/ant
bamboo_repository_75956235_name=phpBB Ascraeus
bamboo_working_directory=/home/bamboo/xml-data/build-dir/PHPBB3-PR-JOB1
bamboo_planKey=PHPBB3-PR
bamboo_planRepository_1_repositoryUrl=https://github.com/phpbb/phpbb.git
bamboo_planRepository_username=bantu
bamboo_capability_local=true
bamboo_capability_system_jdk_JDK_1_6=/usr/lib/jvm/java-6-sun
bamboo_capability_system_jdk_JDK_1_7=/usr/lib/jvm/java-7-openjdk-amd64
bamboo_planRepository_1_branchName=3.1.x
15-Jul-2017 17:40:55 From https://github.com/phpbb/phpbb
15-Jul-2017 17:40:55 * branch            refs/pull/4789/head -> FETCH_HEAD
15-Jul-2017 17:40:55 grep: build/logs/phpunit.xml: No such file or directory
15-Jul-2017 17:40:55 grep: build/logs/phpunit.xml: No such file or directory
15-Jul-2017 17:40:55   % Total    % Received % Xferd  Average Speed   Time    Time     Time  Current
15-Jul-2017 17:40:55                                  Dload  Upload   Total   Spent    Left  Speed
15-Jul-2017 17:40:55
15-Jul-2017 17:40:55   0     0    0     0    0     0      0      0 --:--:-- --:--:-- --:--:--     0
15-Jul-2017 17:40:55 100   273  100    93  100   180    240    466 --:--:-- --:--:-- --:--:--   466
15-Jul-2017 17:40:55 Finished task 'Set result build status' with result: Success
15-Jul-2017 17:40:55 Running post build plugin 'NCover Results Collector'
15-Jul-2017 17:40:55 Running post build plugin 'Artifact Copier'
15-Jul-2017 17:40:55 Running post build plugin 'npm Cache Cleanup'
15-Jul-2017 17:40:55 Running post build plugin 'Clover Results Collector'
15-Jul-2017 17:40:55 Running post build plugin 'Docker Container Cleanup'
15-Jul-2017 17:40:56 Successfully removed working directory at '/home/bamboo/xml-data/build-dir/PHPBB3-PR-JOB1'
15-Jul-2017 17:40:56 Finalising the build...
15-Jul-2017 17:40:56 Stopping timer.
15-Jul-2017 17:40:56 Build PHPBB3-PR-JOB1-7335 completed.
15-Jul-2017 17:40:56 Running on server: post build plugin 'NCover Results Collector'
15-Jul-2017 17:40:56 Running on server: post build plugin 'Build Hanging Detection Configuration'
15-Jul-2017 17:40:56 Running on server: post build plugin 'Clover Delta Calculator'
15-Jul-2017 17:40:56 Running on server: post build plugin 'Maven Dependencies Postprocessor'
15-Jul-2017 17:40:56 All post build plugins have finished
15-Jul-2017 17:40:56 Generating build results summary...
15-Jul-2017 17:40:56 Saving build results to disk...
15-Jul-2017 17:40:56 Logging substituted variables...
15-Jul-2017 17:40:56 Indexing build results...
15-Jul-2017 17:40:56 Finished building PHPBB3-PR-JOB1-7335.
15-Jul-2017 17:40:56
Substituting variable: ${bamboo.PRnumber} with 4789