Tests pending pull requests

Build: #7363 failed

Job: Build and Test Job failed

Stages & jobs

  1. Build and Test

Build log

The build generated 708 lines of output. Download or view full build log

19-Jul-2017 14:37:05 Build phpBB3 - Pull Requests - Build and Test Job #7363 (PHPBB3-PR-JOB1-7363) started building on agent Default Agent
19-Jul-2017 14:37:05
19-Jul-2017 14:37:05 Build working directory is /home/bamboo/xml-data/build-dir/PHPBB3-PR-JOB1
19-Jul-2017 14:37:05 Executing build phpBB3 - Pull Requests - Build and Test Job #7363 (PHPBB3-PR-JOB1-7363)
19-Jul-2017 14:37:05 Starting task 'Checkout develop branch' of type 'com.atlassian.bamboo.plugins.vcs:task.vcs.checkout'
19-Jul-2017 14:37:05 Build always requires a clean checkout
19-Jul-2017 14:37:05 Cleaning build directory '/home/bamboo/xml-data/build-dir/PHPBB3-PR-JOB1'
19-Jul-2017 14:37:05 Updating source code to revision: 65aaef1f83920fc25266fbea5608427bb930f329
19-Jul-2017 14:37:05 Fetching 'refs/heads/3.1.x' from 'https://github.com/phpbb/phpbb.git'.
19-Jul-2017 14:37:06 Checking out revision 65aaef1f83920fc25266fbea5608427bb930f329.
19-Jul-2017 14:37:06 Creating local git repository in '/home/bamboo/xml-data/build-dir/PHPBB3-PR-JOB1/.git'.
19-Jul-2017 14:37:06 Cloning into '/home/bamboo/xml-data/build-dir/PHPBB3-PR-JOB1'...
19-Jul-2017 14:37:06 done.
19-Jul-2017 14:37:08 Branch 3.1.x set up to track remote branch 3.1.x from origin.
19-Jul-2017 14:37:08 Switched to a new branch '3.1.x'
19-Jul-2017 14:37:08 Updated source code to revision: 65aaef1f83920fc25266fbea5608427bb930f329
19-Jul-2017 14:37:08 Finished task 'Checkout develop branch' with result: Success
19-Jul-2017 14:37:08 Running pre-build action: VCS Version Collector
19-Jul-2017 14:37:08
Substituting variable: ${bamboo.PRnumber} with 4847
19-Jul-2017 14:37:08
Substituting variable: ${bamboo.buildResultsUrl} with https://bamboo.phpbb.com/browse/PHPBB3-PR-JOB1-7363
19-Jul-2017 14:37:08 Starting task 'Set pending build status' of type 'com.atlassian.bamboo.plugins.scripttask:task.builder.script'
19-Jul-2017 14:37:08
Beginning to execute external process for build 'phpBB3 - Pull Requests - Build and Test Job #7363 (PHPBB3-PR-JOB1-7363)'
... running command line:
/bin/sh /home/bamboo/temp/PHPBB3-PR-JOB1-7363-ScriptBuildTask-8243141473340957309.sh
... in: /home/bamboo/xml-data/build-dir/PHPBB3-PR-JOB1
... using extra environment variables:
bamboo_planRepository_1_branch=3.1.x
bamboo_planRepository_1_branchDisplayName=3.1.x
bamboo_repository_revision_number=65aaef1f83920fc25266fbea5608427bb930f329
bamboo_PRref=master
bamboo_resultsUrl=https://bamboo.phpbb.com/browse/PHPBB3-PR-JOB1-7363
bamboo_capability_system_builder_command_Git=/usr/bin/git
bamboo_repository_75956235_git_username=bantu
bamboo_planRepository_1_name=phpBB Ascraeus
bamboo_build_working_directory=/home/bamboo/xml-data/build-dir/PHPBB3-PR-JOB1
bamboo_buildKey=PHPBB3-PR-JOB1
bamboo_capability_phpbb_tests=true
bamboo_shortPlanName=Pull Requests
bamboo_capability_system_builder_command_fop=/usr/bin/fop
bamboo_capability_dbms_sqlite_2=true
bamboo_planRepository_name=phpBB Ascraeus
bamboo_PRnumber=4847
bamboo_buildNumber=7363
bamboo_repository_75956235_git_repositoryUrl=https://github.com/phpbb/phpbb.git
bamboo_capability_system_builder_phpunit_PHPUnit=/usr/bin/phpunit
bamboo_shortJobName=Build and Test Job
bamboo_buildResultsUrl=https://bamboo.phpbb.com/browse/PHPBB3-PR-JOB1-7363
bamboo_repository_75956235_branch_name=3.1.x
bamboo_planRepository_repositoryUrl=https://github.com/phpbb/phpbb.git
bamboo_agentId=131073
bamboo_planName=phpBB3 - Pull Requests
bamboo_shortPlanKey=PR
bamboo_shortJobKey=JOB1
bamboo_capability_dbms_mysql_55=true
bamboo_capability_system_jdk_JDK_1_7_0_65=/usr/lib/jvm/java-7-openjdk-amd64
bamboo_planRepository_revision=65aaef1f83920fc25266fbea5608427bb930f329
bamboo_repository_previous_revision_number=65aaef1f83920fc25266fbea5608427bb930f329
bamboo_buildTimeStamp=2017-07-19T14:37:05.708Z
bamboo_planRepository_previousRevision=65aaef1f83920fc25266fbea5608427bb930f329
bamboo_capability_system_builder_mvn2_Maven_2=/usr/share/maven2
bamboo_capability_system_jdk_JDK_1_6_0_16=/usr/lib/jvm/java-6-sun-1.6.0.16
bamboo_buildResultKey=PHPBB3-PR-JOB1-7363
bamboo_repository_git_branch=3.1.x
bamboo_repository_branch_name=3.1.x
bamboo_buildPlanName=phpBB3 - Pull Requests - Build and Test Job
bamboo_planRepository_1_revision=65aaef1f83920fc25266fbea5608427bb930f329
bamboo_repository_name=phpBB Ascraeus
bamboo_buildFailed=false
bamboo_capability_system_docker_executable=/usr/bin/docker
bamboo_planRepository_branch=3.1.x
bamboo_agentWorkingDirectory=/home/bamboo/xml-data/build-dir
bamboo_capability_system_git_executable=/usr/bin/git
bamboo_planRepository_1_previousRevision=65aaef1f83920fc25266fbea5608427bb930f329
bamboo_capability_system_builder_phpunit_PHPUnit_3_4=/usr/bin/phpunit
bamboo_repository_git_username=bantu
bamboo_repository_75956235_revision_number=65aaef1f83920fc25266fbea5608427bb930f329
bamboo_planRepository_branchDisplayName=3.1.x
bamboo_planRepository_1_type=gitv2
bamboo_planRepository_branchName=3.1.x
bamboo_repository_75956235_previous_revision_number=65aaef1f83920fc25266fbea5608427bb930f329
bamboo_capability_system_jdk_JDK=/usr/lib/jvm/java-6-sun
bamboo_plan_storageTag=PHPBB3-PR
bamboo_planRepository_type=gitv2
bamboo_planRepository_1_username=bantu
bamboo_ManualBuildTriggerReason_userName=Build Robot
bamboo_repository_git_repositoryUrl=https://github.com/phpbb/phpbb.git
bamboo_repository_75956235_git_branch=3.1.x
bamboo_capability_system_builder_ant_Ant=/usr/share/ant
bamboo_repository_75956235_name=phpBB Ascraeus
bamboo_working_directory=/home/bamboo/xml-data/build-dir/PHPBB3-PR-JOB1
bamboo_planKey=PHPBB3-PR
bamboo_planRepository_1_repositoryUrl=https://github.com/phpbb/phpbb.git
bamboo_planRepository_username=bantu
bamboo_capability_local=true
bamboo_capability_system_jdk_JDK_1_6=/usr/lib/jvm/java-6-sun
bamboo_capability_system_jdk_JDK_1_7=/usr/lib/jvm/java-7-openjdk-amd64
bamboo_planRepository_1_branchName=3.1.x
19-Jul-2017 14:37:10 From https://github.com/phpbb/phpbb
19-Jul-2017 14:37:10 * branch            refs/pull/4847/head -> FETCH_HEAD
19-Jul-2017 14:37:10   % Total    % Received % Xferd  Average Speed   Time    Time     Time  Current
19-Jul-2017 14:37:10                                  Dload  Upload   Total   Spent    Left  Speed
19-Jul-2017 14:37:10
19-Jul-2017 14:37:11   0     0    0     0    0     0      0      0 --:--:-- --:--:-- --:--:--     0
19-Jul-2017 14:37:11   0     0    0     0    0     0      0      0 --:--:-- --:--:-- --:--:--     0
19-Jul-2017 14:37:11 100   275  100    93  100   182    186    365 --:--:-- --:--:-- --:--:--   365
19-Jul-2017 14:37:11 Finished task 'Set pending build status' with result: Success
19-Jul-2017 14:37:11
Substituting variable: ${bamboo.PRnumber} with 4847
19-Jul-2017 14:37:11 Starting task 'Fetch PR' of type 'com.atlassian.bamboo.plugins.scripttask:task.builder.script'
19-Jul-2017 14:37:11
Beginning to execute external process for build 'phpBB3 - Pull Requests - Build and Test Job #7363 (PHPBB3-PR-JOB1-7363)'
... running command line:
/bin/sh /home/bamboo/temp/PHPBB3-PR-JOB1-7363-ScriptBuildTask-2484804473540715748.sh
... in: /home/bamboo/xml-data/build-dir/PHPBB3-PR-JOB1
... using extra environment variables:
bamboo_planRepository_1_branch=3.1.x
bamboo_planRepository_1_branchDisplayName=3.1.x
bamboo_repository_revision_number=65aaef1f83920fc25266fbea5608427bb930f329
bamboo_PRref=master
bamboo_resultsUrl=https://bamboo.phpbb.com/browse/PHPBB3-PR-JOB1-7363
bamboo_capability_system_builder_command_Git=/usr/bin/git
bamboo_repository_75956235_git_username=bantu
bamboo_planRepository_1_name=phpBB Ascraeus
bamboo_build_working_directory=/home/bamboo/xml-data/build-dir/PHPBB3-PR-JOB1
bamboo_buildKey=PHPBB3-PR-JOB1
bamboo_capability_phpbb_tests=true
bamboo_shortPlanName=Pull Requests
bamboo_capability_system_builder_command_fop=/usr/bin/fop
bamboo_capability_dbms_sqlite_2=true
bamboo_planRepository_name=phpBB Ascraeus
bamboo_PRnumber=4847
bamboo_buildNumber=7363
bamboo_repository_75956235_git_repositoryUrl=https://github.com/phpbb/phpbb.git
bamboo_capability_system_builder_phpunit_PHPUnit=/usr/bin/phpunit
bamboo_shortJobName=Build and Test Job
bamboo_buildResultsUrl=https://bamboo.phpbb.com/browse/PHPBB3-PR-JOB1-7363
bamboo_repository_75956235_branch_name=3.1.x
bamboo_planRepository_repositoryUrl=https://github.com/phpbb/phpbb.git
bamboo_agentId=131073
bamboo_planName=phpBB3 - Pull Requests
bamboo_build_commandline_com_atlassian_bamboo_plugins_scripttask_task_builder_script_7=/bin/sh /home/bamboo/temp/PHPBB3-PR-JOB1-7363-ScriptBuildTask-8243141473340957309.sh
bamboo_shortPlanKey=PR
bamboo_shortJobKey=JOB1
bamboo_capability_dbms_mysql_55=true
bamboo_capability_system_jdk_JDK_1_7_0_65=/usr/lib/jvm/java-7-openjdk-amd64
bamboo_planRepository_revision=65aaef1f83920fc25266fbea5608427bb930f329
bamboo_repository_previous_revision_number=65aaef1f83920fc25266fbea5608427bb930f329
bamboo_buildTimeStamp=2017-07-19T14:37:05.708Z
bamboo_planRepository_previousRevision=65aaef1f83920fc25266fbea5608427bb930f329
bamboo_capability_system_builder_mvn2_Maven_2=/usr/share/maven2
bamboo_capability_system_jdk_JDK_1_6_0_16=/usr/lib/jvm/java-6-sun-1.6.0.16
bamboo_buildResultKey=PHPBB3-PR-JOB1-7363
bamboo_repository_git_branch=3.1.x
bamboo_repository_branch_name=3.1.x
bamboo_buildPlanName=phpBB3 - Pull Requests - Build and Test Job
bamboo_planRepository_1_revision=65aaef1f83920fc25266fbea5608427bb930f329
bamboo_repository_name=phpBB Ascraeus
bamboo_buildFailed=false
bamboo_capability_system_docker_executable=/usr/bin/docker
bamboo_planRepository_branch=3.1.x
bamboo_agentWorkingDirectory=/home/bamboo/xml-data/build-dir
bamboo_capability_system_git_executable=/usr/bin/git
bamboo_planRepository_1_previousRevision=65aaef1f83920fc25266fbea5608427bb930f329
bamboo_capability_system_builder_phpunit_PHPUnit_3_4=/usr/bin/phpunit
bamboo_repository_git_username=bantu
bamboo_repository_75956235_revision_number=65aaef1f83920fc25266fbea5608427bb930f329
bamboo_planRepository_branchDisplayName=3.1.x
bamboo_planRepository_1_type=gitv2
bamboo_planRepository_branchName=3.1.x
bamboo_repository_75956235_previous_revision_number=65aaef1f83920fc25266fbea5608427bb930f329
bamboo_capability_system_jdk_JDK=/usr/lib/jvm/java-6-sun
bamboo_plan_storageTag=PHPBB3-PR
bamboo_planRepository_type=gitv2
bamboo_planRepository_1_username=bantu
bamboo_ManualBuildTriggerReason_userName=Build Robot
bamboo_repository_git_repositoryUrl=https://github.com/phpbb/phpbb.git
bamboo_repository_75956235_git_branch=3.1.x
bamboo_capability_system_builder_ant_Ant=/usr/share/ant
bamboo_repository_75956235_name=phpBB Ascraeus
bamboo_working_directory=/home/bamboo/xml-data/build-dir/PHPBB3-PR-JOB1
bamboo_planKey=PHPBB3-PR
bamboo_planRepository_1_repositoryUrl=https://github.com/phpbb/phpbb.git
bamboo_planRepository_username=bantu
bamboo_capability_local=true
bamboo_capability_system_jdk_JDK_1_6=/usr/lib/jvm/java-6-sun
bamboo_capability_system_jdk_JDK_1_7=/usr/lib/jvm/java-7-openjdk-amd64
bamboo_planRepository_1_branchName=3.1.x
19-Jul-2017 14:37:14 From https://github.com/phpbb/phpbb
19-Jul-2017 14:37:14 * branch            refs/pull/4847/merge -> FETCH_HEAD
19-Jul-2017 14:37:14 Note: checking out 'FETCH_HEAD'.
19-Jul-2017 14:37:14
19-Jul-2017 14:37:14 You are in 'detached HEAD' state. You can look around, make experimental
19-Jul-2017 14:37:14 changes and commit them, and you can discard any commits you make in this
19-Jul-2017 14:37:14 state without impacting any branches by performing another checkout.
19-Jul-2017 14:37:14
19-Jul-2017 14:37:14 If you want to create a new branch to retain commits you create, you may
19-Jul-2017 14:37:14 do so (now or later) by using -b with the checkout command again. Example:
19-Jul-2017 14:37:14
19-Jul-2017 14:37:14   git checkout -b new_branch_name
19-Jul-2017 14:37:14
19-Jul-2017 14:37:14 HEAD is now at 2643fcd... Merge a5568d07c32ee8f8bad2c8b68caa28794516f5d8 into 35962a0508b18911cc861d4683ed17400eafa53a
19-Jul-2017 14:37:14 Finished task 'Fetch PR' with result: Success
19-Jul-2017 14:37:14 Skipping execution of task 'Prepare directory' as it is disabled
19-Jul-2017 14:37:14
Substituting variable: ${bamboo.working.directory} with /home/bamboo/xml-data/build-dir/PHPBB3-PR-JOB1
19-Jul-2017 14:37:14 Starting task 'Prepare directory' of type 'com.atlassian.bamboo.plugins.bamboo-docker-plugin:task.docker.cli'
19-Jul-2017 14:37:14 Running image name (phpbb:php-5.6)
19-Jul-2017 14:37:14
Beginning to execute external process for build 'phpBB3 - Pull Requests - Build and Test Job #7363 (PHPBB3-PR-JOB1-7363)'
... running command line:
/usr/bin/docker run --volume /home/bamboo/xml-data/build-dir/PHPBB3-PR-JOB1:/data --workdir /data/phpBB --rm -e HOME=/home/bamboo -u=991 phpbb:php-5.6 /bin/bash -c php ../composer.phar install --dev; cd ../build; ../phpBB/vendor/bin/phing clean prepare
... in: /home/bamboo/xml-data/build-dir/PHPBB3-PR-JOB1
... using extra environment variables:
bamboo_planRepository_1_branch=3.1.x
bamboo_planRepository_1_branchDisplayName=3.1.x
bamboo_repository_revision_number=65aaef1f83920fc25266fbea5608427bb930f329
bamboo_PRref=master
bamboo_resultsUrl=https://bamboo.phpbb.com/browse/PHPBB3-PR-JOB1-7363
bamboo_capability_system_builder_command_Git=/usr/bin/git
bamboo_repository_75956235_git_username=bantu
bamboo_planRepository_1_name=phpBB Ascraeus
bamboo_build_working_directory=/home/bamboo/xml-data/build-dir/PHPBB3-PR-JOB1
bamboo_buildKey=PHPBB3-PR-JOB1
bamboo_capability_phpbb_tests=true
bamboo_shortPlanName=Pull Requests
bamboo_capability_system_builder_command_fop=/usr/bin/fop
bamboo_capability_dbms_sqlite_2=true
bamboo_planRepository_name=phpBB Ascraeus
bamboo_PRnumber=4847
bamboo_buildNumber=7363
bamboo_repository_75956235_git_repositoryUrl=https://github.com/phpbb/phpbb.git
bamboo_capability_system_builder_phpunit_PHPUnit=/usr/bin/phpunit
bamboo_shortJobName=Build and Test Job
bamboo_buildResultsUrl=https://bamboo.phpbb.com/browse/PHPBB3-PR-JOB1-7363
bamboo_repository_75956235_branch_name=3.1.x
bamboo_planRepository_repositoryUrl=https://github.com/phpbb/phpbb.git
bamboo_agentId=131073
bamboo_planName=phpBB3 - Pull Requests
bamboo_build_commandline_com_atlassian_bamboo_plugins_scripttask_task_builder_script_7=/bin/sh /home/bamboo/temp/PHPBB3-PR-JOB1-7363-ScriptBuildTask-8243141473340957309.sh
bamboo_shortPlanKey=PR
bamboo_shortJobKey=JOB1
bamboo_capability_dbms_mysql_55=true
bamboo_capability_system_jdk_JDK_1_7_0_65=/usr/lib/jvm/java-7-openjdk-amd64
bamboo_planRepository_revision=65aaef1f83920fc25266fbea5608427bb930f329
bamboo_repository_previous_revision_number=65aaef1f83920fc25266fbea5608427bb930f329
bamboo_buildTimeStamp=2017-07-19T14:37:05.708Z
bamboo_planRepository_previousRevision=65aaef1f83920fc25266fbea5608427bb930f329
bamboo_capability_system_builder_mvn2_Maven_2=/usr/share/maven2
bamboo_capability_system_jdk_JDK_1_6_0_16=/usr/lib/jvm/java-6-sun-1.6.0.16
bamboo_build_commandline_com_atlassian_bamboo_plugins_scripttask_task_builder_script_4=/bin/sh /home/bamboo/temp/PHPBB3-PR-JOB1-7363-ScriptBuildTask-2484804473540715748.sh
bamboo_buildResultKey=PHPBB3-PR-JOB1-7363
bamboo_repository_git_branch=3.1.x
bamboo_repository_branch_name=3.1.x
bamboo_buildPlanName=phpBB3 - Pull Requests - Build and Test Job
bamboo_planRepository_1_revision=65aaef1f83920fc25266fbea5608427bb930f329
bamboo_repository_name=phpBB Ascraeus
bamboo_buildFailed=false
bamboo_capability_system_docker_executable=/usr/bin/docker
bamboo_planRepository_branch=3.1.x
bamboo_agentWorkingDirectory=/home/bamboo/xml-data/build-dir
bamboo_capability_system_git_executable=/usr/bin/git
bamboo_planRepository_1_previousRevision=65aaef1f83920fc25266fbea5608427bb930f329
bamboo_capability_system_builder_phpunit_PHPUnit_3_4=/usr/bin/phpunit
bamboo_repository_git_username=bantu
bamboo_repository_75956235_revision_number=65aaef1f83920fc25266fbea5608427bb930f329
bamboo_planRepository_branchDisplayName=3.1.x
bamboo_planRepository_1_type=gitv2
bamboo_planRepository_branchName=3.1.x
bamboo_repository_75956235_previous_revision_number=65aaef1f83920fc25266fbea5608427bb930f329
bamboo_capability_system_jdk_JDK=/usr/lib/jvm/java-6-sun
bamboo_plan_storageTag=PHPBB3-PR
bamboo_planRepository_type=gitv2
bamboo_planRepository_1_username=bantu
bamboo_ManualBuildTriggerReason_userName=Build Robot
bamboo_repository_git_repositoryUrl=https://github.com/phpbb/phpbb.git
bamboo_repository_75956235_git_branch=3.1.x
bamboo_capability_system_builder_ant_Ant=/usr/share/ant
bamboo_repository_75956235_name=phpBB Ascraeus
bamboo_working_directory=/home/bamboo/xml-data/build-dir/PHPBB3-PR-JOB1
bamboo_planKey=PHPBB3-PR
bamboo_planRepository_1_repositoryUrl=https://github.com/phpbb/phpbb.git
bamboo_planRepository_username=bantu
bamboo_capability_local=true
bamboo_capability_system_jdk_JDK_1_6=/usr/lib/jvm/java-6-sun
bamboo_capability_system_jdk_JDK_1_7=/usr/lib/jvm/java-7-openjdk-amd64
bamboo_planRepository_1_branchName=3.1.x
19-Jul-2017 14:37:14 You are running composer with xdebug enabled. This has a major impact on runtime performance. See https://getcomposer.org/xdebug
19-Jul-2017 14:37:14 You are using the deprecated option "dev". Dev packages are installed by default now.
19-Jul-2017 14:37:14 Cannot create cache directory /home/bamboo/.composer/cache/repo/https---packagist.org/, or directory is not writable. Proceeding without cache
19-Jul-2017 14:37:14 Cannot create cache directory /home/bamboo/.composer/cache/files/, or directory is not writable. Proceeding without cache
19-Jul-2017 14:37:14 Loading composer repositories with package information
19-Jul-2017 14:37:14 Installing dependencies (including require-dev) from lock file
19-Jul-2017 14:37:14   - Installing bantu/ini-get-wrapper (v1.0.1)
19-Jul-2017 14:37:15     Downloading: Connecting...    Downloading: 0%               Downloading: 100%    Downloading: 100%
19-Jul-2017 14:37:15
19-Jul-2017 14:37:15   - Installing symfony/process (v3.3.4)
19-Jul-2017 14:37:16     Downloading: Connecting...    Downloading: 0%               Downloading: 25%    Downloading: 30%    Downloading: 35%    Downloading: 55%    Downloading: 60%    Downloading: 85%    Downloading: 90%    Downloading: 100%
19-Jul-2017 14:37:16
19-Jul-2017 14:37:16   - Installing symfony/finder (v3.3.4)
19-Jul-2017 14:37:17     Downloading: Connecting...    Downloading: 0%               Downloading: 5%    Downloading: 10%    Downloading: 65%    Downloading: 70%    Downloading: 75%    Downloading: 80%    Downloading: 100%    Downloading: 100%
19-Jul-2017 14:37:17
19-Jul-2017 14:37:17   - Installing symfony/filesystem (v3.3.4)
19-Jul-2017 14:37:18     Downloading: Connecting...    Downloading: 0%               Downloading: 50%    Downloading: 55%    Downloading: 100%
19-Jul-2017 14:37:18
19-Jul-2017 14:37:18   - Installing symfony/polyfill-mbstring (v1.4.0)
19-Jul-2017 14:37:19     Downloading: Connecting...    Downloading: 0%               Downloading: 35%    Downloading: 90%    Downloading: 100%    Downloading: 100%
19-Jul-2017 14:37:19
19-Jul-2017 14:37:19   - Installing psr/log (1.0.2)
19-Jul-2017 14:37:20     Downloading: Connecting...    Downloading: 0%               Downloading: 15%    Downloading: 100%    Downloading: 100%
19-Jul-2017 14:37:20
19-Jul-2017 14:37:20   - Installing symfony/debug (v3.3.4)
19-Jul-2017 14:37:21     Downloading: Connecting...    Downloading: 0%               Downloading: 10%    Downloading: 20%    Downloading: 25%    Downloading: 30%    Downloading: 40%    Downloading: 50%    Downloading: 55%    Downloading: 65%    Downloading: 75%    Downloading: 85%    Downloading: 95%    Downloading: 100%    Downloading: 100%
19-Jul-2017 14:37:21
19-Jul-2017 14:37:21   - Installing symfony/console (v3.3.4)
19-Jul-2017 14:37:22     Downloading: Connecting...    Downloading: 0%               Downloading: 5%    Downloading: 10%    Downloading: 15%    Downloading: 20%    Downloading: 25%    Downloading: 30%    Downloading: 35%    Downloading: 40%    Downloading: 45%    Downloading: 50%    Downloading: 55%    Downloading: 60%    Downloading: 65%    Downloading: 70%    Downloading: 75%    Downloading: 80%    Downloading: 85%    Downloading: 90%    Downloading: 95%    Downloading: 100%    Downloading: 100%
19-Jul-2017 14:37:22
19-Jul-2017 14:37:22   - Installing seld/phar-utils (1.0.1)
19-Jul-2017 14:37:23     Downloading: Connecting...    Downloading: 0%               Downloading: 30%    Downloading: 60%    Downloading: 100%
19-Jul-2017 14:37:23
19-Jul-2017 14:37:23   - Installing seld/jsonlint (1.6.1)
19-Jul-2017 14:37:24     Downloading: Connecting...    Downloading: 0%               Downloading: 40%    Downloading: 85%    Downloading: 100%    Downloading: 100%
19-Jul-2017 14:37:24
19-Jul-2017 14:37:24   - Installing seld/cli-prompt (1.0.3)
19-Jul-2017 14:37:25     Downloading: Connecting...    Downloading: 0%               Downloading: 15%    Downloading: 30%    Downloading: 100%    Downloading: 100%
19-Jul-2017 14:37:25
19-Jul-2017 14:37:25   - Installing justinrainbow/json-schema (5.2.1)
19-Jul-2017 14:37:26     Downloading: Connecting...    Downloading: 0%               Downloading: 5%    Downloading: 15%    Downloading: 20%    Downloading: 30%    Downloading: 35%    Downloading: 45%    Downloading: 50%    Downloading: 60%    Downloading: 65%    Downloading: 80%    Downloading: 85%    Downloading: 100%    Downloading: 100%
19-Jul-2017 14:37:26
19-Jul-2017 14:37:26   - Installing composer/spdx-licenses (1.1.6)
19-Jul-2017 14:37:27     Downloading: Connecting...    Downloading: 0%               Downloading: 100%    Downloading: 100%
19-Jul-2017 14:37:27
19-Jul-2017 14:37:27   - Installing composer/semver (1.4.2)
19-Jul-2017 14:37:28     Downloading: Connecting...    Downloading: 0%               Downloading: 35%    Downloading: 90%    Downloading: 95%    Downloading: 100%
19-Jul-2017 14:37:28
19-Jul-2017 14:37:28   - Installing composer/ca-bundle (1.0.7)
19-Jul-2017 14:37:29     Downloading: Connecting...    Downloading: 0%               Downloading: 5%    Downloading: 10%    Downloading: 15%    Downloading: 20%    Downloading: 25%    Downloading: 30%    Downloading: 35%    Downloading: 40%    Downloading: 45%    Downloading: 50%    Downloading: 55%    Downloading: 60%    Downloading: 65%    Downloading: 70%    Downloading: 75%    Downloading: 80%    Downloading: 85%    Downloading: 90%    Downloading: 95%    Downloading: 100%    Downloading: 100%
19-Jul-2017 14:37:29
19-Jul-2017 14:37:29   - Installing composer/composer (1.4.2)
19-Jul-2017 14:37:31     Downloading: Connecting...    Downloading: 0%               Downloading: 5%    Downloading: 10%    Downloading: 15%    Downloading: 20%    Downloading: 25%    Downloading: 30%    Downloading: 35%    Downloading: 40%    Downloading: 45%    Downloading: 50%    Downloading: 55%    Downloading: 60%    Downloading: 65%    Downloading: 70%    Downloading: 75%    Downloading: 80%    Downloading: 85%    Downloading: 90%    Downloading: 95%    Downloading: 100%    Downloading: 100%
19-Jul-2017 14:37:31
19-Jul-2017 14:37:31   - Installing google/recaptcha (1.1.3)
19-Jul-2017 14:37:32     Downloading: Connecting...    Downloading: 0%               Downloading: 25%    Downloading: 30%    Downloading: 55%    Downloading: 65%    Downloading: 90%    Downloading: 100%    Downloading: 100%
19-Jul-2017 14:37:32
19-Jul-2017 14:37:32   - Installing guzzlehttp/promises (v1.3.1)
19-Jul-2017 14:37:33     Downloading: Connecting...    Downloading: 0%               Downloading: 30%    Downloading: 60%    Downloading: 80%    Downloading: 100%    Downloading: 100%
19-Jul-2017 14:37:33
19-Jul-2017 14:37:33   - Installing psr/http-message (1.0.1)
19-Jul-2017 14:37:34     Downloading: Connecting...    Downloading: 0%               Downloading: 95%    Downloading: 100%    Downloading: 100%
19-Jul-2017 14:37:34
19-Jul-2017 14:37:34   - Installing guzzlehttp/psr7 (1.4.2)
19-Jul-2017 14:37:35     Downloading: Connecting...    Downloading: 0%               Downloading: 5%    Downloading: 10%    Downloading: 15%    Downloading: 20%    Downloading: 90%    Downloading: 95%    Downloading: 100%    Downloading: 100%
19-Jul-2017 14:37:35
19-Jul-2017 14:37:35   - Installing lusitanian/oauth (v0.8.10)
19-Jul-2017 14:37:36     Downloading: Connecting...    Downloading: 0%               Downloading: 5%    Downloading: 10%    Downloading: 15%    Downloading: 20%    Downloading: 30%    Downloading: 35%    Downloading: 45%    Downloading: 50%    Downloading: 55%    Downloading: 60%    Downloading: 65%    Downloading: 70%    Downloading: 75%    Downloading: 80%    Downloading: 85%    Downloading: 90%    Downloading: 95%    Downloading: 100%    Downloading: 100%
19-Jul-2017 14:37:36
19-Jul-2017 14:37:36   - Installing marc1706/fast-image-size (v1.1.3)
19-Jul-2017 14:37:37     Downloading: Connecting...    Downloading: 0%               Downloading: 20%    Downloading: 40%    Downloading: 60%    Downloading: 80%    Downloading: 100%    Downloading: 100%
19-Jul-2017 14:37:37
19-Jul-2017 14:37:37   - Installing paragonie/random_compat (v1.4.2)
19-Jul-2017 14:37:38     Downloading: Connecting...    Downloading: 0%               Downloading: 10%    Downloading: 35%    Downloading: 45%    Downloading: 50%    Downloading: 60%    Downloading: 70%    Downloading: 80%    Downloading: 100%    Downloading: 100%
19-Jul-2017 14:37:38
19-Jul-2017 14:37:38   - Installing patchwork/utf8 (v1.3.1)
19-Jul-2017 14:37:39     Downloading: Connecting...    Downloading: 0%               Downloading: 5%    Downloading: 10%    Downloading: 15%    Downloading: 20%    Downloading: 25%    Downloading: 30%    Downloading: 35%    Downloading: 40%    Downloading: 45%    Downloading: 50%    Downloading: 55%    Downloading: 60%    Downloading: 65%    Downloading: 70%    Downloading: 75%    Downloading: 80%    Downloading: 85%    Downloading: 90%    Downloading: 95%    Downloading: 100%    Downloading: 100%
19-Jul-2017 14:37:39
19-Jul-2017 14:37:39   - Installing psr/container (1.0.0)
19-Jul-2017 14:37:40     Downloading: Connecting...    Downloading: 0%               Downloading: 75%    Downloading: 100%    Downloading: 100%
19-Jul-2017 14:37:40
19-Jul-2017 14:37:40   - Installing s9e/text-formatter (0.10.1)
19-Jul-2017 14:37:41     Downloading: Connecting...    Downloading: 0%               Downloading: 5%    Downloading: 10%    Downloading: 15%    Downloading: 20%    Downloading: 25%    Downloading: 30%    Downloading: 35%    Downloading: 40%    Downloading: 45%    Downloading: 50%    Downloading: 55%    Downloading: 60%    Downloading: 65%    Downloading: 70%    Downloading: 75%    Downloading: 80%    Downloading: 85%    Downloading: 90%    Downloading: 95%    Downloading: 100%    Downloading: 100%
19-Jul-2017 14:37:41
19-Jul-2017 14:37:41   - Installing symfony/config (v3.3.4)
19-Jul-2017 14:37:43     Downloading: Connecting...    Downloading: 0%               Downloading: 5%    Downloading: 10%    Downloading: 15%    Downloading: 20%    Downloading: 25%    Downloading: 30%    Downloading: 35%    Downloading: 40%    Downloading: 45%    Downloading: 50%    Downloading: 55%    Downloading: 60%    Downloading: 65%    Downloading: 70%    Downloading: 75%    Downloading: 80%    Downloading: 85%    Downloading: 90%    Downloading: 95%    Downloading: 100%    Downloading: 100%
19-Jul-2017 14:37:43
19-Jul-2017 14:37:43   - Installing symfony/http-foundation (v3.3.4)
19-Jul-2017 14:37:44     Downloading: Connecting...    Downloading: 0%               Downloading: 5%    Downloading: 10%    Downloading: 15%    Downloading: 20%    Downloading: 25%    Downloading: 30%    Downloading: 35%    Downloading: 40%    Downloading: 45%    Downloading: 50%    Downloading: 55%    Downloading: 60%    Downloading: 65%    Downloading: 70%    Downloading: 75%    Downloading: 80%    Downloading: 85%    Downloading: 90%    Downloading: 95%    Downloading: 100%    Downloading: 100%
19-Jul-2017 14:37:44
19-Jul-2017 14:37:44   - Installing symfony/event-dispatcher (v3.3.4)
19-Jul-2017 14:37:45     Downloading: Connecting...    Downloading: 0%               Downloading: 5%    Downloading: 95%    Downloading: 100%    Downloading: 100%
19-Jul-2017 14:37:45
19-Jul-2017 14:37:45   - Installing symfony/http-kernel (v3.3.4)
19-Jul-2017 14:37:46     Downloading: Connecting...    Downloading: 0%               Downloading: 5%    Downloading: 10%    Downloading: 15%    Downloading: 20%    Downloading: 25%    Downloading: 30%    Downloading: 35%    Downloading: 40%    Downloading: 45%    Downloading: 50%    Downloading: 55%    Downloading: 60%    Downloading: 65%    Downloading: 70%    Downloading: 75%    Downloading: 80%    Downloading: 85%    Downloading: 90%    Downloading: 95%    Downloading: 100%    Downloading: 100%
19-Jul-2017 14:37:46
19-Jul-2017 14:37:46   - Installing symfony/dependency-injection (v3.3.4)
19-Jul-2017 14:37:47     Downloading: Connecting...    Downloading: 0%               Downloading: 5%    Downloading: 10%    Downloading: 15%    Downloading: 20%    Downloading: 25%    Downloading: 30%    Downloading: 35%    Downloading: 40%    Downloading: 45%    Downloading: 50%    Downloading: 55%    Downloading: 60%    Downloading: 65%    Downloading: 70%    Downloading: 75%    Downloading: 80%    Downloading: 85%    Downloading: 90%    Downloading: 100%    Downloading: 100%
19-Jul-2017 14:37:47
19-Jul-2017 14:37:47   - Installing zendframework/zend-eventmanager (3.2.0)
19-Jul-2017 14:37:48     Downloading: Connecting...    Downloading: 0%               Downloading: 25%    Downloading: 35%    Downloading: 50%    Downloading: 75%    Downloading: 100%    Downloading: 100%
19-Jul-2017 14:37:48
19-Jul-2017 14:37:48   - Installing zendframework/zend-code (2.6.3)
19-Jul-2017 14:37:49     Downloading: Connecting...    Downloading: 0%               Downloading: 5%    Downloading: 10%    Downloading: 15%    Downloading: 20%    Downloading: 25%    Downloading: 30%    Downloading: 35%    Downloading: 40%    Downloading: 45%    Downloading: 50%    Downloading: 55%    Downloading: 60%    Downloading: 65%    Downloading: 70%    Downloading: 75%    Downloading: 80%    Downloading: 85%    Downloading: 90%    Downloading: 95%    Downloading: 100%    Downloading: 100%
19-Jul-2017 14:37:49
19-Jul-2017 14:37:49   - Installing ocramius/proxy-manager (1.0.2)
19-Jul-2017 14:37:51     Downloading: Connecting...    Downloading: 0%               Downloading: 5%    Downloading: 10%    Downloading: 15%    Downloading: 20%    Downloading: 25%    Downloading: 30%    Downloading: 35%    Downloading: 40%    Downloading: 45%    Downloading: 50%    Downloading: 55%    Downloading: 60%    Downloading: 65%    Downloading: 70%    Downloading: 75%    Downloading: 80%    Downloading: 85%    Downloading: 95%    Downloading: 100%    Downloading: 100%
19-Jul-2017 14:37:51
19-Jul-2017 14:37:51   - Installing symfony/proxy-manager-bridge (v3.3.4)
19-Jul-2017 14:37:52     Downloading: Connecting...    Downloading: 0%               Downloading: 25%    Downloading: 65%    Downloading: 90%    Downloading: 100%    Downloading: 100%
19-Jul-2017 14:37:52
19-Jul-2017 14:37:52   - Installing symfony/routing (v3.3.4)
19-Jul-2017 14:37:53     Downloading: Connecting...    Downloading: 0%               Downloading: 5%    Downloading: 10%    Downloading: 15%    Downloading: 20%    Downloading: 25%    Downloading: 30%    Downloading: 35%    Downloading: 40%    Downloading: 45%    Downloading: 50%    Downloading: 55%    Downloading: 60%    Downloading: 65%    Downloading: 70%    Downloading: 75%    Downloading: 80%    Downloading: 85%    Downloading: 90%    Downloading: 95%    Downloading: 100%    Downloading: 100%
19-Jul-2017 14:37:53
19-Jul-2017 14:37:53   - Installing twig/twig (v1.34.4)
19-Jul-2017 14:37:54     Downloading: Connecting...    Downloading: 0%               Downloading: 5%    Downloading: 10%    Downloading: 15%    Downloading: 20%    Downloading: 25%    Downloading: 30%    Downloading: 35%    Downloading: 40%    Downloading: 45%    Downloading: 50%    Downloading: 55%    Downloading: 60%    Downloading: 65%    Downloading: 70%    Downloading: 75%    Downloading: 85%    Downloading: 90%    Downloading: 95%    Downloading: 100%    Downloading: 100%
19-Jul-2017 14:37:54
19-Jul-2017 14:37:54   - Installing symfony/twig-bridge (v3.3.4)
19-Jul-2017 14:37:55     Downloading: Connecting...    Downloading: 0%               Downloading: 5%    Downloading: 10%    Downloading: 20%    Downloading: 25%    Downloading: 35%    Downloading: 40%    Downloading: 45%    Downloading: 50%    Downloading: 60%    Downloading: 65%    Downloading: 70%    Downloading: 75%    Downloading: 80%    Downloading: 90%    Downloading: 95%    Downloading: 100%    Downloading: 100%
19-Jul-2017 14:37:55
19-Jul-2017 14:37:55   - Installing symfony/dom-crawler (v3.3.4)
19-Jul-2017 14:37:56     Downloading: Connecting...    Downloading: 0%               Downloading: 25%    Downloading: 30%    Downloading: 40%    Downloading: 45%    Downloading: 65%    Downloading: 70%    Downloading: 95%    Downloading: 100%    Downloading: 100%
19-Jul-2017 14:37:56
19-Jul-2017 14:37:56   - Installing symfony/css-selector (v3.3.4)
19-Jul-2017 14:37:57     Downloading: Connecting...    Downloading: 0%               Downloading: 5%    Downloading: 10%    Downloading: 15%    Downloading: 20%    Downloading: 25%    Downloading: 30%    Downloading: 75%    Downloading: 80%    Downloading: 85%    Downloading: 90%    Downloading: 95%    Downloading: 100%
19-Jul-2017 14:37:57
19-Jul-2017 14:37:57   - Installing symfony/browser-kit (v3.3.4)
19-Jul-2017 14:37:58     Downloading: Connecting...    Downloading: 0%               Downloading: 70%    Downloading: 75%    Downloading: 100%    Downloading: 100%
19-Jul-2017 14:37:58
19-Jul-2017 14:37:58   - Installing guzzlehttp/guzzle (6.3.0)
19-Jul-2017 14:38:00     Downloading: Connecting...    Downloading: 0%               Downloading: 5%    Downloading: 15%    Downloading: 20%    Downloading: 30%    Downloading: 35%    Downloading: 40%    Downloading: 45%    Downloading: 50%    Downloading: 55%    Downloading: 65%    Downloading: 70%    Downloading: 80%    Downloading: 85%    Downloading: 90%    Downloading: 95%    Downloading: 100%
19-Jul-2017 14:38:00
19-Jul-2017 14:38:00   - Installing fabpot/goutte (v3.2.1)
19-Jul-2017 14:38:00     Downloading: Connecting...    Downloading: 0%               Downloading: 70%    Downloading: 100%    Downloading: 100%
19-Jul-2017 14:38:00
19-Jul-2017 14:38:00   - Installing facebook/webdriver (1.4.1)
19-Jul-2017 14:38:02     Downloading: Connecting...    Downloading: 0%               Downloading: 5%    Downloading: 10%    Downloading: 15%    Downloading: 20%    Downloading: 25%    Downloading: 30%    Downloading: 35%    Downloading: 40%    Downloading: 45%    Downloading: 50%    Downloading: 55%    Downloading: 60%    Downloading: 65%    Downloading: 70%    Downloading: 75%    Downloading: 80%    Downloading: 85%    Downloading: 90%    Downloading: 95%    Downloading: 100%    Downloading: 100%
19-Jul-2017 14:38:02
19-Jul-2017 14:38:02   - Installing laravel/homestead (v4.0.5)
19-Jul-2017 14:38:03     Downloading: Connecting...    Downloading: 0%               Downloading: 5%    Downloading: 10%    Downloading: 70%    Downloading: 75%    Downloading: 80%    Downloading: 85%    Downloading: 100%    Downloading: 100%
19-Jul-2017 14:38:03
19-Jul-2017 14:38:03   - Installing phing/phing (2.4.14)
19-Jul-2017 14:38:04     Downloading: Connecting...    Downloading: 0%               Downloading: 5%    Downloading: 10%    Downloading: 15%    Downloading: 20%    Downloading: 25%    Downloading: 30%    Downloading: 35%    Downloading: 40%    Downloading: 45%    Downloading: 50%    Downloading: 55%    Downloading: 60%    Downloading: 65%    Downloading: 70%    Downloading: 75%    Downloading: 80%    Downloading: 85%    Downloading: 90%    Downloading: 95%    Downloading: 100%    Downloading: 100%
19-Jul-2017 14:38:04
19-Jul-2017 14:38:04   - Installing webmozart/assert (1.2.0)
19-Jul-2017 14:38:05     Downloading: Connecting...    Downloading: 0%               Downloading: 55%    Downloading: 80%    Downloading: 100%    Downloading: 100%
19-Jul-2017 14:38:05
19-Jul-2017 14:38:05   - Installing phpdocumentor/reflection-common (1.0)
19-Jul-2017 14:38:06     Downloading: Connecting...    Downloading: 0%               Downloading: 65%    Downloading: 100%
19-Jul-2017 14:38:06
19-Jul-2017 14:38:06   - Installing phpdocumentor/type-resolver (0.4.0)
19-Jul-2017 14:38:07     Downloading: Connecting...    Downloading: 0%               Downloading: 5%    Downloading: 85%    Downloading: 90%    Downloading: 95%    Downloading: 100%
19-Jul-2017 14:38:07
19-Jul-2017 14:38:07   - Installing phpdocumentor/reflection-docblock (3.2.0)
19-Jul-2017 14:38:08     Downloading: Connecting...    Downloading: 0%               Downloading: 5%    Downloading: 30%    Downloading: 35%    Downloading: 55%    Downloading: 60%    Downloading: 90%    Downloading: 95%    Downloading: 100%    Downloading: 100%
19-Jul-2017 14:38:08
19-Jul-2017 14:38:08   - Installing symfony/yaml (v3.3.4)
19-Jul-2017 14:38:09     Downloading: Connecting...    Downloading: 0%               Downloading: 5%    Downloading: 10%    Downloading: 15%    Downloading: 25%    Downloading: 30%    Downloading: 35%    Downloading: 40%    Downloading: 45%    Downloading: 75%    Downloading: 80%    Downloading: 85%    Downloading: 90%    Downloading: 95%    Downloading: 100%    Downloading: 100%
19-Jul-2017 14:38:09
19-Jul-2017 14:38:09   - Installing sebastian/version (2.0.1)
19-Jul-2017 14:38:10     Downloading: Connecting...    Downloading: 0%               Downloading: 100%
19-Jul-2017 14:38:10
19-Jul-2017 14:38:10   - Installing sebastian/resource-operations (1.0.0)
19-Jul-2017 14:38:11     Downloading: Connecting...    Downloading: 0%               Downloading: 65%    Downloading: 100%    Downloading: 100%
19-Jul-2017 14:38:11
19-Jul-2017 14:38:11   - Installing sebastian/recursion-context (2.0.0)
19-Jul-2017 14:38:12     Downloading: Connecting...    Downloading: 0%               Downloading: 100%    Downloading: 100%
19-Jul-2017 14:38:12
19-Jul-2017 14:38:12   - Installing sebastian/object-enumerator (2.0.1)
19-Jul-2017 14:38:13     Downloading: Connecting...    Downloading: 0%               Downloading: 100%
19-Jul-2017 14:38:13
19-Jul-2017 14:38:13   - Installing sebastian/global-state (1.1.1)
19-Jul-2017 14:38:14     Downloading: Connecting...    Downloading: 0%               Downloading: 40%    Downloading: 70%    Downloading: 100%    Downloading: 100%
19-Jul-2017 14:38:14
19-Jul-2017 14:38:14   - Installing sebastian/exporter (2.0.0)
19-Jul-2017 14:38:14     Downloading: Connecting...    Downloading: 0%               Downloading: 100%    Downloading: 100%
19-Jul-2017 14:38:14
19-Jul-2017 14:38:14   - Installing sebastian/environment (2.0.0)
19-Jul-2017 14:38:15     Downloading: Connecting...    Downloading: 0%               Downloading: 15%    Downloading: 30%    Downloading: 45%    Downloading: 60%    Downloading: 75%    Downloading: 90%    Downloading: 100%    Downloading: 100%
19-Jul-2017 14:38:15
19-Jul-2017 14:38:15   - Installing sebastian/diff (1.4.3)
19-Jul-2017 14:38:16     Downloading: Connecting...    Downloading: 0%               Downloading: 35%    Downloading: 40%    Downloading: 80%    Downloading: 100%
19-Jul-2017 14:38:16
19-Jul-2017 14:38:16   - Installing sebastian/comparator (1.2.4)
19-Jul-2017 14:38:17     Downloading: Connecting...    Downloading: 0%               Downloading: 10%    Downloading: 35%    Downloading: 75%    Downloading: 85%    Downloading: 90%    Downloading: 100%
19-Jul-2017 14:38:17
19-Jul-2017 14:38:17   - Installing phpunit/php-text-template (1.2.1)
19-Jul-2017 14:38:18     Downloading: Connecting...    Downloading: 0%               Downloading: 35%    Downloading: 100%    Downloading: 100%
19-Jul-2017 14:38:18
19-Jul-2017 14:38:18   - Installing doctrine/instantiator (1.0.5)
19-Jul-2017 14:38:19     Downloading: Connecting...    Downloading: 0%               Downloading: 15%    Downloading: 30%    Downloading: 45%    Downloading: 50%    Downloading: 65%    Downloading: 80%    Downloading: 95%    Downloading: 100%    Downloading: 100%
19-Jul-2017 14:38:19
19-Jul-2017 14:38:19   - Installing phpunit/phpunit-mock-objects (3.4.4)
19-Jul-2017 14:38:20     Downloading: Connecting...    Downloading: 0%               Downloading: 5%    Downloading: 10%    Downloading: 15%    Downloading: 20%    Downloading: 25%    Downloading: 30%    Downloading: 40%    Downloading: 45%    Downloading: 50%    Downloading: 55%    Downloading: 60%    Downloading: 65%    Downloading: 75%    Downloading: 80%    Downloading: 85%    Downloading: 90%    Downloading: 95%    Downloading: 100%    Downloading: 100%
19-Jul-2017 14:38:20
19-Jul-2017 14:38:20   - Installing phpunit/php-timer (1.0.9)
19-Jul-2017 14:38:21     Downloading: Connecting...    Downloading: 0%               Downloading: 45%    Downloading: 90%    Downloading: 100%    Downloading: 100%
19-Jul-2017 14:38:21
19-Jul-2017 14:38:21   - Installing phpunit/php-file-iterator (1.4.2)
19-Jul-2017 14:38:21     Downloading: Connecting...    Downloading: 0%               Downloading: 20%    Downloading: 40%    Downloading: 60%    Downloading: 100%    Downloading: 100%
19-Jul-2017 14:38:21
19-Jul-2017 14:38:21   - Installing sebastian/code-unit-reverse-lookup (1.0.1)
19-Jul-2017 14:38:22     Downloading: Connecting...    Downloading: 0%               Downloading: 55%    Downloading: 100%    Downloading: 100%
19-Jul-2017 14:38:22
19-Jul-2017 14:38:22   - Installing phpunit/php-token-stream (1.4.11)
19-Jul-2017 14:38:23     Downloading: Connecting...    Downloading: 0%               Downloading: 5%    Downloading: 10%    Downloading: 15%    Downloading: 20%    Downloading: 65%    Downloading: 70%    Downloading: 75%    Downloading: 80%    Downloading: 85%    Downloading: 90%    Downloading: 95%    Downloading: 100%    Downloading: 100%
19-Jul-2017 14:38:23
19-Jul-2017 14:38:23   - Installing phpunit/php-code-coverage (4.0.8)
19-Jul-2017 14:38:24     Downloading: Connecting...    Downloading: 0%               Downloading: 5%    Downloading: 10%    Downloading: 15%    Downloading: 20%    Downloading: 25%    Downloading: 30%    Downloading: 35%    Downloading: 40%    Downloading: 45%    Downloading: 50%    Downloading: 55%    Downloading: 60%    Downloading: 65%    Downloading: 75%    Downloading: 80%    Downloading: 85%    Downloading: 90%    Downloading: 95%    Downloading: 100%    Downloading: 100%
19-Jul-2017 14:38:24
19-Jul-2017 14:38:24   - Installing phpspec/prophecy (v1.7.0)
19-Jul-2017 14:38:25     Downloading: Connecting...    Downloading: 0%               Downloading: 5%    Downloading: 10%    Downloading: 15%    Downloading: 20%    Downloading: 25%    Downloading: 30%    Downloading: 35%    Downloading: 40%    Downloading: 45%    Downloading: 50%    Downloading: 55%    Downloading: 60%    Downloading: 65%    Downloading: 70%    Downloading: 75%    Downloading: 80%    Downloading: 85%    Downloading: 90%    Downloading: 95%    Downloading: 100%    Downloading: 100%
19-Jul-2017 14:38:25
19-Jul-2017 14:38:25   - Installing myclabs/deep-copy (1.6.1)
19-Jul-2017 14:38:26     Downloading: Connecting...    Downloading: 0%               Downloading: 5%    Downloading: 10%    Downloading: 15%    Downloading: 20%    Downloading: 55%    Downloading: 60%    Downloading: 65%    Downloading: 70%    Downloading: 75%    Downloading: 80%    Downloading: 85%    Downloading: 90%    Downloading: 95%    Downloading: 100%    Downloading: 100%
19-Jul-2017 14:38:26
19-Jul-2017 14:38:26   - Installing phpunit/phpunit (5.7.21)
19-Jul-2017 14:38:27     Downloading: Connecting...    Downloading: 0%               Downloading: 5%    Downloading: 10%    Downloading: 15%    Downloading: 20%    Downloading: 25%    Downloading: 30%    Downloading: 35%    Downloading: 40%    Downloading: 45%    Downloading: 50%    Downloading: 55%    Downloading: 65%    Downloading: 70%    Downloading: 75%    Downloading: 80%    Downloading: 85%    Downloading: 90%    Downloading: 95%    Downloading: 100%    Downloading: 100%
19-Jul-2017 14:38:27
19-Jul-2017 14:38:28   - Installing phpunit/dbunit (2.0.3)
19-Jul-2017 14:38:29     Downloading: Connecting...    Downloading: 0%               Downloading: 5%    Downloading: 10%    Downloading: 15%    Downloading: 20%    Downloading: 25%    Downloading: 30%    Downloading: 35%    Downloading: 40%    Downloading: 45%    Downloading: 50%    Downloading: 55%    Downloading: 60%    Downloading: 65%    Downloading: 70%    Downloading: 75%    Downloading: 80%    Downloading: 85%    Downloading: 90%    Downloading: 95%    Downloading: 100%    Downloading: 100%
19-Jul-2017 14:38:29
19-Jul-2017 14:38:29   - Installing squizlabs/php_codesniffer (2.9.1)
19-Jul-2017 14:38:30     Downloading: Connecting...    Downloading: 0%               Downloading: 5%    Downloading: 10%    Downloading: 15%    Downloading: 20%    Downloading: 25%    Downloading: 30%    Downloading: 35%    Downloading: 40%    Downloading: 45%    Downloading: 55%    Downloading: 60%    Downloading: 65%    Downloading: 70%    Downloading: 75%    Downloading: 80%    Downloading: 85%    Downloading: 95%    Downloading: 100%    Downloading: 100%
19-Jul-2017 14:38:30
19-Jul-2017 14:38:31 lusitanian/oauth suggests installing predis/predis (Allows using the Redis storage backend.)
19-Jul-2017 14:38:31 paragonie/random_compat suggests installing ext-libsodium (Provides a modern crypto API that can be used to generate random bytes.)
19-Jul-2017 14:38:31 patchwork/utf8 suggests installing ext-intl (Use Intl for best performance)
19-Jul-2017 14:38:31 patchwork/utf8 suggests installing ext-wfio (Use WFIO for UTF-8 filesystem access on Windows)
19-Jul-2017 14:38:31 s9e/text-formatter suggests installing ext-intl (Allows international URLs to be accepted by the URL filter)
19-Jul-2017 14:38:31 s9e/text-formatter suggests installing ext-xsl (Enables the XSLT renderer)
19-Jul-2017 14:38:31 symfony/http-kernel suggests installing symfony/class-loader ()
19-Jul-2017 14:38:31 symfony/http-kernel suggests installing symfony/var-dumper ()
19-Jul-2017 14:38:31 symfony/dependency-injection suggests installing symfony/expression-language (For using expressions in service container configuration)
19-Jul-2017 14:38:31 zendframework/zend-eventmanager suggests installing container-interop/container-interop (^1.1.0, to use the lazy listeners feature)
19-Jul-2017 14:38:31 zendframework/zend-eventmanager suggests installing zendframework/zend-stdlib (^2.7.3 || ^3.0, to use the FilterChain feature)
19-Jul-2017 14:38:31 zendframework/zend-code suggests installing doctrine/annotations (Doctrine\Common\Annotations >=1.0 for annotation features)
19-Jul-2017 14:38:31 zendframework/zend-code suggests installing zendframework/zend-stdlib (Zend\Stdlib component)
19-Jul-2017 14:38:31 ocramius/proxy-manager suggests installing ocramius/generated-hydrator (To have very fast object to array to object conversion for ghost objects)
19-Jul-2017 14:38:31 ocramius/proxy-manager suggests installing zendframework/zend-json (To have the JsonRpc adapter (Remote Object feature))
19-Jul-2017 14:38:31 ocramius/proxy-manager suggests installing zendframework/zend-soap (To have the Soap adapter (Remote Object feature))
19-Jul-2017 14:38:31 ocramius/proxy-manager suggests installing zendframework/zend-stdlib (To use the hydrator proxy)
19-Jul-2017 14:38:31 ocramius/proxy-manager suggests installing zendframework/zend-xmlrpc (To have the XmlRpc adapter (Remote Object feature))
19-Jul-2017 14:38:31 symfony/routing suggests installing doctrine/annotations (For using the annotation loader)
19-Jul-2017 14:38:31 symfony/routing suggests installing symfony/expression-language (For using expression matching)
19-Jul-2017 14:38:31 symfony/twig-bridge suggests installing symfony/asset (For using the AssetExtension)
19-Jul-2017 14:38:31 symfony/twig-bridge suggests installing symfony/expression-language (For using the ExpressionExtension)
19-Jul-2017 14:38:31 symfony/twig-bridge suggests installing symfony/form (For using the FormExtension)
19-Jul-2017 14:38:31 symfony/twig-bridge suggests installing symfony/security (For using the SecurityExtension)
19-Jul-2017 14:38:31 symfony/twig-bridge suggests installing symfony/stopwatch (For using the StopwatchExtension)
19-Jul-2017 14:38:31 symfony/twig-bridge suggests installing symfony/templating (For using the TwigEngine)
19-Jul-2017 14:38:31 symfony/twig-bridge suggests installing symfony/translation (For using the TranslationExtension)
19-Jul-2017 14:38:31 symfony/twig-bridge suggests installing symfony/var-dumper (For using the DumpExtension)
19-Jul-2017 14:38:31 symfony/twig-bridge suggests installing symfony/web-link (For using the WebLinkExtension)
19-Jul-2017 14:38:31 sebastian/global-state suggests installing ext-uopz (*)
19-Jul-2017 14:38:31 phpunit/phpunit-mock-objects suggests installing ext-soap (*)
19-Jul-2017 14:38:31 phpunit/phpunit suggests installing phpunit/php-invoker (~1.1)
19-Jul-2017 14:38:31 Generating autoload files
19-Jul-2017 14:38:32 Buildfile: /data/build/build.xml
19-Jul-2017 14:38:32
19-Jul-2017 14:38:32 phpBB > clean:
19-Jul-2017 14:38:32
19-Jul-2017 14:38:32    [delete] Directory /data/build/logs does not exist or is not a directory.
19-Jul-2017 14:38:32    [delete] Directory /data/build/api does not exist or is not a directory.
19-Jul-2017 14:38:32    [delete] Directory /data/build/codebrowser does not exist or is not a directory.
19-Jul-2017 14:38:32    [delete] Directory /data/build/coverage does not exist or is not a directory.
19-Jul-2017 14:38:32    [delete] Directory /data/build/cpd does not exist or is not a directory.
19-Jul-2017 14:38:32    [delete] Directory /data/build/dependencies does not exist or is not a directory.
19-Jul-2017 14:38:32    [delete] Directory /data/build/new_version does not exist or is not a directory.
19-Jul-2017 14:38:32    [delete] Directory /data/build/old_versions does not exist or is not a directory.
19-Jul-2017 14:38:32    [delete] Directory /data/build/save does not exist or is not a directory.
19-Jul-2017 14:38:32
19-Jul-2017 14:38:32 phpBB > prepare:
19-Jul-2017 14:38:32
19-Jul-2017 14:38:32     [mkdir] Created dir: /data/build/logs
19-Jul-2017 14:38:32     [mkdir] Created dir: /data/build/api
19-Jul-2017 14:38:32     [mkdir] Created dir: /data/build/codebrowser
19-Jul-2017 14:38:32     [mkdir] Created dir: /data/build/coverage
19-Jul-2017 14:38:32     [mkdir] Created dir: /data/build/cpd
19-Jul-2017 14:38:32     [mkdir] Created dir: /data/build/dependencies
19-Jul-2017 14:38:32     [mkdir] Created dir: /data/build/new_version
19-Jul-2017 14:38:32     [mkdir] Created dir: /data/build/new_version/files
19-Jul-2017 14:38:32     [mkdir] Created dir: /data/build/new_version/patches
19-Jul-2017 14:38:32     [mkdir] Created dir: /data/build/new_version/release_files
19-Jul-2017 14:38:32     [mkdir] Created dir: /data/build/new_version/update
19-Jul-2017 14:38:32     [mkdir] Created dir: /data/build/old_versions
19-Jul-2017 14:38:32     [mkdir] Created dir: /data/build/save
19-Jul-2017 14:38:32
19-Jul-2017 14:38:32 BUILD FINISHED
19-Jul-2017 14:38:32
19-Jul-2017 14:38:32 Total time: 0.1204 seconds
19-Jul-2017 14:38:32
19-Jul-2017 14:38:32 Finished task 'Prepare directory' with result: Success
19-Jul-2017 14:38:32 Skipping execution of task 'Run sniffs' as it is disabled
19-Jul-2017 14:38:32
Substituting variable: ${bamboo.working.directory} with /home/bamboo/xml-data/build-dir/PHPBB3-PR-JOB1
19-Jul-2017 14:38:32 Starting task 'Run sniffs' of type 'com.atlassian.bamboo.plugins.bamboo-docker-plugin:task.docker.cli'
19-Jul-2017 14:38:32 Running image name (phpbb:php-5.6)
19-Jul-2017 14:38:32
Beginning to execute external process for build 'phpBB3 - Pull Requests - Build and Test Job #7363 (PHPBB3-PR-JOB1-7363)'
... running command line:
/usr/bin/docker run --volume /home/bamboo/xml-data/build-dir/PHPBB3-PR-JOB1:/data --workdir /data/build --rm -u=991 phpbb:php-5.6 ../phpBB/vendor/bin/phing sniff
... in: /home/bamboo/xml-data/build-dir/PHPBB3-PR-JOB1
... using extra environment variables:
bamboo_planRepository_1_branch=3.1.x
bamboo_planRepository_1_branchDisplayName=3.1.x
bamboo_repository_revision_number=65aaef1f83920fc25266fbea5608427bb930f329
bamboo_PRref=master
bamboo_resultsUrl=https://bamboo.phpbb.com/browse/PHPBB3-PR-JOB1-7363
bamboo_capability_system_builder_command_Git=/usr/bin/git
bamboo_repository_75956235_git_username=bantu
bamboo_planRepository_1_name=phpBB Ascraeus
bamboo_build_working_directory=/home/bamboo/xml-data/build-dir/PHPBB3-PR-JOB1
bamboo_buildKey=PHPBB3-PR-JOB1
bamboo_capability_phpbb_tests=true
bamboo_shortPlanName=Pull Requests
bamboo_capability_system_builder_command_fop=/usr/bin/fop
bamboo_capability_dbms_sqlite_2=true
bamboo_planRepository_name=phpBB Ascraeus
bamboo_PRnumber=4847
bamboo_buildNumber=7363
bamboo_repository_75956235_git_repositoryUrl=https://github.com/phpbb/phpbb.git
bamboo_capability_system_builder_phpunit_PHPUnit=/usr/bin/phpunit
bamboo_shortJobName=Build and Test Job
bamboo_buildResultsUrl=https://bamboo.phpbb.com/browse/PHPBB3-PR-JOB1-7363
bamboo_repository_75956235_branch_name=3.1.x
bamboo_planRepository_repositoryUrl=https://github.com/phpbb/phpbb.git
bamboo_agentId=131073
bamboo_planName=phpBB3 - Pull Requests
bamboo_build_commandline_com_atlassian_bamboo_plugins_scripttask_task_builder_script_7=/bin/sh /home/bamboo/temp/PHPBB3-PR-JOB1-7363-ScriptBuildTask-8243141473340957309.sh
bamboo_shortPlanKey=PR
bamboo_shortJobKey=JOB1
bamboo_capability_dbms_mysql_55=true
bamboo_capability_system_jdk_JDK_1_7_0_65=/usr/lib/jvm/java-7-openjdk-amd64
bamboo_planRepository_revision=65aaef1f83920fc25266fbea5608427bb930f329
bamboo_repository_previous_revision_number=65aaef1f83920fc25266fbea5608427bb930f329
bamboo_buildTimeStamp=2017-07-19T14:37:05.708Z
bamboo_planRepository_previousRevision=65aaef1f83920fc25266fbea5608427bb930f329
bamboo_capability_system_builder_mvn2_Maven_2=/usr/share/maven2
bamboo_capability_system_jdk_JDK_1_6_0_16=/usr/lib/jvm/java-6-sun-1.6.0.16
bamboo_build_commandline_com_atlassian_bamboo_plugins_scripttask_task_builder_script_4=/bin/sh /home/bamboo/temp/PHPBB3-PR-JOB1-7363-ScriptBuildTask-2484804473540715748.sh
bamboo_buildResultKey=PHPBB3-PR-JOB1-7363
bamboo_repository_git_branch=3.1.x
bamboo_repository_branch_name=3.1.x
bamboo_buildPlanName=phpBB3 - Pull Requests - Build and Test Job
bamboo_planRepository_1_revision=65aaef1f83920fc25266fbea5608427bb930f329
bamboo_repository_name=phpBB Ascraeus
bamboo_buildFailed=false
bamboo_capability_system_docker_executable=/usr/bin/docker
bamboo_build_commandline_com_atlassian_bamboo_plugins_bamboo_docker_plugin_task_docker_cli_12=/usr/bin/docker run --volume /home/bamboo/xml-data/build-dir/PHPBB3-PR-JOB1:/data --workdir /data/phpBB --rm -e HOME=/home/bamboo -u=991 phpbb:php-5.6 /bin/bash -c php ../composer.phar install --dev; cd ../build; ../phpBB/vendor/bin/phing clean prepare
bamboo_planRepository_branch=3.1.x
bamboo_agentWorkingDirectory=/home/bamboo/xml-data/build-dir
bamboo_capability_system_git_executable=/usr/bin/git
bamboo_planRepository_1_previousRevision=65aaef1f83920fc25266fbea5608427bb930f329
bamboo_capability_system_builder_phpunit_PHPUnit_3_4=/usr/bin/phpunit
bamboo_repository_git_username=bantu
bamboo_repository_75956235_revision_number=65aaef1f83920fc25266fbea5608427bb930f329
bamboo_planRepository_branchDisplayName=3.1.x
bamboo_planRepository_1_type=gitv2
bamboo_planRepository_branchName=3.1.x
bamboo_repository_75956235_previous_revision_number=65aaef1f83920fc25266fbea5608427bb930f329
bamboo_capability_system_jdk_JDK=/usr/lib/jvm/java-6-sun
bamboo_plan_storageTag=PHPBB3-PR
bamboo_planRepository_type=gitv2
bamboo_planRepository_1_username=bantu
bamboo_ManualBuildTriggerReason_userName=Build Robot
bamboo_repository_git_repositoryUrl=https://github.com/phpbb/phpbb.git
bamboo_repository_75956235_git_branch=3.1.x
bamboo_capability_system_builder_ant_Ant=/usr/share/ant
bamboo_repository_75956235_name=phpBB Ascraeus
bamboo_working_directory=/home/bamboo/xml-data/build-dir/PHPBB3-PR-JOB1
bamboo_planKey=PHPBB3-PR
bamboo_planRepository_1_repositoryUrl=https://github.com/phpbb/phpbb.git
bamboo_planRepository_username=bantu
bamboo_capability_local=true
bamboo_capability_system_jdk_JDK_1_6=/usr/lib/jvm/java-6-sun
bamboo_capability_system_jdk_JDK_1_7=/usr/lib/jvm/java-7-openjdk-amd64
bamboo_planRepository_1_branchName=3.1.x
19-Jul-2017 14:38:32 Buildfile: /data/build/build.xml
19-Jul-2017 14:38:32
19-Jul-2017 14:38:32 phpBB > sniff:
19-Jul-2017 14:38:32
19-Jul-2017 14:38:43 ............................................................  60 / 720 (8%)
19-Jul-2017 14:38:44 ............................................................ 120 / 720 (17%)
19-Jul-2017 14:38:46 ............................................................ 180 / 720 (25%)
19-Jul-2017 14:38:47 ............................................................ 240 / 720 (33%)
19-Jul-2017 14:38:51 ............................................................ 300 / 720 (42%)
19-Jul-2017 14:38:57 ............................................................ 360 / 720 (50%)
19-Jul-2017 14:39:05 ............................................................ 420 / 720 (58%)
19-Jul-2017 14:39:11 ............................................................ 480 / 720 (67%)
19-Jul-2017 14:39:15 ............................................................ 540 / 720 (75%)
19-Jul-2017 14:39:19 ............................................................ 600 / 720 (83%)
19-Jul-2017 14:39:26 ............................................................ 660 / 720 (92%)
19-Jul-2017 14:39:29 ............................................................ 720 / 720 (100%)
19-Jul-2017 14:39:29
19-Jul-2017 14:39:29
19-Jul-2017 14:39:29 Time: 56.12 secs; Memory: 62.75Mb
19-Jul-2017 14:39:29
19-Jul-2017 14:39:39 ............................................................  60 / 206 (29%)
19-Jul-2017 14:40:03 ............................................................ 120 / 206 (58%)
19-Jul-2017 14:40:23 ............................................................ 180 / 206 (87%)
19-Jul-2017 14:40:31 ..........................
19-Jul-2017 14:40:31
19-Jul-2017 14:40:31 Time: 1 mins, 2.84 secs; Memory: 60.5Mb
19-Jul-2017 14:40:31
19-Jul-2017 14:40:32
19-Jul-2017 14:40:32
19-Jul-2017 14:40:32 Time: 17ms; Memory: 3.5Mb
19-Jul-2017 14:40:32
19-Jul-2017 14:40:32
19-Jul-2017 14:40:32 BUILD FINISHED
19-Jul-2017 14:40:32
19-Jul-2017 14:40:32 Total time: 2 minutes  59.28 seconds
19-Jul-2017 14:40:32
19-Jul-2017 14:40:32 Finished task 'Run sniffs' with result: Success
19-Jul-2017 14:40:32 Skipping execution of task 'Run tests' as it is disabled
19-Jul-2017 14:40:32
Substituting variable: ${bamboo.working.directory} with /home/bamboo/xml-data/build-dir/PHPBB3-PR-JOB1
19-Jul-2017 14:40:32 Starting task 'Run tests' of type 'com.atlassian.bamboo.plugins.bamboo-docker-plugin:task.docker.cli'
19-Jul-2017 14:40:32 Running image name (phpbb:php-5.6)
19-Jul-2017 14:40:32
Beginning to execute external process for build 'phpBB3 - Pull Requests - Build and Test Job #7363 (PHPBB3-PR-JOB1-7363)'
... running command line:
/usr/bin/docker run --volume /home/bamboo/xml-data/build-dir/PHPBB3-PR-JOB1:/data --workdir /data --rm -u=991 -t phpbb:php-5.6 /bin/bash -c phpBB/vendor/bin/phpunit --log-junit build/logs/phpunit.xml
... in: /home/bamboo/xml-data/build-dir/PHPBB3-PR-JOB1
... using extra environment variables:
bamboo_planRepository_1_branch=3.1.x
bamboo_planRepository_1_branchDisplayName=3.1.x
bamboo_repository_revision_number=65aaef1f83920fc25266fbea5608427bb930f329
bamboo_PRref=master
bamboo_resultsUrl=https://bamboo.phpbb.com/browse/PHPBB3-PR-JOB1-7363
bamboo_capability_system_builder_command_Git=/usr/bin/git
bamboo_repository_75956235_git_username=bantu
bamboo_planRepository_1_name=phpBB Ascraeus
bamboo_build_working_directory=/home/bamboo/xml-data/build-dir/PHPBB3-PR-JOB1
bamboo_buildKey=PHPBB3-PR-JOB1
bamboo_capability_phpbb_tests=true
bamboo_shortPlanName=Pull Requests
bamboo_capability_system_builder_command_fop=/usr/bin/fop
bamboo_capability_dbms_sqlite_2=true
bamboo_planRepository_name=phpBB Ascraeus
bamboo_PRnumber=4847
bamboo_buildNumber=7363
bamboo_repository_75956235_git_repositoryUrl=https://github.com/phpbb/phpbb.git
bamboo_capability_system_builder_phpunit_PHPUnit=/usr/bin/phpunit
bamboo_shortJobName=Build and Test Job
bamboo_buildResultsUrl=https://bamboo.phpbb.com/browse/PHPBB3-PR-JOB1-7363
bamboo_repository_75956235_branch_name=3.1.x
bamboo_planRepository_repositoryUrl=https://github.com/phpbb/phpbb.git
bamboo_agentId=131073
bamboo_planName=phpBB3 - Pull Requests
bamboo_build_commandline_com_atlassian_bamboo_plugins_scripttask_task_builder_script_7=/bin/sh /home/bamboo/temp/PHPBB3-PR-JOB1-7363-ScriptBuildTask-8243141473340957309.sh
bamboo_shortPlanKey=PR
bamboo_shortJobKey=JOB1
bamboo_capability_dbms_mysql_55=true
bamboo_capability_system_jdk_JDK_1_7_0_65=/usr/lib/jvm/java-7-openjdk-amd64
bamboo_planRepository_revision=65aaef1f83920fc25266fbea5608427bb930f329
bamboo_repository_previous_revision_number=65aaef1f83920fc25266fbea5608427bb930f329
bamboo_buildTimeStamp=2017-07-19T14:37:05.708Z
bamboo_planRepository_previousRevision=65aaef1f83920fc25266fbea5608427bb930f329
bamboo_capability_system_builder_mvn2_Maven_2=/usr/share/maven2
bamboo_capability_system_jdk_JDK_1_6_0_16=/usr/lib/jvm/java-6-sun-1.6.0.16
bamboo_build_commandline_com_atlassian_bamboo_plugins_scripttask_task_builder_script_4=/bin/sh /home/bamboo/temp/PHPBB3-PR-JOB1-7363-ScriptBuildTask-2484804473540715748.sh
bamboo_buildResultKey=PHPBB3-PR-JOB1-7363
bamboo_repository_git_branch=3.1.x
bamboo_repository_branch_name=3.1.x
bamboo_buildPlanName=phpBB3 - Pull Requests - Build and Test Job
bamboo_planRepository_1_revision=65aaef1f83920fc25266fbea5608427bb930f329
bamboo_repository_name=phpBB Ascraeus
bamboo_buildFailed=false
bamboo_capability_system_docker_executable=/usr/bin/docker
bamboo_build_commandline_com_atlassian_bamboo_plugins_bamboo_docker_plugin_task_docker_cli_11=/usr/bin/docker run --volume /home/bamboo/xml-data/build-dir/PHPBB3-PR-JOB1:/data --workdir /data/build --rm -u=991 phpbb:php-5.6 ../phpBB/vendor/bin/phing sniff
bamboo_build_commandline_com_atlassian_bamboo_plugins_bamboo_docker_plugin_task_docker_cli_12=/usr/bin/docker run --volume /home/bamboo/xml-data/build-dir/PHPBB3-PR-JOB1:/data --workdir /data/phpBB --rm -e HOME=/home/bamboo -u=991 phpbb:php-5.6 /bin/bash -c php ../composer.phar install --dev; cd ../build; ../phpBB/vendor/bin/phing clean prepare
bamboo_planRepository_branch=3.1.x
bamboo_agentWorkingDirectory=/home/bamboo/xml-data/build-dir
bamboo_capability_system_git_executable=/usr/bin/git
bamboo_planRepository_1_previousRevision=65aaef1f83920fc25266fbea5608427bb930f329
bamboo_capability_system_builder_phpunit_PHPUnit_3_4=/usr/bin/phpunit
bamboo_repository_git_username=bantu
bamboo_repository_75956235_revision_number=65aaef1f83920fc25266fbea5608427bb930f329
bamboo_planRepository_branchDisplayName=3.1.x
bamboo_planRepository_1_type=gitv2
bamboo_planRepository_branchName=3.1.x
bamboo_repository_75956235_previous_revision_number=65aaef1f83920fc25266fbea5608427bb930f329
bamboo_capability_system_jdk_JDK=/usr/lib/jvm/java-6-sun
bamboo_plan_storageTag=PHPBB3-PR
bamboo_planRepository_type=gitv2
bamboo_planRepository_1_username=bantu
bamboo_ManualBuildTriggerReason_userName=Build Robot
bamboo_repository_git_repositoryUrl=https://github.com/phpbb/phpbb.git
bamboo_repository_75956235_git_branch=3.1.x
bamboo_capability_system_builder_ant_Ant=/usr/share/ant
bamboo_repository_75956235_name=phpBB Ascraeus
bamboo_working_directory=/home/bamboo/xml-data/build-dir/PHPBB3-PR-JOB1
bamboo_planKey=PHPBB3-PR
bamboo_planRepository_1_repositoryUrl=https://github.com/phpbb/phpbb.git
bamboo_planRepository_username=bantu
bamboo_capability_local=true
bamboo_capability_system_jdk_JDK_1_6=/usr/lib/jvm/java-6-sun
bamboo_capability_system_jdk_JDK_1_7=/usr/lib/jvm/java-7-openjdk-amd64
bamboo_planRepository_1_branchName=3.1.x
19-Jul-2017 14:40:35 PHPUnit 5.7.21 by Sebastian Bergmann and contributors.
19-Jul-2017 14:40:35
19-Jul-2017 14:40:44 .............................................................   61 / 6986 (  0%)
19-Jul-2017 14:40:45 .............................................................  122 / 6986 (  1%)
19-Jul-2017 14:40:46 .............I.....SSSS............SSSS.........S...S........  183 / 6986 (  2%)
19-Jul-2017 14:40:48 .............................................................  244 / 6986 (  3%)
19-Jul-2017 14:40:54 .S...........................................................  305 / 6986 (  4%)
19-Jul-2017 14:40:55 .............................................................  366 / 6986 (  5%)
19-Jul-2017 14:40:55 .............................................................  427 / 6986 (  6%)
19-Jul-2017 14:40:56 .............................................................  488 / 6986 (  6%)
19-Jul-2017 14:40:57 .............................................................  549 / 6986 (  7%)
19-Jul-2017 14:40:58 .............................................................  610 / 6986 (  8%)
19-Jul-2017 14:40:59 .............................................................  671 / 6986 (  9%)
19-Jul-2017 14:40:59 .............................................................  732 / 6986 ( 10%)
19-Jul-2017 14:41:00 .............................................................  793 / 6986 ( 11%)
19-Jul-2017 14:41:01 .............................................................  854 / 6986 ( 12%)
19-Jul-2017 14:41:02 .............................................................  915 / 6986 ( 13%)
19-Jul-2017 14:41:03 .............................................................  976 / 6986 ( 13%)
19-Jul-2017 14:41:04 ............................................................. 1037 / 6986 ( 14%)
19-Jul-2017 14:41:08 ............................................I................ 1098 / 6986 ( 15%)
19-Jul-2017 14:41:14 ............................................................. 1159 / 6986 ( 16%)
19-Jul-2017 14:41:16 ............................................................. 1220 / 6986 ( 17%)
19-Jul-2017 14:41:18 ............S.S.S............................................ 1281 / 6986 ( 18%)
19-Jul-2017 14:41:19 ............................................................. 1342 / 6986 ( 19%)
19-Jul-2017 14:41:19 ............................................................. 1403 / 6986 ( 20%)
19-Jul-2017 14:41:19 ............................................................. 1464 / 6986 ( 20%)
19-Jul-2017 14:41:19 ............................................................. 1525 / 6986 ( 21%)
19-Jul-2017 14:41:20 ............................................................. 1586 / 6986 ( 22%)
19-Jul-2017 14:41:20 ............................................................. 1647 / 6986 ( 23%)
19-Jul-2017 14:41:20 ............................................................. 1708 / 6986 ( 24%)
19-Jul-2017 14:41:20 ............................................................. 1769 / 6986 ( 25%)
19-Jul-2017 14:41:20 ............................................................. 1830 / 6986 ( 26%)
19-Jul-2017 14:41:21 ............................................................. 1891 / 6986 ( 27%)
19-Jul-2017 14:41:21 ............................................................. 1952 / 6986 ( 27%)
19-Jul-2017 14:41:21 ............................................................. 2013 / 6986 ( 28%)
19-Jul-2017 14:41:22 ............................................................. 2074 / 6986 ( 29%)
19-Jul-2017 14:41:23 ............................................................. 2135 / 6986 ( 30%)
19-Jul-2017 14:41:24 ............................................................. 2196 / 6986 ( 31%)
19-Jul-2017 14:41:24 ............................................................. 2257 / 6986 ( 32%)
19-Jul-2017 14:41:25 ............................................................. 2318 / 6986 ( 33%)
19-Jul-2017 14:41:27 ...................I.II...................................... 2379 / 6986 ( 34%)
19-Jul-2017 14:41:27 ............................................................. 2440 / 6986 ( 34%)
19-Jul-2017 14:41:28 ............................................................. 2501 / 6986 ( 35%)
19-Jul-2017 14:41:28 ............................................................. 2562 / 6986 ( 36%)
19-Jul-2017 14:41:31 ............................................................. 2623 / 6986 ( 37%)
19-Jul-2017 14:41:32 ............................................................. 2684 / 6986 ( 38%)
19-Jul-2017 14:41:32 .......................................................SSSSSS 2745 / 6986 ( 39%)
19-Jul-2017 14:41:32 SSS.......................................................... 2806 / 6986 ( 40%)
19-Jul-2017 14:41:41 ............................................................. 2867 / 6986 ( 41%)
19-Jul-2017 14:41:45 ............................................................. 2928 / 6986 ( 41%)
19-Jul-2017 14:41:48 ...............................S............................. 2989 / 6986 ( 42%)
19-Jul-2017 14:41:49 ........FW................................................... 3050 / 6986 ( 43%)
19-Jul-2017 14:41:57 ...............................EEEEEEEEEE.................... 3111 / 6986 ( 44%)
19-Jul-2017 14:42:02 ............................................................. 3172 / 6986 ( 45%)
19-Jul-2017 14:42:14 ............................................................. 3233 / 6986 ( 46%)
19-Jul-2017 14:42:14 ............................................................. 3294 / 6986 ( 47%)
19-Jul-2017 14:42:15 ............................................................. 3355 / 6986 ( 48%)
19-Jul-2017 14:42:15 ............................................................. 3416 / 6986 ( 48%)
19-Jul-2017 14:42:16 ............................................................. 3477 / 6986 ( 49%)
19-Jul-2017 14:42:16 ............................................................. 3538 / 6986 ( 50%)
19-Jul-2017 14:42:16 ............................................................. 3599 / 6986 ( 51%)
19-Jul-2017 14:42:16 ............................................................. 3660 / 6986 ( 52%)
19-Jul-2017 14:42:17 ............................................................. 3721 / 6986 ( 53%)
19-Jul-2017 14:42:19 ............................................................. 3782 / 6986 ( 54%)
19-Jul-2017 14:42:20 ............................................................. 3843 / 6986 ( 55%)
19-Jul-2017 14:42:23 ............................................................. 3904 / 6986 ( 55%)
19-Jul-2017 14:42:24 ............................................................. 3965 / 6986 ( 56%)
19-Jul-2017 14:42:26 ............................................................. 4026 / 6986 ( 57%)
19-Jul-2017 14:42:31 ............................................................. 4087 / 6986 ( 58%)
19-Jul-2017 14:42:38 ............................................................. 4148 / 6986 ( 59%)
19-Jul-2017 14:42:38 ............................................................. 4209 / 6986 ( 60%)
19-Jul-2017 14:42:39 ............................................................. 4270 / 6986 ( 61%)
19-Jul-2017 14:42:39 ............................................................. 4331 / 6986 ( 61%)
19-Jul-2017 14:42:40 ............................................................. 4392 / 6986 ( 62%)
19-Jul-2017 14:42:40 ............................................................. 4453 / 6986 ( 63%)
19-Jul-2017 14:42:40 ............................................................. 4514 / 6986 ( 64%)
19-Jul-2017 14:42:40 ............................................................. 4575 / 6986 ( 65%)
19-Jul-2017 14:42:40 ............................................................. 4636 / 6986 ( 66%)
19-Jul-2017 14:42:40 ............................................................. 4697 / 6986 ( 67%)
19-Jul-2017 14:42:41 ............................................................. 4758 / 6986 ( 68%)
19-Jul-2017 14:42:57 ...........................................................S. 4819 / 6986 ( 68%)
19-Jul-2017 14:43:05 ............................................................. 4880 / 6986 ( 69%)
19-Jul-2017 14:43:13 ............................................................. 4941 / 6986 ( 70%)
19-Jul-2017 14:43:16 ............................................................. 5002 / 6986 ( 71%)
19-Jul-2017 14:43:17 ............................................................. 5063 / 6986 ( 72%)
19-Jul-2017 14:43:18 ............................................................. 5124 / 6986 ( 73%)
19-Jul-2017 14:43:18 ............................................................. 5185 / 6986 ( 74%)
19-Jul-2017 14:43:18 ..............SSSSSSSSSSSSSSSSSSSSSSSSSSSSSSSSSSSSSSSSSSSSSSS 5246 / 6986 ( 75%)
19-Jul-2017 14:43:18 SSSSSSSSSSSSSSSSSSSSSSSSSSSSSSSSSSSSSSSSSSSSSSSSSSSSSSSSSSSSS 5307 / 6986 ( 75%)
19-Jul-2017 14:43:18 SSSSSSSSSSSSSSSSSSSSSSSSSSSSSSSSSSSSSSSSSSSSSSSSSSSSSSSSSSSSS 5368 / 6986 ( 76%)
19-Jul-2017 14:43:18 SSSSSSSSSSSSSSSSSSSSSSSSSSSSSSSSSSSSSSSSSSSSSSSSSSSSSSSSSSSSS 5429 / 6986 ( 77%)
19-Jul-2017 14:43:20 SSSSSSSSSSSSSSSSSSSSSSSSSSSSSSS.............................. 5490 / 6986 ( 78%)
19-Jul-2017 14:43:22 ............................................................. 5551 / 6986 ( 79%)
19-Jul-2017 14:43:23 ............................................................. 5612 / 6986 ( 80%)
19-Jul-2017 14:43:25 ............................................................. 5673 / 6986 ( 81%)
19-Jul-2017 14:43:28 ............................................................. 5734 / 6986 ( 82%)
19-Jul-2017 14:43:29 ............................................................. 5795 / 6986 ( 82%)
19-Jul-2017 14:43:31 ............................................................. 5856 / 6986 ( 83%)
19-Jul-2017 14:43:33 ............................................................. 5917 / 6986 ( 84%)
19-Jul-2017 14:43:35 ............................................................. 5978 / 6986 ( 85%)
19-Jul-2017 14:43:37 ............................................................. 6039 / 6986 ( 86%)
19-Jul-2017 14:43:39 ............................................................. 6100 / 6986 ( 87%)
19-Jul-2017 14:43:41 ............................................................. 6161 / 6986 ( 88%)
19-Jul-2017 14:43:43 ............................................................. 6222 / 6986 ( 89%)
19-Jul-2017 14:43:44 ............................................................. 6283 / 6986 ( 89%)
19-Jul-2017 14:43:46 ............................................................. 6344 / 6986 ( 90%)
19-Jul-2017 14:43:48 ............................................................. 6405 / 6986 ( 91%)
19-Jul-2017 14:43:50 ............................................................. 6466 / 6986 ( 92%)
19-Jul-2017 14:43:52 ............................................................. 6527 / 6986 ( 93%)
19-Jul-2017 14:43:54 ............................................................. 6588 / 6986 ( 94%)
19-Jul-2017 14:43:55 ............................................................. 6649 / 6986 ( 95%)
19-Jul-2017 14:43:57 ............................................................. 6710 / 6986 ( 96%)
19-Jul-2017 14:43:59 ............................................................. 6771 / 6986 ( 96%)
19-Jul-2017 14:44:01 ............................................................. 6832 / 6986 ( 97%)
19-Jul-2017 14:44:03 ............................................................. 6893 / 6986 ( 98%)
19-Jul-2017 14:44:04 ............................................................. 6954 / 6986 ( 99%)
19-Jul-2017 14:44:05 ..............................SS                              6986 / 6986 (100%)
19-Jul-2017 14:44:05
19-Jul-2017 14:44:05 Time: 3.55 minutes, Memory: 434.50MB
19-Jul-2017 14:44:05
19-Jul-2017 14:44:05 There were 10 errors:
19-Jul-2017 14:44:05
19-Jul-2017 14:44:05 1) phpbb_notification_submit_post_type_bookmark_test::test_submit_post with data set #0 (array(), array(array(5, 1, 1)), array(array(3, 2, 1), array(5, 1, 1), array(7, 2, 1)))
19-Jul-2017 14:44:05 phpbb\notification\exception: NOTIFICATION_TYPE_NOT_EXIST
19-Jul-2017 14:44:05
19-Jul-2017 14:44:05 /data/phpBB/phpbb/notification/manager.php:926
19-Jul-2017 14:44:05 /data/phpBB/phpbb/notification/manager.php:962
19-Jul-2017 14:44:05 /data/phpBB/phpbb/notification/manager.php:209
19-Jul-2017 14:44:05 /data/phpBB/includes/functions.php:807
19-Jul-2017 14:44:05 /data/phpBB/includes/functions_posting.php:2196
19-Jul-2017 14:44:05 /data/tests/notification/submit_post_base.php:171
19-Jul-2017 14:44:05
19-Jul-2017 14:44:05 2) phpbb_notification_submit_post_type_bookmark_test::test_submit_post with data set #1 (array(false), array(array(5, 1, 1)), array(array(5, 1, 1)))
19-Jul-2017 14:44:05 phpbb\notification\exception: NOTIFICATION_TYPE_NOT_EXIST
19-Jul-2017 14:44:05
19-Jul-2017 14:44:05 /data/phpBB/phpbb/notification/manager.php:926
19-Jul-2017 14:44:05 /data/phpBB/phpbb/notification/manager.php:962
19-Jul-2017 14:44:05 /data/phpBB/phpbb/notification/manager.php:209
19-Jul-2017 14:44:05 /data/phpBB/includes/functions.php:807
19-Jul-2017 14:44:05 /data/phpBB/includes/functions_posting.php:2196
19-Jul-2017 14:44:05 /data/tests/notification/submit_post_base.php:171
19-Jul-2017 14:44:05
19-Jul-2017 14:44:05 3) phpbb_notification_submit_post_type_post_in_queue_test::test_submit_post with data set #0 (array(), array(array(6, 1, 1)), array(array(6, 1, 1)))
19-Jul-2017 14:44:05 phpbb\notification\exception: NOTIFICATION_TYPE_NOT_EXIST
19-Jul-2017 14:44:05
19-Jul-2017 14:44:05 /data/phpBB/phpbb/notification/manager.php:926
19-Jul-2017 14:44:05 /data/phpBB/phpbb/notification/manager.php:962
19-Jul-2017 14:44:05 /data/phpBB/phpbb/notification/manager.php:209
19-Jul-2017 14:44:05 /data/phpBB/includes/functions.php:807
19-Jul-2017 14:44:05 /data/phpBB/includes/functions_posting.php:2196
19-Jul-2017 14:44:05 /data/tests/notification/submit_post_base.php:171
19-Jul-2017 14:44:05
19-Jul-2017 14:44:05 4) phpbb_notification_submit_post_type_post_in_queue_test::test_submit_post with data set #1 (array(false), array(array(6, 1, 1)), array(array(3, 2, 1), array(6, 1, 1), array(6, 2, 1), array(8, 2, 1), array(9, 2, 1)))
19-Jul-2017 14:44:05 phpbb\notification\exception: NOTIFICATION_TYPE_NOT_EXIST
19-Jul-2017 14:44:05
19-Jul-2017 14:44:05 /data/phpBB/phpbb/notification/manager.php:926
19-Jul-2017 14:44:05 /data/phpBB/phpbb/notification/manager.php:962
19-Jul-2017 14:44:05 /data/phpBB/phpbb/notification/manager.php:209
19-Jul-2017 14:44:05 /data/phpBB/includes/functions.php:807
19-Jul-2017 14:44:05 /data/phpBB/includes/functions_posting.php:2196
19-Jul-2017 14:44:05 /data/tests/notification/submit_post_base.php:171
19-Jul-2017 14:44:05
19-Jul-2017 14:44:05 5) phpbb_notification_submit_post_type_post_test::test_submit_post with data set #0 (array(), array(array(5, 1, 1), array(8, 1, 1)), array(array(3, 2, 1), array(5, 1, 1), array(6, 2, 1), array(7, 2, 1), array(8, 1, 1)))
19-Jul-2017 14:44:05 phpbb\notification\exception: NOTIFICATION_TYPE_NOT_EXIST
19-Jul-2017 14:44:05
19-Jul-2017 14:44:05 /data/phpBB/phpbb/notification/manager.php:926
19-Jul-2017 14:44:05 /data/phpBB/phpbb/notification/manager.php:962
19-Jul-2017 14:44:05 /data/phpBB/phpbb/notification/manager.php:209
19-Jul-2017 14:44:05 /data/phpBB/includes/functions.php:807
19-Jul-2017 14:44:05 /data/phpBB/includes/functions_posting.php:2196
19-Jul-2017 14:44:05 /data/tests/notification/submit_post_base.php:171
19-Jul-2017 14:44:05
19-Jul-2017 14:44:05 6) phpbb_notification_submit_post_type_post_test::test_submit_post with data set #1 (array(false), array(array(5, 1, 1), array(8, 1, 1)), array(array(5, 1, 1), array(8, 1, 1)))
19-Jul-2017 14:44:05 phpbb\notification\exception: NOTIFICATION_TYPE_NOT_EXIST
19-Jul-2017 14:44:05
19-Jul-2017 14:44:05 /data/phpBB/phpbb/notification/manager.php:926
19-Jul-2017 14:44:05 /data/phpBB/phpbb/notification/manager.php:962
19-Jul-2017 14:44:05 /data/phpBB/phpbb/notification/manager.php:209
19-Jul-2017 14:44:05 /data/phpBB/includes/functions.php:807
19-Jul-2017 14:44:05 /data/phpBB/includes/functions_posting.php:2196
19-Jul-2017 14:44:05 /data/tests/notification/submit_post_base.php:171
19-Jul-2017 14:44:05
19-Jul-2017 14:44:05 7) phpbb_notification_submit_post_type_quote_test::test_submit_post with data set #0 (array('<r><QUOTE author="poster"><s>...E></r>', 'uid'), array(array(5, 1, 1)), array(array(3, 2, 1), array(5, 1, 1), array(5, 2, 1), array(7, 2, 1)))
19-Jul-2017 14:44:05 phpbb\notification\exception: NOTIFICATION_TYPE_NOT_EXIST
19-Jul-2017 14:44:05
19-Jul-2017 14:44:05 /data/phpBB/phpbb/notification/manager.php:926
19-Jul-2017 14:44:05 /data/phpBB/phpbb/notification/manager.php:962
19-Jul-2017 14:44:05 /data/phpBB/phpbb/notification/manager.php:209
19-Jul-2017 14:44:05 /data/phpBB/includes/functions.php:807
19-Jul-2017 14:44:05 /data/phpBB/includes/functions_posting.php:2196
19-Jul-2017 14:44:05 /data/tests/notification/submit_post_base.php:171
19-Jul-2017 14:44:05
19-Jul-2017 14:44:05 8) phpbb_notification_submit_post_type_quote_test::test_submit_post with data set #1 (array('<r><QUOTE author="poster"><s>...E></r>', 'uid', false), array(array(5, 1, 1)), array(array(5, 1, 1)))
19-Jul-2017 14:44:05 phpbb\notification\exception: NOTIFICATION_TYPE_NOT_EXIST
19-Jul-2017 14:44:05
19-Jul-2017 14:44:05 /data/phpBB/phpbb/notification/manager.php:926
19-Jul-2017 14:44:05 /data/phpBB/phpbb/notification/manager.php:962
19-Jul-2017 14:44:05 /data/phpBB/phpbb/notification/manager.php:209
19-Jul-2017 14:44:05 /data/phpBB/includes/functions.php:807
19-Jul-2017 14:44:05 /data/phpBB/includes/functions_posting.php:2196
19-Jul-2017 14:44:05 /data/tests/notification/submit_post_base.php:171
19-Jul-2017 14:44:05
19-Jul-2017 14:44:05 9) phpbb_notification_submit_post_type_topic_test::test_submit_post with data set #0 (array(), array(array(8, 1, 1)), array(array(7, 2, 1), array(8, 1, 1), array(8, 2, 1)))
19-Jul-2017 14:44:05 phpbb\notification\exception: NOTIFICATION_TYPE_NOT_EXIST
19-Jul-2017 14:44:05
19-Jul-2017 14:44:05 /data/phpBB/phpbb/notification/manager.php:926
19-Jul-2017 14:44:05 /data/phpBB/phpbb/notification/manager.php:962
19-Jul-2017 14:44:05 /data/phpBB/phpbb/notification/manager.php:209
19-Jul-2017 14:44:05 /data/phpBB/includes/functions.php:807
19-Jul-2017 14:44:05 /data/phpBB/includes/functions_posting.php:2196
19-Jul-2017 14:44:05 /data/tests/notification/submit_post_type_topic_test.php:111
19-Jul-2017 14:44:05
19-Jul-2017 14:44:05 10) phpbb_notification_submit_post_type_topic_test::test_submit_post with data set #1 (array(false), array(array(8, 1, 1)), array(array(8, 1, 1)))
19-Jul-2017 14:44:05 phpbb\notification\exception: NOTIFICATION_TYPE_NOT_EXIST
19-Jul-2017 14:44:05
19-Jul-2017 14:44:05 /data/phpBB/phpbb/notification/manager.php:926
19-Jul-2017 14:44:05 /data/phpBB/phpbb/notification/manager.php:962
19-Jul-2017 14:44:05 /data/phpBB/phpbb/notification/manager.php:209
19-Jul-2017 14:44:05 /data/phpBB/includes/functions.php:807
19-Jul-2017 14:44:05 /data/phpBB/includes/functions_posting.php:2196
19-Jul-2017 14:44:05 /data/tests/notification/submit_post_type_topic_test.php:111
19-Jul-2017 14:44:05
19-Jul-2017 14:44:05 --
19-Jul-2017 14:44:05
19-Jul-2017 14:44:05 There was 1 warning:
19-Jul-2017 14:44:05
19-Jul-2017 14:44:05 1) phpbb_user_mention_test::test_handle
19-Jul-2017 14:44:05 PHPUnit_Framework_TestCase::getMock() is deprecated, use PHPUnit_Framework_TestCase::createMock() or PHPUnit_Framework_TestCase::getMockBuilder() instead
19-Jul-2017 14:44:05
19-Jul-2017 14:44:05 --
19-Jul-2017 14:44:05
19-Jul-2017 14:44:05 There was 1 failure:
19-Jul-2017 14:44:05
19-Jul-2017 14:44:05 1) phpbb_mention_helper_test::test_get_mentioned_users
19-Jul-2017 14:44:05 Failed asserting that two strings are equal.
19-Jul-2017 14:44:05 --- Expected
19-Jul-2017 14:44:05 +++ Actual
19-Jul-2017 14:44:05 @@ @@
19-Jul-2017 14:44:05 -'cbwkf kfbwkef wkfwb @robdyrdek vghjgjdsrshc ftfkyugb buykyuf yiglyftydtrf gyg ygiy @RickyBahner vgjdrs jfytg jbhjv ygfjh @HackMurphy kdnkwe [url = #]@andream[/url] [url = http://www.google.com]google[/url]wifhr [url = http://localhost/phpbb/phpBB/memberlist.php?mode=viewprofile&u=13]LindsayM[/url] wewe [url = http://localhost/phpbb/phpBB/memberlist.php?mode=viewprofile&u=13] @LindsayM [/url][url=http://memberlist.php?mode=viewprofile&u=2]admin[/url][url=http://memberlist.php?mode=viewprofile&u=2]admin[/url] dwjpfw [url=http://memberlist.php?mode=viewprofile&u=2]admin[/url]'
19-Jul-2017 14:44:05 +'cbwkf kfbwkef wkfwb @robdyrdek vghjgjdsrshc ftfkyugb buykyuf yiglyftydtrf gyg ygiy @RickyBahner vgjdrs jfytg jbhjv ygfjh @HackMurphy kdnkwe [url = #]@andream[/url] [url = http://www.google.com]google[/url]wifhr [url = http://localhost/phpbb/phpBB/memberlist.php?mode=viewprofile&u=13]LindsayM[/url] wewe [url = http://localhost/phpbb/phpBB/memberlist.php?mode=viewprofile&u=13] @LindsayM [/url][url=http://testhost/memberlist.php?mode=viewprofile&u=2]admin[/url][url=http://testhost/memberlist.php?mode=viewprofile&u=2]admin[/url] dwjpfw [url=http://testhost/memberlist.php?mode=viewprofile&u=2]admin[/url]'
19-Jul-2017 14:44:05
19-Jul-2017 14:44:05 /data/tests/mention/mention_helper_test.php:49
19-Jul-2017 14:44:05
19-Jul-2017 14:44:05 ERRORS!
19-Jul-2017 14:44:05 Tests: 9268, Assertions: 58454, Errors: 10, Failures: 1, Warnings: 1, Skipped: 288, Incomplete: 5.
19-Jul-2017 14:44:07 Failing task since return code of [/usr/bin/docker run --volume /home/bamboo/xml-data/build-dir/PHPBB3-PR-JOB1:/data --workdir /data --rm -u=991 -t phpbb:php-5.6 /bin/bash -c phpBB/vendor/bin/phpunit --log-junit build/logs/phpunit.xml] was 2 while expected 0
19-Jul-2017 14:44:07 Error occurred while running Task 'Run tests(10)' of type com.atlassian.bamboo.plugins.bamboo-docker-plugin:task.docker.cli.
19-Jul-2017 14:44:07 com.atlassian.bamboo.task.TaskException: Failed to execute task
19-Jul-2017 14:44:07         at com.atlassian.bamboo.plugins.docker.service.RunService.execute(RunService.java:71)
19-Jul-2017 14:44:07         at com.atlassian.bamboo.plugins.docker.tasks.cli.DockerCliTask.execute(DockerCliTask.java:64)
19-Jul-2017 14:44:07         at com.atlassian.bamboo.task.TaskExecutorImpl.lambda$executeTasks$3(TaskExecutorImpl.java:284)
19-Jul-2017 14:44:07         at com.atlassian.bamboo.task.TaskExecutorImpl.executeTaskWithPrePostActions(TaskExecutorImpl.java:223)
19-Jul-2017 14:44:07         at com.atlassian.bamboo.task.TaskExecutorImpl.executeTasks(TaskExecutorImpl.java:284)
19-Jul-2017 14:44:07         at com.atlassian.bamboo.task.TaskExecutorImpl.execute(TaskExecutorImpl.java:111)
19-Jul-2017 14:44:07         at com.atlassian.bamboo.build.pipeline.tasks.ExecuteBuildTask.call(ExecuteBuildTask.java:69)
19-Jul-2017 14:44:07         at com.atlassian.bamboo.v2.build.agent.DefaultBuildAgent.build(DefaultBuildAgent.java:185)
19-Jul-2017 14:44:07         at com.atlassian.bamboo.v2.build.agent.BuildAgentControllerImpl$1.call(BuildAgentControllerImpl.java:122)
19-Jul-2017 14:44:07         at com.atlassian.bamboo.v2.build.agent.BuildAgentControllerImpl$1.call(BuildAgentControllerImpl.java:115)
19-Jul-2017 14:44:07         at com.atlassian.bamboo.variable.CustomVariableContextImpl.withVariableSubstitutor(CustomVariableContextImpl.java:185)
19-Jul-2017 14:44:07         at com.atlassian.bamboo.v2.build.agent.BuildAgentControllerImpl.waitAndPerformBuild(BuildAgentControllerImpl.java:115)
19-Jul-2017 14:44:07         at com.atlassian.bamboo.v2.build.agent.DefaultBuildAgent$1.run(DefaultBuildAgent.java:126)
19-Jul-2017 14:44:07         at com.atlassian.bamboo.utils.BambooRunnables$1.run(BambooRunnables.java:47)
19-Jul-2017 14:44:07         at com.atlassian.bamboo.security.ImpersonationHelper.runWith(ImpersonationHelper.java:26)
19-Jul-2017 14:44:07         at com.atlassian.bamboo.security.ImpersonationHelper.runWithSystemAuthority(ImpersonationHelper.java:17)
19-Jul-2017 14:44:07         at com.atlassian.bamboo.security.ImpersonationHelper$1.run(ImpersonationHelper.java:41)
19-Jul-2017 14:44:07         at java.lang.Thread.run(Thread.java:748)
19-Jul-2017 14:44:07 Caused by: com.atlassian.bamboo.plugins.docker.client.DockerException: Error running Docker run command
19-Jul-2017 14:44:07         at com.atlassian.bamboo.plugins.docker.client.DockerCmd.run(DockerCmd.java:103)
19-Jul-2017 14:44:07         at com.atlassian.bamboo.plugins.docker.service.RunService.execute(RunService.java:60)
19-Jul-2017 14:44:07         ... 17 more
19-Jul-2017 14:44:07 Caused by: com.atlassian.utils.process.ProcessException: Error executing /usr/bin/docker run --volume /home/bamboo/xml-data/build-dir/PHPBB3-PR-JOB1:/data --workdir /data --rm -u=991 -t phpbb:php-5.6 /bin/bash -c "phpBB/vendor/bin/phpunit --log-junit build/logs/phpunit.xml"
19-Jul-2017 14:44:07         at com.atlassian.bamboo.plugins.docker.process.DockerTaskProcessService.execute(DockerTaskProcessService.java:60)
19-Jul-2017 14:44:07         at com.atlassian.bamboo.plugins.docker.client.DockerCmd.run(DockerCmd.java:99)
19-Jul-2017 14:44:07         ... 18 more
19-Jul-2017 14:44:07 Starting task 'Parsing test results produced by script' of type 'com.atlassian.bamboo.plugins.testresultparser:task.testresultparser.junit'
19-Jul-2017 14:44:07 Parsing test results under /home/bamboo/xml-data/build-dir/PHPBB3-PR-JOB1...
19-Jul-2017 14:44:07 Failing task since 11 failing test cases were found.
19-Jul-2017 14:44:07 Finished task 'Parsing test results produced by script' with result: Failed
19-Jul-2017 14:44:07
Substituting variable: ${bamboo.PRnumber} with 4847
19-Jul-2017 14:44:07
Substituting variable: ${bamboo.buildResultsUrl} with https://bamboo.phpbb.com/browse/PHPBB3-PR-JOB1-7363
19-Jul-2017 14:44:07
Substituting variable: ${bamboo.buildResultsUrl} with https://bamboo.phpbb.com/browse/PHPBB3-PR-JOB1-7363
19-Jul-2017 14:44:07 Starting task 'Set result build status' of type 'com.atlassian.bamboo.plugins.scripttask:task.builder.script'
19-Jul-2017 14:44:07
Beginning to execute external process for build 'phpBB3 - Pull Requests - Build and Test Job #7363 (PHPBB3-PR-JOB1-7363)'
... running command line:
/bin/sh /home/bamboo/temp/PHPBB3-PR-JOB1-7363-ScriptBuildTask-8438811581553164477.sh
... in: /home/bamboo/xml-data/build-dir/PHPBB3-PR-JOB1
... using extra environment variables:
bamboo_planRepository_1_branch=3.1.x
bamboo_planRepository_1_branchDisplayName=3.1.x
bamboo_repository_revision_number=65aaef1f83920fc25266fbea5608427bb930f329
bamboo_PRref=master
bamboo_resultsUrl=https://bamboo.phpbb.com/browse/PHPBB3-PR-JOB1-7363
bamboo_capability_system_builder_command_Git=/usr/bin/git
bamboo_repository_75956235_git_username=bantu
bamboo_planRepository_1_name=phpBB Ascraeus
bamboo_build_working_directory=/home/bamboo/xml-data/build-dir/PHPBB3-PR-JOB1
bamboo_buildKey=PHPBB3-PR-JOB1
bamboo_capability_phpbb_tests=true
bamboo_shortPlanName=Pull Requests
bamboo_capability_system_builder_command_fop=/usr/bin/fop
bamboo_capability_dbms_sqlite_2=true
bamboo_planRepository_name=phpBB Ascraeus
bamboo_PRnumber=4847
bamboo_buildNumber=7363
bamboo_repository_75956235_git_repositoryUrl=https://github.com/phpbb/phpbb.git
bamboo_capability_system_builder_phpunit_PHPUnit=/usr/bin/phpunit
bamboo_shortJobName=Build and Test Job
bamboo_buildResultsUrl=https://bamboo.phpbb.com/browse/PHPBB3-PR-JOB1-7363
bamboo_repository_75956235_branch_name=3.1.x
bamboo_planRepository_repositoryUrl=https://github.com/phpbb/phpbb.git
bamboo_agentId=131073
bamboo_planName=phpBB3 - Pull Requests
bamboo_build_commandline_com_atlassian_bamboo_plugins_scripttask_task_builder_script_7=/bin/sh /home/bamboo/temp/PHPBB3-PR-JOB1-7363-ScriptBuildTask-8243141473340957309.sh
bamboo_shortPlanKey=PR
bamboo_shortJobKey=JOB1
bamboo_capability_dbms_mysql_55=true
bamboo_capability_system_jdk_JDK_1_7_0_65=/usr/lib/jvm/java-7-openjdk-amd64
bamboo_planRepository_revision=65aaef1f83920fc25266fbea5608427bb930f329
bamboo_repository_previous_revision_number=65aaef1f83920fc25266fbea5608427bb930f329
bamboo_buildTimeStamp=2017-07-19T14:37:05.708Z
bamboo_planRepository_previousRevision=65aaef1f83920fc25266fbea5608427bb930f329
bamboo_capability_system_builder_mvn2_Maven_2=/usr/share/maven2
bamboo_capability_system_jdk_JDK_1_6_0_16=/usr/lib/jvm/java-6-sun-1.6.0.16
bamboo_build_commandline_com_atlassian_bamboo_plugins_scripttask_task_builder_script_4=/bin/sh /home/bamboo/temp/PHPBB3-PR-JOB1-7363-ScriptBuildTask-2484804473540715748.sh
bamboo_buildResultKey=PHPBB3-PR-JOB1-7363
bamboo_repository_git_branch=3.1.x
bamboo_repository_branch_name=3.1.x
bamboo_buildPlanName=phpBB3 - Pull Requests - Build and Test Job
bamboo_planRepository_1_revision=65aaef1f83920fc25266fbea5608427bb930f329
bamboo_repository_name=phpBB Ascraeus
bamboo_buildFailed=true
bamboo_capability_system_docker_executable=/usr/bin/docker
bamboo_build_commandline_com_atlassian_bamboo_plugins_bamboo_docker_plugin_task_docker_cli_10=/usr/bin/docker run --volume /home/bamboo/xml-data/build-dir/PHPBB3-PR-JOB1:/data --workdir /data --rm -u=991 -t phpbb:php-5.6 /bin/bash -c phpBB/vendor/bin/phpunit --log-junit build/logs/phpunit.xml
bamboo_build_commandline_com_atlassian_bamboo_plugins_bamboo_docker_plugin_task_docker_cli_11=/usr/bin/docker run --volume /home/bamboo/xml-data/build-dir/PHPBB3-PR-JOB1:/data --workdir /data/build --rm -u=991 phpbb:php-5.6 ../phpBB/vendor/bin/phing sniff
bamboo_build_commandline_com_atlassian_bamboo_plugins_bamboo_docker_plugin_task_docker_cli_12=/usr/bin/docker run --volume /home/bamboo/xml-data/build-dir/PHPBB3-PR-JOB1:/data --workdir /data/phpBB --rm -e HOME=/home/bamboo -u=991 phpbb:php-5.6 /bin/bash -c php ../composer.phar install --dev; cd ../build; ../phpBB/vendor/bin/phing clean prepare
bamboo_planRepository_branch=3.1.x
bamboo_jobFailed=true
bamboo_agentWorkingDirectory=/home/bamboo/xml-data/build-dir
bamboo_capability_system_git_executable=/usr/bin/git
bamboo_planRepository_1_previousRevision=65aaef1f83920fc25266fbea5608427bb930f329
bamboo_capability_system_builder_phpunit_PHPUnit_3_4=/usr/bin/phpunit
bamboo_repository_git_username=bantu
bamboo_repository_75956235_revision_number=65aaef1f83920fc25266fbea5608427bb930f329
bamboo_planRepository_branchDisplayName=3.1.x
bamboo_planRepository_1_type=gitv2
bamboo_planRepository_branchName=3.1.x
bamboo_repository_75956235_previous_revision_number=65aaef1f83920fc25266fbea5608427bb930f329
bamboo_capability_system_jdk_JDK=/usr/lib/jvm/java-6-sun
bamboo_plan_storageTag=PHPBB3-PR
bamboo_planRepository_type=gitv2
bamboo_planRepository_1_username=bantu
bamboo_ManualBuildTriggerReason_userName=Build Robot
bamboo_repository_git_repositoryUrl=https://github.com/phpbb/phpbb.git
bamboo_repository_75956235_git_branch=3.1.x
bamboo_capability_system_builder_ant_Ant=/usr/share/ant
bamboo_repository_75956235_name=phpBB Ascraeus
bamboo_working_directory=/home/bamboo/xml-data/build-dir/PHPBB3-PR-JOB1
bamboo_planKey=PHPBB3-PR
bamboo_planRepository_1_repositoryUrl=https://github.com/phpbb/phpbb.git
bamboo_planRepository_username=bantu
bamboo_capability_local=true
bamboo_capability_system_jdk_JDK_1_6=/usr/lib/jvm/java-6-sun
bamboo_capability_system_jdk_JDK_1_7=/usr/lib/jvm/java-7-openjdk-amd64
bamboo_planRepository_1_branchName=3.1.x
19-Jul-2017 14:44:08 From https://github.com/phpbb/phpbb
19-Jul-2017 14:44:08 * branch            refs/pull/4847/head -> FETCH_HEAD
19-Jul-2017 14:44:08   <testsuite name="" tests="6693" assertions="58451" failures="1" errors="10" time="200.287055">
19-Jul-2017 14:44:08     <testsuite name="phpBB Test Suite" tests="5169" assertions="56927" failures="1" errors="10" time="154.402724">
19-Jul-2017 14:44:08       <testsuite name="phpbb_mention_helper_test" file="/data/tests/mention/mention_helper_test.php" tests="1" assertions="1" failures="1" errors="0" time="0.029966">
19-Jul-2017 14:44:08   % Total    % Received % Xferd  Average Speed   Time    Time     Time  Current
19-Jul-2017 14:44:08                                  Dload  Upload   Total   Spent    Left  Speed
19-Jul-2017 14:44:08
19-Jul-2017 14:44:08   0     0    0     0    0     0      0      0 --:--:-- --:--:-- --:--:--     0
19-Jul-2017 14:44:08 100   267  100    93  100   174    174    325 --:--:-- --:--:-- --:--:--   326
19-Jul-2017 14:44:08 Finished task 'Set result build status' with result: Success
19-Jul-2017 14:44:08 Running post build plugin 'NCover Results Collector'
19-Jul-2017 14:44:08 Running post build plugin 'Artifact Copier'
19-Jul-2017 14:44:08 Running post build plugin 'npm Cache Cleanup'
19-Jul-2017 14:44:08 Running post build plugin 'Clover Results Collector'
19-Jul-2017 14:44:08 Running post build plugin 'Docker Container Cleanup'
19-Jul-2017 14:44:09 Successfully removed working directory at '/home/bamboo/xml-data/build-dir/PHPBB3-PR-JOB1'
19-Jul-2017 14:44:09 Finalising the build...
19-Jul-2017 14:44:09 Stopping timer.
19-Jul-2017 14:44:09 Build PHPBB3-PR-JOB1-7363 completed.
19-Jul-2017 14:44:09 Running on server: post build plugin 'NCover Results Collector'
19-Jul-2017 14:44:09 Running on server: post build plugin 'Build Hanging Detection Configuration'
19-Jul-2017 14:44:09 Running on server: post build plugin 'Clover Delta Calculator'
19-Jul-2017 14:44:09 Running on server: post build plugin 'Maven Dependencies Postprocessor'
19-Jul-2017 14:44:09 All post build plugins have finished
19-Jul-2017 14:44:09 Generating build results summary...
19-Jul-2017 14:44:13 Saving build results to disk...
19-Jul-2017 14:44:13 Logging substituted variables...
19-Jul-2017 14:44:13 Indexing build results...
19-Jul-2017 14:44:13 Finished building PHPBB3-PR-JOB1-7363.
19-Jul-2017 14:44:13
Substituting variable: ${bamboo.PRnumber} with 4847