Tests pending pull requests

Build: #7487 failed

Job: Build and Test Job failed

Stages & jobs

  1. Build and Test

Build log

The build generated 469 lines of output. Download or view full build log

22-Aug-2017 10:19:31 Build phpBB3 - Pull Requests - Build and Test Job #7487 (PHPBB3-PR-JOB1-7487) started building on agent Default Agent
22-Aug-2017 10:19:31
22-Aug-2017 10:19:31 Build working directory is /home/bamboo/xml-data/build-dir/PHPBB3-PR-JOB1
22-Aug-2017 10:19:31 Executing build phpBB3 - Pull Requests - Build and Test Job #7487 (PHPBB3-PR-JOB1-7487)
22-Aug-2017 10:19:31 Starting task 'Checkout develop branch' of type 'com.atlassian.bamboo.plugins.vcs:task.vcs.checkout'
22-Aug-2017 10:19:31 Build always requires a clean checkout
22-Aug-2017 10:19:31 Cleaning build directory '/home/bamboo/xml-data/build-dir/PHPBB3-PR-JOB1'
22-Aug-2017 10:19:32 Updating source code to revision: fa3bdedf7bebd64336daaeff7c41b842fa098cf9
22-Aug-2017 10:19:32 Fetching 'refs/heads/3.1.x' from 'https://github.com/phpbb/phpbb.git'.
22-Aug-2017 10:19:33 Checking out revision fa3bdedf7bebd64336daaeff7c41b842fa098cf9.
22-Aug-2017 10:19:33 Creating local git repository in '/home/bamboo/xml-data/build-dir/PHPBB3-PR-JOB1/.git'.
22-Aug-2017 10:19:33 Cloning into '/home/bamboo/xml-data/build-dir/PHPBB3-PR-JOB1'...
22-Aug-2017 10:19:34 done.
22-Aug-2017 10:19:46 Branch 3.1.x set up to track remote branch 3.1.x from origin.
22-Aug-2017 10:19:46 Switched to a new branch '3.1.x'
22-Aug-2017 10:19:46 Updated source code to revision: fa3bdedf7bebd64336daaeff7c41b842fa098cf9
22-Aug-2017 10:19:46 Finished task 'Checkout develop branch' with result: Success
22-Aug-2017 10:19:46 Running pre-build action: VCS Version Collector
22-Aug-2017 10:19:46
Substituting variable: ${bamboo.PRnumber} with 4916
22-Aug-2017 10:19:46
Substituting variable: ${bamboo.buildResultsUrl} with https://bamboo.phpbb.com/browse/PHPBB3-PR-JOB1-7487
22-Aug-2017 10:19:46 Starting task 'Set pending build status' of type 'com.atlassian.bamboo.plugins.scripttask:task.builder.script'
22-Aug-2017 10:19:46
Beginning to execute external process for build 'phpBB3 - Pull Requests - Build and Test Job #7487 (PHPBB3-PR-JOB1-7487)'
... running command line:
/bin/sh /home/bamboo/temp/PHPBB3-PR-JOB1-7487-ScriptBuildTask-1771009407877498384.sh
... in: /home/bamboo/xml-data/build-dir/PHPBB3-PR-JOB1
... using extra environment variables:
bamboo_planRepository_1_branch=3.1.x
bamboo_planRepository_1_branchDisplayName=3.1.x
bamboo_repository_revision_number=fa3bdedf7bebd64336daaeff7c41b842fa098cf9
bamboo_PRref=master
bamboo_resultsUrl=https://bamboo.phpbb.com/browse/PHPBB3-PR-JOB1-7487
bamboo_capability_system_builder_command_Git=/usr/bin/git
bamboo_repository_75956235_git_username=bantu
bamboo_planRepository_1_name=phpBB Ascraeus
bamboo_build_working_directory=/home/bamboo/xml-data/build-dir/PHPBB3-PR-JOB1
bamboo_buildKey=PHPBB3-PR-JOB1
bamboo_capability_phpbb_tests=true
bamboo_shortPlanName=Pull Requests
bamboo_capability_system_builder_command_fop=/usr/bin/fop
bamboo_capability_dbms_sqlite_2=true
bamboo_planRepository_name=phpBB Ascraeus
bamboo_PRnumber=4916
bamboo_buildNumber=7487
bamboo_repository_75956235_git_repositoryUrl=https://github.com/phpbb/phpbb.git
bamboo_capability_system_builder_phpunit_PHPUnit=/usr/bin/phpunit
bamboo_shortJobName=Build and Test Job
bamboo_buildResultsUrl=https://bamboo.phpbb.com/browse/PHPBB3-PR-JOB1-7487
bamboo_repository_75956235_branch_name=3.1.x
bamboo_planRepository_repositoryUrl=https://github.com/phpbb/phpbb.git
bamboo_agentId=131073
bamboo_planName=phpBB3 - Pull Requests
bamboo_shortPlanKey=PR
bamboo_shortJobKey=JOB1
bamboo_capability_dbms_mysql_55=true
bamboo_capability_system_jdk_JDK_1_7_0_65=/usr/lib/jvm/java-7-openjdk-amd64
bamboo_planRepository_revision=fa3bdedf7bebd64336daaeff7c41b842fa098cf9
bamboo_repository_previous_revision_number=fa3bdedf7bebd64336daaeff7c41b842fa098cf9
bamboo_buildTimeStamp=2017-08-22T10:19:31.880Z
bamboo_planRepository_previousRevision=fa3bdedf7bebd64336daaeff7c41b842fa098cf9
bamboo_capability_system_builder_mvn2_Maven_2=/usr/share/maven2
bamboo_capability_system_jdk_JDK_1_6_0_16=/usr/lib/jvm/java-6-sun-1.6.0.16
bamboo_buildResultKey=PHPBB3-PR-JOB1-7487
bamboo_repository_git_branch=3.1.x
bamboo_repository_branch_name=3.1.x
bamboo_buildPlanName=phpBB3 - Pull Requests - Build and Test Job
bamboo_planRepository_1_revision=fa3bdedf7bebd64336daaeff7c41b842fa098cf9
bamboo_repository_name=phpBB Ascraeus
bamboo_buildFailed=false
bamboo_capability_system_docker_executable=/usr/bin/docker
bamboo_planRepository_branch=3.1.x
bamboo_agentWorkingDirectory=/home/bamboo/xml-data/build-dir
bamboo_capability_system_git_executable=/usr/bin/git
bamboo_planRepository_1_previousRevision=fa3bdedf7bebd64336daaeff7c41b842fa098cf9
bamboo_capability_system_builder_phpunit_PHPUnit_3_4=/usr/bin/phpunit
bamboo_repository_git_username=bantu
bamboo_repository_75956235_revision_number=fa3bdedf7bebd64336daaeff7c41b842fa098cf9
bamboo_planRepository_branchDisplayName=3.1.x
bamboo_planRepository_1_type=gitv2
bamboo_planRepository_branchName=3.1.x
bamboo_repository_75956235_previous_revision_number=fa3bdedf7bebd64336daaeff7c41b842fa098cf9
bamboo_capability_system_jdk_JDK=/usr/lib/jvm/java-6-sun
bamboo_plan_storageTag=PHPBB3-PR
bamboo_planRepository_type=gitv2
bamboo_planRepository_1_username=bantu
bamboo_ManualBuildTriggerReason_userName=Build Robot
bamboo_repository_git_repositoryUrl=https://github.com/phpbb/phpbb.git
bamboo_repository_75956235_git_branch=3.1.x
bamboo_capability_system_builder_ant_Ant=/usr/share/ant
bamboo_repository_75956235_name=phpBB Ascraeus
bamboo_working_directory=/home/bamboo/xml-data/build-dir/PHPBB3-PR-JOB1
bamboo_planKey=PHPBB3-PR
bamboo_planRepository_1_repositoryUrl=https://github.com/phpbb/phpbb.git
bamboo_planRepository_username=bantu
bamboo_capability_local=true
bamboo_capability_system_jdk_JDK_1_6=/usr/lib/jvm/java-6-sun
bamboo_capability_system_jdk_JDK_1_7=/usr/lib/jvm/java-7-openjdk-amd64
bamboo_planRepository_1_branchName=3.1.x
22-Aug-2017 10:19:51 From https://github.com/phpbb/phpbb
22-Aug-2017 10:19:51 * branch            refs/pull/4916/head -> FETCH_HEAD
22-Aug-2017 10:19:51   % Total    % Received % Xferd  Average Speed   Time    Time     Time  Current
22-Aug-2017 10:19:51                                  Dload  Upload   Total   Spent    Left  Speed
22-Aug-2017 10:19:51
22-Aug-2017 10:19:51   0     0    0     0    0     0      0      0 --:--:-- --:--:-- --:--:--     0
22-Aug-2017 10:19:51 100   275  100    93  100   182    184    361 --:--:-- --:--:-- --:--:--   362
22-Aug-2017 10:19:51 Finished task 'Set pending build status' with result: Success
22-Aug-2017 10:19:51
Substituting variable: ${bamboo.PRnumber} with 4916
22-Aug-2017 10:19:51 Starting task 'Fetch PR' of type 'com.atlassian.bamboo.plugins.scripttask:task.builder.script'
22-Aug-2017 10:19:51
Beginning to execute external process for build 'phpBB3 - Pull Requests - Build and Test Job #7487 (PHPBB3-PR-JOB1-7487)'
... running command line:
/bin/sh /home/bamboo/temp/PHPBB3-PR-JOB1-7487-ScriptBuildTask-1095577484097527425.sh
... in: /home/bamboo/xml-data/build-dir/PHPBB3-PR-JOB1
... using extra environment variables:
bamboo_planRepository_1_branch=3.1.x
bamboo_planRepository_1_branchDisplayName=3.1.x
bamboo_repository_revision_number=fa3bdedf7bebd64336daaeff7c41b842fa098cf9
bamboo_PRref=master
bamboo_resultsUrl=https://bamboo.phpbb.com/browse/PHPBB3-PR-JOB1-7487
bamboo_capability_system_builder_command_Git=/usr/bin/git
bamboo_repository_75956235_git_username=bantu
bamboo_planRepository_1_name=phpBB Ascraeus
bamboo_build_working_directory=/home/bamboo/xml-data/build-dir/PHPBB3-PR-JOB1
bamboo_buildKey=PHPBB3-PR-JOB1
bamboo_capability_phpbb_tests=true
bamboo_shortPlanName=Pull Requests
bamboo_capability_system_builder_command_fop=/usr/bin/fop
bamboo_capability_dbms_sqlite_2=true
bamboo_planRepository_name=phpBB Ascraeus
bamboo_PRnumber=4916
bamboo_buildNumber=7487
bamboo_repository_75956235_git_repositoryUrl=https://github.com/phpbb/phpbb.git
bamboo_capability_system_builder_phpunit_PHPUnit=/usr/bin/phpunit
bamboo_shortJobName=Build and Test Job
bamboo_buildResultsUrl=https://bamboo.phpbb.com/browse/PHPBB3-PR-JOB1-7487
bamboo_repository_75956235_branch_name=3.1.x
bamboo_planRepository_repositoryUrl=https://github.com/phpbb/phpbb.git
bamboo_agentId=131073
bamboo_planName=phpBB3 - Pull Requests
bamboo_build_commandline_com_atlassian_bamboo_plugins_scripttask_task_builder_script_7=/bin/sh /home/bamboo/temp/PHPBB3-PR-JOB1-7487-ScriptBuildTask-1771009407877498384.sh
bamboo_shortPlanKey=PR
bamboo_shortJobKey=JOB1
bamboo_capability_dbms_mysql_55=true
bamboo_capability_system_jdk_JDK_1_7_0_65=/usr/lib/jvm/java-7-openjdk-amd64
bamboo_planRepository_revision=fa3bdedf7bebd64336daaeff7c41b842fa098cf9
bamboo_repository_previous_revision_number=fa3bdedf7bebd64336daaeff7c41b842fa098cf9
bamboo_buildTimeStamp=2017-08-22T10:19:31.880Z
bamboo_planRepository_previousRevision=fa3bdedf7bebd64336daaeff7c41b842fa098cf9
bamboo_capability_system_builder_mvn2_Maven_2=/usr/share/maven2
bamboo_capability_system_jdk_JDK_1_6_0_16=/usr/lib/jvm/java-6-sun-1.6.0.16
bamboo_buildResultKey=PHPBB3-PR-JOB1-7487
bamboo_repository_git_branch=3.1.x
bamboo_repository_branch_name=3.1.x
bamboo_buildPlanName=phpBB3 - Pull Requests - Build and Test Job
bamboo_planRepository_1_revision=fa3bdedf7bebd64336daaeff7c41b842fa098cf9
bamboo_repository_name=phpBB Ascraeus
bamboo_buildFailed=false
bamboo_capability_system_docker_executable=/usr/bin/docker
bamboo_planRepository_branch=3.1.x
bamboo_agentWorkingDirectory=/home/bamboo/xml-data/build-dir
bamboo_capability_system_git_executable=/usr/bin/git
bamboo_planRepository_1_previousRevision=fa3bdedf7bebd64336daaeff7c41b842fa098cf9
bamboo_capability_system_builder_phpunit_PHPUnit_3_4=/usr/bin/phpunit
bamboo_repository_git_username=bantu
bamboo_repository_75956235_revision_number=fa3bdedf7bebd64336daaeff7c41b842fa098cf9
bamboo_planRepository_branchDisplayName=3.1.x
bamboo_planRepository_1_type=gitv2
bamboo_planRepository_branchName=3.1.x
bamboo_repository_75956235_previous_revision_number=fa3bdedf7bebd64336daaeff7c41b842fa098cf9
bamboo_capability_system_jdk_JDK=/usr/lib/jvm/java-6-sun
bamboo_plan_storageTag=PHPBB3-PR
bamboo_planRepository_type=gitv2
bamboo_planRepository_1_username=bantu
bamboo_ManualBuildTriggerReason_userName=Build Robot
bamboo_repository_git_repositoryUrl=https://github.com/phpbb/phpbb.git
bamboo_repository_75956235_git_branch=3.1.x
bamboo_capability_system_builder_ant_Ant=/usr/share/ant
bamboo_repository_75956235_name=phpBB Ascraeus
bamboo_working_directory=/home/bamboo/xml-data/build-dir/PHPBB3-PR-JOB1
bamboo_planKey=PHPBB3-PR
bamboo_planRepository_1_repositoryUrl=https://github.com/phpbb/phpbb.git
bamboo_planRepository_username=bantu
bamboo_capability_local=true
bamboo_capability_system_jdk_JDK_1_6=/usr/lib/jvm/java-6-sun
bamboo_capability_system_jdk_JDK_1_7=/usr/lib/jvm/java-7-openjdk-amd64
bamboo_planRepository_1_branchName=3.1.x
22-Aug-2017 10:19:54 From https://github.com/phpbb/phpbb
22-Aug-2017 10:19:54 * branch            refs/pull/4916/merge -> FETCH_HEAD
22-Aug-2017 10:19:55 Note: checking out 'FETCH_HEAD'.
22-Aug-2017 10:19:55
22-Aug-2017 10:19:55 You are in 'detached HEAD' state. You can look around, make experimental
22-Aug-2017 10:19:55 changes and commit them, and you can discard any commits you make in this
22-Aug-2017 10:19:55 state without impacting any branches by performing another checkout.
22-Aug-2017 10:19:55
22-Aug-2017 10:19:55 If you want to create a new branch to retain commits you create, you may
22-Aug-2017 10:19:55 do so (now or later) by using -b with the checkout command again. Example:
22-Aug-2017 10:19:55
22-Aug-2017 10:19:55   git checkout -b new_branch_name
22-Aug-2017 10:19:55
22-Aug-2017 10:19:55 HEAD is now at 7c7ca64... Merge 028c1c33dd4f977dff585bda53c69a9d04f18b06 into 52d356da886580851e98b2282bc7cd6c4d28f7da
22-Aug-2017 10:19:55 Finished task 'Fetch PR' with result: Success
22-Aug-2017 10:19:55 Skipping execution of task 'Prepare directory' as it is disabled
22-Aug-2017 10:19:55
Substituting variable: ${bamboo.working.directory} with /home/bamboo/xml-data/build-dir/PHPBB3-PR-JOB1
22-Aug-2017 10:19:55 Starting task 'Prepare directory' of type 'com.atlassian.bamboo.plugins.bamboo-docker-plugin:task.docker.cli'
22-Aug-2017 10:19:55 Running image name (phpbb:php-5.6)
22-Aug-2017 10:19:55
Beginning to execute external process for build 'phpBB3 - Pull Requests - Build and Test Job #7487 (PHPBB3-PR-JOB1-7487)'
... running command line:
/usr/bin/docker run --volume /home/bamboo/xml-data/build-dir/PHPBB3-PR-JOB1:/data --workdir /data/phpBB --rm -e HOME=/home/bamboo -u=991 phpbb:php-5.6 /bin/bash -c php ../composer.phar install --dev; cd ../build; ../phpBB/vendor/bin/phing clean prepare
... in: /home/bamboo/xml-data/build-dir/PHPBB3-PR-JOB1
... using extra environment variables:
bamboo_planRepository_1_branch=3.1.x
bamboo_planRepository_1_branchDisplayName=3.1.x
bamboo_repository_revision_number=fa3bdedf7bebd64336daaeff7c41b842fa098cf9
bamboo_PRref=master
bamboo_resultsUrl=https://bamboo.phpbb.com/browse/PHPBB3-PR-JOB1-7487
bamboo_capability_system_builder_command_Git=/usr/bin/git
bamboo_repository_75956235_git_username=bantu
bamboo_planRepository_1_name=phpBB Ascraeus
bamboo_build_working_directory=/home/bamboo/xml-data/build-dir/PHPBB3-PR-JOB1
bamboo_buildKey=PHPBB3-PR-JOB1
bamboo_capability_phpbb_tests=true
bamboo_shortPlanName=Pull Requests
bamboo_capability_system_builder_command_fop=/usr/bin/fop
bamboo_capability_dbms_sqlite_2=true
bamboo_planRepository_name=phpBB Ascraeus
bamboo_PRnumber=4916
bamboo_buildNumber=7487
bamboo_repository_75956235_git_repositoryUrl=https://github.com/phpbb/phpbb.git
bamboo_capability_system_builder_phpunit_PHPUnit=/usr/bin/phpunit
bamboo_shortJobName=Build and Test Job
bamboo_buildResultsUrl=https://bamboo.phpbb.com/browse/PHPBB3-PR-JOB1-7487
bamboo_repository_75956235_branch_name=3.1.x
bamboo_planRepository_repositoryUrl=https://github.com/phpbb/phpbb.git
bamboo_agentId=131073
bamboo_planName=phpBB3 - Pull Requests
bamboo_build_commandline_com_atlassian_bamboo_plugins_scripttask_task_builder_script_7=/bin/sh /home/bamboo/temp/PHPBB3-PR-JOB1-7487-ScriptBuildTask-1771009407877498384.sh
bamboo_shortPlanKey=PR
bamboo_shortJobKey=JOB1
bamboo_capability_dbms_mysql_55=true
bamboo_capability_system_jdk_JDK_1_7_0_65=/usr/lib/jvm/java-7-openjdk-amd64
bamboo_planRepository_revision=fa3bdedf7bebd64336daaeff7c41b842fa098cf9
bamboo_repository_previous_revision_number=fa3bdedf7bebd64336daaeff7c41b842fa098cf9
bamboo_buildTimeStamp=2017-08-22T10:19:31.880Z
bamboo_planRepository_previousRevision=fa3bdedf7bebd64336daaeff7c41b842fa098cf9
bamboo_capability_system_builder_mvn2_Maven_2=/usr/share/maven2
bamboo_capability_system_jdk_JDK_1_6_0_16=/usr/lib/jvm/java-6-sun-1.6.0.16
bamboo_build_commandline_com_atlassian_bamboo_plugins_scripttask_task_builder_script_4=/bin/sh /home/bamboo/temp/PHPBB3-PR-JOB1-7487-ScriptBuildTask-1095577484097527425.sh
bamboo_buildResultKey=PHPBB3-PR-JOB1-7487
bamboo_repository_git_branch=3.1.x
bamboo_repository_branch_name=3.1.x
bamboo_buildPlanName=phpBB3 - Pull Requests - Build and Test Job
bamboo_planRepository_1_revision=fa3bdedf7bebd64336daaeff7c41b842fa098cf9
bamboo_repository_name=phpBB Ascraeus
bamboo_buildFailed=false
bamboo_capability_system_docker_executable=/usr/bin/docker
bamboo_planRepository_branch=3.1.x
bamboo_agentWorkingDirectory=/home/bamboo/xml-data/build-dir
bamboo_capability_system_git_executable=/usr/bin/git
bamboo_planRepository_1_previousRevision=fa3bdedf7bebd64336daaeff7c41b842fa098cf9
bamboo_capability_system_builder_phpunit_PHPUnit_3_4=/usr/bin/phpunit
bamboo_repository_git_username=bantu
bamboo_repository_75956235_revision_number=fa3bdedf7bebd64336daaeff7c41b842fa098cf9
bamboo_planRepository_branchDisplayName=3.1.x
bamboo_planRepository_1_type=gitv2
bamboo_planRepository_branchName=3.1.x
bamboo_repository_75956235_previous_revision_number=fa3bdedf7bebd64336daaeff7c41b842fa098cf9
bamboo_capability_system_jdk_JDK=/usr/lib/jvm/java-6-sun
bamboo_plan_storageTag=PHPBB3-PR
bamboo_planRepository_type=gitv2
bamboo_planRepository_1_username=bantu
bamboo_ManualBuildTriggerReason_userName=Build Robot
bamboo_repository_git_repositoryUrl=https://github.com/phpbb/phpbb.git
bamboo_repository_75956235_git_branch=3.1.x
bamboo_capability_system_builder_ant_Ant=/usr/share/ant
bamboo_repository_75956235_name=phpBB Ascraeus
bamboo_working_directory=/home/bamboo/xml-data/build-dir/PHPBB3-PR-JOB1
bamboo_planKey=PHPBB3-PR
bamboo_planRepository_1_repositoryUrl=https://github.com/phpbb/phpbb.git
bamboo_planRepository_username=bantu
bamboo_capability_local=true
bamboo_capability_system_jdk_JDK_1_6=/usr/lib/jvm/java-6-sun
bamboo_capability_system_jdk_JDK_1_7=/usr/lib/jvm/java-7-openjdk-amd64
bamboo_planRepository_1_branchName=3.1.x
22-Aug-2017 10:19:57 You are running composer with xdebug enabled. This has a major impact on runtime performance. See https://getcomposer.org/xdebug
22-Aug-2017 10:19:57 You are using the deprecated option "dev". Dev packages are installed by default now.
22-Aug-2017 10:19:57 Cannot create cache directory /home/bamboo/.composer/cache/repo/https---packagist.org/, or directory is not writable. Proceeding without cache
22-Aug-2017 10:19:57 Cannot create cache directory /home/bamboo/.composer/cache/files/, or directory is not writable. Proceeding without cache
22-Aug-2017 10:19:57 Loading composer repositories with package information
22-Aug-2017 10:19:57 Installing dependencies (including require-dev) from lock file
22-Aug-2017 10:19:57   - Installing bantu/ini-get-wrapper (v1.0.1)
22-Aug-2017 10:19:59     Downloading: Connecting...    Downloading: 100%         
22-Aug-2017 10:19:59
22-Aug-2017 10:19:59   - Installing symfony/process (v3.3.4)
22-Aug-2017 10:20:00     Downloading: Connecting...    Downloading: 0%               Downloading: 35%    Downloading: 40%    Downloading: 65%    Downloading: 75%    Downloading: 80%    Downloading: 100%    Downloading: 100%
22-Aug-2017 10:20:00
22-Aug-2017 10:20:00   - Installing symfony/finder (v3.3.4)
22-Aug-2017 10:20:01     Downloading: Connecting...    Downloading: 0%               Downloading: 5%    Downloading: 10%    Downloading: 65%    Downloading: 70%    Downloading: 75%    Downloading: 80%    Downloading: 100%    Downloading: 100%
22-Aug-2017 10:20:01
22-Aug-2017 10:20:01   - Installing symfony/filesystem (v3.3.4)
22-Aug-2017 10:20:02     Downloading: Connecting...    Downloading: 0%               Downloading: 50%    Downloading: 55%    Downloading: 85%    Downloading: 90%    Downloading: 100%    Downloading: 100%
22-Aug-2017 10:20:02
22-Aug-2017 10:20:02   - Installing symfony/polyfill-mbstring (v1.4.0)
22-Aug-2017 10:20:02     Downloading: Connecting...    Downloading: 0%               Downloading: 35%    Downloading: 90%    Downloading: 100%    Downloading: 100%
22-Aug-2017 10:20:02
22-Aug-2017 10:20:02   - Installing psr/log (1.0.2)
22-Aug-2017 10:20:03     Downloading: Connecting...    Downloading: 0%               Downloading: 15%    Downloading: 100%
22-Aug-2017 10:20:03
22-Aug-2017 10:20:03   - Installing symfony/debug (v3.3.4)
22-Aug-2017 10:20:04     Downloading: Connecting...    Downloading: 0%               Downloading: 10%    Downloading: 15%    Downloading: 25%    Downloading: 30%    Downloading: 40%    Downloading: 50%    Downloading: 60%    Downloading: 70%    Downloading: 80%    Downloading: 95%    Downloading: 100%    Downloading: 100%
22-Aug-2017 10:20:04
22-Aug-2017 10:20:04   - Installing symfony/console (v3.3.4)
22-Aug-2017 10:20:05     Downloading: Connecting...    Downloading: 0%               Downloading: 5%    Downloading: 10%    Downloading: 15%    Downloading: 20%    Downloading: 25%    Downloading: 30%    Downloading: 35%    Downloading: 40%    Downloading: 45%    Downloading: 50%    Downloading: 55%    Downloading: 60%    Downloading: 65%    Downloading: 70%    Downloading: 75%    Downloading: 80%    Downloading: 85%    Downloading: 90%    Downloading: 95%    Downloading: 100%    Downloading: 100%
22-Aug-2017 10:20:05
22-Aug-2017 10:20:05   - Installing seld/phar-utils (1.0.1)
22-Aug-2017 10:20:06     Downloading: Connecting...    Downloading: 0%               Downloading: 30%    Downloading: 60%    Downloading: 90%    Downloading: 100%    Downloading: 100%
22-Aug-2017 10:20:06
22-Aug-2017 10:20:06   - Installing seld/jsonlint (1.6.1)
22-Aug-2017 10:20:07     Downloading: Connecting...    Downloading: 0%               Downloading: 40%    Downloading: 85%    Downloading: 100%    Downloading: 100%
22-Aug-2017 10:20:07
22-Aug-2017 10:20:07   - Installing seld/cli-prompt (1.0.3)
22-Aug-2017 10:20:07     Downloading: Connecting...    Downloading: 0%               Downloading: 15%    Downloading: 30%    Downloading: 100%    Downloading: 100%
22-Aug-2017 10:20:07
22-Aug-2017 10:20:07   - Installing justinrainbow/json-schema (5.2.1)
22-Aug-2017 10:20:08     Downloading: Connecting...    Downloading: 0%               Downloading: 5%    Downloading: 20%    Downloading: 25%    Downloading: 30%    Downloading: 35%    Downloading: 55%    Downloading: 60%    Downloading: 75%    Downloading: 80%    Downloading: 95%    Downloading: 100%    Downloading: 100%
22-Aug-2017 10:20:08
22-Aug-2017 10:20:08   - Installing composer/spdx-licenses (1.1.6)
22-Aug-2017 10:20:09     Downloading: Connecting...    Downloading: 0%               Downloading: 80%    Downloading: 100%    Downloading: 100%
22-Aug-2017 10:20:09
22-Aug-2017 10:20:09   - Installing composer/semver (1.4.2)
22-Aug-2017 10:20:10     Downloading: Connecting...    Downloading: 0%               Downloading: 35%    Downloading: 75%    Downloading: 100%    Downloading: 100%
22-Aug-2017 10:20:10
22-Aug-2017 10:20:10   - Installing composer/ca-bundle (1.0.7)
22-Aug-2017 10:20:11     Downloading: Connecting...    Downloading: 0%               Downloading: 5%    Downloading: 10%    Downloading: 15%    Downloading: 20%    Downloading: 25%    Downloading: 30%    Downloading: 35%    Downloading: 40%    Downloading: 45%    Downloading: 50%    Downloading: 55%    Downloading: 60%    Downloading: 65%    Downloading: 70%    Downloading: 75%    Downloading: 80%    Downloading: 85%    Downloading: 90%    Downloading: 95%    Downloading: 100%    Downloading: 100%
22-Aug-2017 10:20:11
22-Aug-2017 10:20:11   - Installing composer/composer (1.4.2)
22-Aug-2017 10:20:12     Downloading: Connecting...    Downloading: 0%               Downloading: 5%    Downloading: 10%    Downloading: 15%    Downloading: 20%    Downloading: 25%    Downloading: 30%    Downloading: 35%    Downloading: 40%    Downloading: 45%    Downloading: 50%    Downloading: 55%    Downloading: 60%    Downloading: 65%    Downloading: 70%    Downloading: 75%    Downloading: 80%    Downloading: 85%    Downloading: 90%    Downloading: 95%    Downloading: 100%    Downloading: 100%
22-Aug-2017 10:20:12
22-Aug-2017 10:20:12   - Installing google/recaptcha (1.1.3)
22-Aug-2017 10:20:13     Downloading: Connecting...    Downloading: 100%         
22-Aug-2017 10:20:13
22-Aug-2017 10:20:13   - Installing guzzlehttp/promises (v1.3.1)
22-Aug-2017 10:20:14     Downloading: Connecting...    Downloading: 0%               Downloading: 30%    Downloading: 60%    Downloading: 80%    Downloading: 100%    Downloading: 100%
22-Aug-2017 10:20:14
22-Aug-2017 10:20:14   - Installing psr/http-message (1.0.1)
22-Aug-2017 10:20:15     Downloading: Connecting...    Downloading: 0%               Downloading: 95%    Downloading: 100%    Downloading: 100%
22-Aug-2017 10:20:15
22-Aug-2017 10:20:15   - Installing guzzlehttp/psr7 (1.4.2)
22-Aug-2017 10:20:15     Downloading: Connecting...    Downloading: 0%               Downloading: 5%    Downloading: 10%    Downloading: 15%    Downloading: 20%    Downloading: 50%    Downloading: 55%    Downloading: 60%    Downloading: 65%    Downloading: 70%    Downloading: 100%    Downloading: 100%
22-Aug-2017 10:20:15
22-Aug-2017 10:20:15   - Installing lusitanian/oauth (v0.8.10)
22-Aug-2017 10:20:17     Downloading: Connecting...    Downloading: 0%               Downloading: 5%    Downloading: 10%    Downloading: 15%    Downloading: 20%    Downloading: 25%    Downloading: 40%    Downloading: 45%    Downloading: 50%    Downloading: 55%    Downloading: 60%    Downloading: 65%    Downloading: 70%    Downloading: 75%    Downloading: 80%    Downloading: 85%    Downloading: 90%    Downloading: 95%    Downloading: 100%    Downloading: 100%
22-Aug-2017 10:20:17
22-Aug-2017 10:20:17   - Installing marc1706/fast-image-size (v1.1.3)
22-Aug-2017 10:20:18     Downloading: Connecting...    Downloading: 0%               Downloading: 20%    Downloading: 40%    Downloading: 60%    Downloading: 80%    Downloading: 100%    Downloading: 100%
22-Aug-2017 10:20:18
22-Aug-2017 10:20:18   - Installing paragonie/random_compat (v1.4.2)
22-Aug-2017 10:20:18     Downloading: Connecting...    Downloading: 0%               Downloading: 10%    Downloading: 30%    Downloading: 40%    Downloading: 45%    Downloading: 75%    Downloading: 100%    Downloading: 100%
22-Aug-2017 10:20:18
22-Aug-2017 10:20:18   - Installing patchwork/utf8 (v1.3.1)
22-Aug-2017 10:20:20     Downloading: Connecting...    Downloading: 0%               Downloading: 5%    Downloading: 10%    Downloading: 15%    Downloading: 20%    Downloading: 25%    Downloading: 30%    Downloading: 35%    Downloading: 40%    Downloading: 45%    Downloading: 50%    Downloading: 55%    Downloading: 60%    Downloading: 65%    Downloading: 70%    Downloading: 75%    Downloading: 80%    Downloading: 85%    Downloading: 90%    Downloading: 95%    Downloading: 100%    Downloading: 100%
22-Aug-2017 10:20:20
22-Aug-2017 10:20:20   - Installing psr/container (1.0.0)
22-Aug-2017 10:20:21     Downloading: Connecting...    Downloading: 0%               Downloading: 75%    Downloading: 100%    Downloading: 100%
22-Aug-2017 10:20:21
22-Aug-2017 10:20:21   - Installing s9e/text-formatter (0.11.0)
22-Aug-2017 10:20:21     Downloading: Connecting...    Downloading: 100%         
22-Aug-2017 10:20:21
22-Aug-2017 10:20:21   - Installing symfony/config (v3.3.4)
22-Aug-2017 10:20:22     Downloading: Connecting...    Downloading: 0%               Downloading: 5%    Downloading: 10%    Downloading: 15%    Downloading: 20%    Downloading: 25%    Downloading: 30%    Downloading: 35%    Downloading: 40%    Downloading: 45%    Downloading: 50%    Downloading: 55%    Downloading: 60%    Downloading: 65%    Downloading: 70%    Downloading: 75%    Downloading: 80%    Downloading: 85%    Downloading: 90%    Downloading: 95%    Downloading: 100%    Downloading: 100%
22-Aug-2017 10:20:22
22-Aug-2017 10:20:22   - Installing symfony/http-foundation (v3.3.4)
22-Aug-2017 10:20:24     Downloading: Connecting...    Downloading: 0%               Downloading: 5%    Downloading: 10%    Downloading: 15%    Downloading: 20%    Downloading: 25%    Downloading: 30%    Downloading: 35%    Downloading: 40%    Downloading: 45%    Downloading: 50%    Downloading: 55%    Downloading: 60%    Downloading: 65%    Downloading: 70%    Downloading: 75%    Downloading: 80%    Downloading: 85%    Downloading: 90%    Downloading: 95%    Downloading: 100%    Downloading: 100%
22-Aug-2017 10:20:24
22-Aug-2017 10:20:24   - Installing symfony/event-dispatcher (v3.3.4)
22-Aug-2017 10:20:24     Downloading: Connecting...    Downloading: 0%               Downloading: 5%    Downloading: 70%    Downloading: 75%    Downloading: 80%    Downloading: 100%    Downloading: 100%
22-Aug-2017 10:20:24
22-Aug-2017 10:20:24   - Installing symfony/http-kernel (v3.3.4)
22-Aug-2017 10:20:25     Downloading: Connecting...    Downloading: 0%               Downloading: 5%    Downloading: 10%    Downloading: 15%    Downloading: 20%    Downloading: 25%    Downloading: 30%    Downloading: 35%    Downloading: 40%    Downloading: 45%    Downloading: 50%    Downloading: 55%    Downloading: 60%    Downloading: 65%    Downloading: 70%    Downloading: 75%    Downloading: 80%    Downloading: 85%    Downloading: 90%    Downloading: 95%    Downloading: 100%    Downloading: 100%
22-Aug-2017 10:20:25
22-Aug-2017 10:20:25   - Installing symfony/dependency-injection (v3.3.4)
22-Aug-2017 10:20:27     Downloading: Connecting...    Downloading: 0%               Downloading: 5%    Downloading: 10%    Downloading: 15%    Downloading: 20%    Downloading: 25%    Downloading: 30%    Downloading: 35%    Downloading: 40%    Downloading: 45%    Downloading: 50%    Downloading: 55%    Downloading: 60%    Downloading: 65%    Downloading: 70%    Downloading: 75%    Downloading: 80%    Downloading: 85%    Downloading: 90%    Downloading: 95%    Downloading: 100%    Downloading: 100%
22-Aug-2017 10:20:27
22-Aug-2017 10:20:27   - Installing zendframework/zend-eventmanager (3.2.0)
22-Aug-2017 10:20:27     Downloading: Connecting...    Downloading: 0%               Downloading: 25%    Downloading: 35%    Downloading: 60%    Downloading: 90%    Downloading: 100%    Downloading: 100%
22-Aug-2017 10:20:27
22-Aug-2017 10:20:27   - Installing zendframework/zend-code (2.6.3)
22-Aug-2017 10:20:28     Downloading: Connecting...    Downloading: 0%               Downloading: 5%    Downloading: 10%    Downloading: 15%    Downloading: 20%    Downloading: 25%    Downloading: 30%    Downloading: 35%    Downloading: 40%    Downloading: 45%    Downloading: 50%    Downloading: 55%    Downloading: 60%    Downloading: 65%    Downloading: 70%    Downloading: 75%    Downloading: 80%    Downloading: 85%    Downloading: 90%    Downloading: 95%    Downloading: 100%    Downloading: 100%
22-Aug-2017 10:20:28
22-Aug-2017 10:20:28   - Installing ocramius/proxy-manager (1.0.2)
22-Aug-2017 10:20:29     Downloading: Connecting...    Downloading: 0%               Downloading: 5%    Downloading: 10%    Downloading: 15%    Downloading: 20%    Downloading: 25%    Downloading: 30%    Downloading: 35%    Downloading: 40%    Downloading: 45%    Downloading: 50%    Downloading: 55%    Downloading: 60%    Downloading: 70%    Downloading: 75%    Downloading: 80%    Downloading: 85%    Downloading: 90%    Downloading: 95%    Downloading: 100%    Downloading: 100%
22-Aug-2017 10:20:30
22-Aug-2017 10:20:30   - Installing symfony/proxy-manager-bridge (v3.3.4)
22-Aug-2017 10:20:30     Downloading: Connecting...    Downloading: 100%         
22-Aug-2017 10:20:30
22-Aug-2017 10:20:30   - Installing symfony/routing (v3.3.4)
22-Aug-2017 10:20:31     Downloading: Connecting...    Downloading: 0%               Downloading: 5%    Downloading: 10%    Downloading: 15%    Downloading: 20%    Downloading: 25%    Downloading: 30%    Downloading: 35%    Downloading: 40%    Downloading: 45%    Downloading: 50%    Downloading: 55%    Downloading: 60%    Downloading: 65%    Downloading: 70%    Downloading: 75%    Downloading: 80%    Downloading: 85%    Downloading: 90%    Downloading: 95%    Downloading: 100%    Downloading: 100%
22-Aug-2017 10:20:31
22-Aug-2017 10:20:31   - Installing twig/twig (v1.34.4)
22-Aug-2017 10:20:32     Downloading: Connecting...    Downloading: 0%               Downloading: 5%    Downloading: 10%    Downloading: 15%    Downloading: 20%    Downloading: 25%    Downloading: 30%    Downloading: 35%    Downloading: 40%    Downloading: 45%    Downloading: 50%    Downloading: 55%    Downloading: 60%    Downloading: 65%    Downloading: 70%    Downloading: 75%    Downloading: 80%    Downloading: 85%    Downloading: 90%    Downloading: 95%    Downloading: 100%    Downloading: 100%
22-Aug-2017 10:20:32
22-Aug-2017 10:20:32   - Installing symfony/twig-bridge (v3.3.4)
22-Aug-2017 10:20:33     Downloading: Connecting...    Downloading: 100%         
22-Aug-2017 10:20:33
22-Aug-2017 10:20:33   - Installing symfony/dom-crawler (v3.3.4)
22-Aug-2017 10:20:34     Downloading: Connecting...    Downloading: 0%               Downloading: 30%    Downloading: 35%    Downloading: 40%    Downloading: 45%    Downloading: 55%    Downloading: 85%    Downloading: 100%    Downloading: 100%
22-Aug-2017 10:20:34
22-Aug-2017 10:20:34   - Installing symfony/css-selector (v3.3.4)
22-Aug-2017 10:20:35     Downloading: Connecting...    Downloading: 0%               Downloading: 5%    Downloading: 10%    Downloading: 15%    Downloading: 20%    Downloading: 25%    Downloading: 30%    Downloading: 35%    Downloading: 40%    Downloading: 45%    Downloading: 50%    Downloading: 55%    Downloading: 60%    Downloading: 65%    Downloading: 70%    Downloading: 100%    Downloading: 100%
22-Aug-2017 10:20:35
22-Aug-2017 10:20:35   - Installing symfony/browser-kit (v3.3.4)
22-Aug-2017 10:20:35     Downloading: Connecting...    Downloading: 100%         
22-Aug-2017 10:20:35
22-Aug-2017 10:20:35   - Installing guzzlehttp/guzzle (6.3.0)
22-Aug-2017 10:20:36     Downloading: Connecting...    Downloading: 0%               Downloading: 5%    Downloading: 15%    Downloading: 25%    Downloading: 30%    Downloading: 40%    Downloading: 45%    Downloading: 55%    Downloading: 60%    Downloading: 70%    Downloading: 75%    Downloading: 90%    Downloading: 95%    Downloading: 100%    Downloading: 100%
22-Aug-2017 10:20:36
22-Aug-2017 10:20:36   - Installing fabpot/goutte (v3.2.1)
22-Aug-2017 10:20:37     Downloading: Connecting...    Downloading: 0%               Downloading: 70%    Downloading: 100%    Downloading: 100%
22-Aug-2017 10:20:37
22-Aug-2017 10:20:37   - Installing facebook/webdriver (1.4.1)
22-Aug-2017 10:20:38     Downloading: Connecting...    Downloading: 0%               Downloading: 5%    Downloading: 10%    Downloading: 15%    Downloading: 20%    Downloading: 25%    Downloading: 30%    Downloading: 35%    Downloading: 40%    Downloading: 45%    Downloading: 50%    Downloading: 55%    Downloading: 60%    Downloading: 65%    Downloading: 70%    Downloading: 75%    Downloading: 80%    Downloading: 85%    Downloading: 90%    Downloading: 95%    Downloading: 100%    Downloading: 100%
22-Aug-2017 10:20:38
22-Aug-2017 10:20:38   - Installing laravel/homestead (v4.0.5)
22-Aug-2017 10:20:39     Downloading: Connecting...    Downloading: 0%               Downloading: 5%    Downloading: 10%    Downloading: 95%    Downloading: 100%
22-Aug-2017 10:20:39
22-Aug-2017 10:20:39   - Installing phing/phing (2.4.14)
22-Aug-2017 10:20:40     Downloading: Connecting...    Downloading: 0%               Downloading: 5%    Downloading: 10%    Downloading: 15%    Downloading: 20%    Downloading: 25%    Downloading: 30%    Downloading: 35%    Downloading: 40%    Downloading: 45%    Downloading: 50%    Downloading: 55%    Downloading: 60%    Downloading: 65%    Downloading: 70%    Downloading: 75%    Downloading: 80%    Downloading: 85%    Downloading: 90%    Downloading: 95%    Downloading: 100%    Downloading: 100%
22-Aug-2017 10:20:40
22-Aug-2017 10:20:40   - Installing webmozart/assert (1.2.0)
22-Aug-2017 10:20:40     Downloading: Connecting...    Downloading: 0%               Downloading: 55%    Downloading: 60%    Downloading: 100%    Downloading: 100%
22-Aug-2017 10:20:40
22-Aug-2017 10:20:40   - Installing phpdocumentor/reflection-common (1.0)
22-Aug-2017 10:20:41     Downloading: Connecting...    Downloading: 0%               Downloading: 65%    Downloading: 100%    Downloading: 100%
22-Aug-2017 10:20:41
22-Aug-2017 10:20:41   - Installing phpdocumentor/type-resolver (0.4.0)
22-Aug-2017 10:20:42     Downloading: Connecting...    Downloading: 0%               Downloading: 5%    Downloading: 100%    Downloading: 100%
22-Aug-2017 10:20:42
22-Aug-2017 10:20:42   - Installing phpdocumentor/reflection-docblock (3.2.0)
22-Aug-2017 10:20:43     Downloading: Connecting...    Downloading: 0%               Downloading: 5%    Downloading: 30%    Downloading: 35%    Downloading: 40%    Downloading: 55%    Downloading: 80%    Downloading: 85%    Downloading: 90%    Downloading: 100%    Downloading: 100%
22-Aug-2017 10:20:43
22-Aug-2017 10:20:43   - Installing symfony/yaml (v3.3.4)
22-Aug-2017 10:20:44     Downloading: Connecting...    Downloading: 0%               Downloading: 5%    Downloading: 10%    Downloading: 15%    Downloading: 25%    Downloading: 30%    Downloading: 35%    Downloading: 40%    Downloading: 45%    Downloading: 75%    Downloading: 80%    Downloading: 85%    Downloading: 90%    Downloading: 95%    Downloading: 100%    Downloading: 100%
22-Aug-2017 10:20:44
22-Aug-2017 10:20:44   - Installing sebastian/version (2.0.1)
22-Aug-2017 10:20:45     Downloading: Connecting...    Downloading: 0%               Downloading: 100%    Downloading: 100%
22-Aug-2017 10:20:45
22-Aug-2017 10:20:45   - Installing sebastian/resource-operations (1.0.0)
22-Aug-2017 10:20:45     Downloading: Connecting...    Downloading: 0%               Downloading: 65%    Downloading: 100%    Downloading: 100%
22-Aug-2017 10:20:45
22-Aug-2017 10:20:45   - Installing sebastian/recursion-context (2.0.0)
22-Aug-2017 10:20:46     Downloading: Connecting...    Downloading: 0%               Downloading: 100%    Downloading: 100%
22-Aug-2017 10:20:46
22-Aug-2017 10:20:46   - Installing sebastian/object-enumerator (2.0.1)
22-Aug-2017 10:20:47     Downloading: Connecting...    Downloading: 0%               Downloading: 100%    Downloading: 100%
22-Aug-2017 10:20:47
22-Aug-2017 10:20:47   - Installing sebastian/global-state (1.1.1)
22-Aug-2017 10:20:47     Downloading: Connecting...    Downloading: 0%               Downloading: 40%    Downloading: 85%    Downloading: 100%    Downloading: 100%
22-Aug-2017 10:20:47
22-Aug-2017 10:20:47   - Installing sebastian/exporter (2.0.0)
22-Aug-2017 10:20:48     Downloading: Connecting...    Downloading: 0%               Downloading: 100%    Downloading: 100%
22-Aug-2017 10:20:48
22-Aug-2017 10:20:48   - Installing sebastian/environment (2.0.0)
22-Aug-2017 10:20:49     Downloading: Connecting...    Downloading: 0%               Downloading: 15%    Downloading: 30%    Downloading: 45%    Downloading: 60%    Downloading: 75%    Downloading: 90%    Downloading: 100%    Downloading: 100%
22-Aug-2017 10:20:49
22-Aug-2017 10:20:49   - Installing sebastian/diff (1.4.3)
22-Aug-2017 10:20:49     Downloading: Connecting...    Downloading: 0%               Downloading: 35%    Downloading: 40%    Downloading: 75%    Downloading: 100%    Downloading: 100%
22-Aug-2017 10:20:49
22-Aug-2017 10:20:49   - Installing sebastian/comparator (1.2.4)
22-Aug-2017 10:20:50     Downloading: Connecting...    Downloading: 0%               Downloading: 10%    Downloading: 70%    Downloading: 80%    Downloading: 90%    Downloading: 100%    Downloading: 100%
22-Aug-2017 10:20:50
22-Aug-2017 10:20:50   - Installing phpunit/php-text-template (1.2.1)
22-Aug-2017 10:20:51     Downloading: Connecting...    Downloading: 0%               Downloading: 35%    Downloading: 100%    Downloading: 100%
22-Aug-2017 10:20:51
22-Aug-2017 10:20:51   - Installing doctrine/instantiator (1.0.5)
22-Aug-2017 10:20:51     Downloading: Connecting...    Downloading: 0%               Downloading: 15%    Downloading: 30%    Downloading: 45%    Downloading: 60%    Downloading: 85%    Downloading: 100%    Downloading: 100%
22-Aug-2017 10:20:51
22-Aug-2017 10:20:51   - Installing phpunit/phpunit-mock-objects (3.4.4)
22-Aug-2017 10:20:52     Downloading: Connecting...    Downloading: 0%               Downloading: 5%    Downloading: 10%    Downloading: 15%    Downloading: 20%    Downloading: 25%    Downloading: 30%    Downloading: 40%    Downloading: 45%    Downloading: 50%    Downloading: 55%    Downloading: 60%    Downloading: 65%    Downloading: 70%    Downloading: 75%    Downloading: 85%    Downloading: 90%    Downloading: 95%    Downloading: 100%    Downloading: 100%
22-Aug-2017 10:20:52
22-Aug-2017 10:20:52   - Installing phpunit/php-timer (1.0.9)
22-Aug-2017 10:20:53     Downloading: Connecting...    Downloading: 0%               Downloading: 45%    Downloading: 90%    Downloading: 100%    Downloading: 100%
22-Aug-2017 10:20:53
22-Aug-2017 10:20:53   - Installing phpunit/php-file-iterator (1.4.2)
22-Aug-2017 10:20:53     Downloading: Connecting...    Downloading: 0%               Downloading: 20%    Downloading: 40%    Downloading: 60%    Downloading: 100%    Downloading: 100%
22-Aug-2017 10:20:53
22-Aug-2017 10:20:53   - Installing sebastian/code-unit-reverse-lookup (1.0.1)
22-Aug-2017 10:20:54     Downloading: Connecting...    Downloading: 0%               Downloading: 55%    Downloading: 100%    Downloading: 100%
22-Aug-2017 10:20:54
22-Aug-2017 10:20:54   - Installing phpunit/php-token-stream (1.4.11)
22-Aug-2017 10:20:55     Downloading: Connecting...    Downloading: 0%               Downloading: 5%    Downloading: 10%    Downloading: 15%    Downloading: 20%    Downloading: 65%    Downloading: 70%    Downloading: 75%    Downloading: 80%    Downloading: 85%    Downloading: 90%    Downloading: 95%    Downloading: 100%    Downloading: 100%
22-Aug-2017 10:20:55
22-Aug-2017 10:20:55   - Installing phpunit/php-code-coverage (4.0.8)
22-Aug-2017 10:20:56     Downloading: Connecting...    Downloading: 0%               Downloading: 5%    Downloading: 10%    Downloading: 15%    Downloading: 20%    Downloading: 25%    Downloading: 30%    Downloading: 35%    Downloading: 40%    Downloading: 45%    Downloading: 50%    Downloading: 55%    Downloading: 60%    Downloading: 65%    Downloading: 75%    Downloading: 85%    Downloading: 90%    Downloading: 95%    Downloading: 100%    Downloading: 100%
22-Aug-2017 10:20:56
22-Aug-2017 10:20:56   - Installing phpspec/prophecy (v1.7.0)
22-Aug-2017 10:20:57     Downloading: Connecting...    Downloading: 0%               Downloading: 5%    Downloading: 10%    Downloading: 15%    Downloading: 20%    Downloading: 25%    Downloading: 30%    Downloading: 35%    Downloading: 40%    Downloading: 45%    Downloading: 50%    Downloading: 55%    Downloading: 60%    Downloading: 65%    Downloading: 70%    Downloading: 75%    Downloading: 80%    Downloading: 85%    Downloading: 90%    Downloading: 95%    Downloading: 100%    Downloading: 100%
22-Aug-2017 10:20:57
22-Aug-2017 10:20:57   - Installing myclabs/deep-copy (1.6.1)
22-Aug-2017 10:20:58     Downloading: Connecting...    Downloading: 0%               Downloading: 5%    Downloading: 10%    Downloading: 15%    Downloading: 20%    Downloading: 35%    Downloading: 40%    Downloading: 100%
22-Aug-2017 10:20:58
22-Aug-2017 10:20:58   - Installing phpunit/phpunit (5.7.21)
22-Aug-2017 10:20:58     Downloading: Connecting...    Downloading: 0%               Downloading: 5%    Downloading: 10%    Downloading: 15%    Downloading: 20%    Downloading: 25%    Downloading: 30%    Downloading: 35%    Downloading: 40%    Downloading: 45%    Downloading: 50%    Downloading: 55%    Downloading: 60%    Downloading: 65%    Downloading: 70%    Downloading: 75%    Downloading: 80%    Downloading: 85%    Downloading: 90%    Downloading: 95%    Downloading: 100%    Downloading: 100%
22-Aug-2017 10:20:58
22-Aug-2017 10:20:58   - Installing phpunit/dbunit (2.0.3)
22-Aug-2017 10:20:59     Downloading: Connecting...    Downloading: 0%               Downloading: 5%    Downloading: 10%    Downloading: 15%    Downloading: 20%    Downloading: 25%    Downloading: 30%    Downloading: 35%    Downloading: 40%    Downloading: 45%    Downloading: 50%    Downloading: 55%    Downloading: 60%    Downloading: 65%    Downloading: 70%    Downloading: 75%    Downloading: 80%    Downloading: 85%    Downloading: 90%    Downloading: 95%    Downloading: 100%    Downloading: 100%
22-Aug-2017 10:20:59
22-Aug-2017 10:20:59   - Installing squizlabs/php_codesniffer (2.9.1)
22-Aug-2017 10:21:01     Downloading: Connecting...    Downloading: 0%               Downloading: 5%    Downloading: 10%    Downloading: 15%    Downloading: 20%    Downloading: 25%    Downloading: 30%    Downloading: 35%    Downloading: 40%    Downloading: 45%    Downloading: 50%    Downloading: 55%    Downloading: 60%    Downloading: 65%    Downloading: 70%    Downloading: 85%    Downloading: 90%    Downloading: 95%    Downloading: 100%    Downloading: 100%
22-Aug-2017 10:21:01
22-Aug-2017 10:21:02 lusitanian/oauth suggests installing predis/predis (Allows using the Redis storage backend.)
22-Aug-2017 10:21:02 paragonie/random_compat suggests installing ext-libsodium (Provides a modern crypto API that can be used to generate random bytes.)
22-Aug-2017 10:21:02 patchwork/utf8 suggests installing ext-intl (Use Intl for best performance)
22-Aug-2017 10:21:02 patchwork/utf8 suggests installing ext-wfio (Use WFIO for UTF-8 filesystem access on Windows)
22-Aug-2017 10:21:02 s9e/text-formatter suggests installing ext-intl (Allows international URLs to be accepted by the URL filter)
22-Aug-2017 10:21:02 s9e/text-formatter suggests installing ext-xsl (Enables the XSLT renderer)
22-Aug-2017 10:21:02 symfony/http-kernel suggests installing symfony/class-loader ()
22-Aug-2017 10:21:02 symfony/http-kernel suggests installing symfony/var-dumper ()
22-Aug-2017 10:21:02 symfony/dependency-injection suggests installing symfony/expression-language (For using expressions in service container configuration)
22-Aug-2017 10:21:02 zendframework/zend-eventmanager suggests installing container-interop/container-interop (^1.1.0, to use the lazy listeners feature)
22-Aug-2017 10:21:02 zendframework/zend-eventmanager suggests installing zendframework/zend-stdlib (^2.7.3 || ^3.0, to use the FilterChain feature)
22-Aug-2017 10:21:02 zendframework/zend-code suggests installing doctrine/annotations (Doctrine\Common\Annotations >=1.0 for annotation features)
22-Aug-2017 10:21:02 zendframework/zend-code suggests installing zendframework/zend-stdlib (Zend\Stdlib component)
22-Aug-2017 10:21:02 ocramius/proxy-manager suggests installing ocramius/generated-hydrator (To have very fast object to array to object conversion for ghost objects)
22-Aug-2017 10:21:02 ocramius/proxy-manager suggests installing zendframework/zend-json (To have the JsonRpc adapter (Remote Object feature))
22-Aug-2017 10:21:02 ocramius/proxy-manager suggests installing zendframework/zend-soap (To have the Soap adapter (Remote Object feature))
22-Aug-2017 10:21:02 ocramius/proxy-manager suggests installing zendframework/zend-stdlib (To use the hydrator proxy)
22-Aug-2017 10:21:02 ocramius/proxy-manager suggests installing zendframework/zend-xmlrpc (To have the XmlRpc adapter (Remote Object feature))
22-Aug-2017 10:21:02 symfony/routing suggests installing doctrine/annotations (For using the annotation loader)
22-Aug-2017 10:21:02 symfony/routing suggests installing symfony/expression-language (For using expression matching)
22-Aug-2017 10:21:02 symfony/twig-bridge suggests installing symfony/asset (For using the AssetExtension)
22-Aug-2017 10:21:02 symfony/twig-bridge suggests installing symfony/expression-language (For using the ExpressionExtension)
22-Aug-2017 10:21:02 symfony/twig-bridge suggests installing symfony/form (For using the FormExtension)
22-Aug-2017 10:21:02 symfony/twig-bridge suggests installing symfony/security (For using the SecurityExtension)
22-Aug-2017 10:21:02 symfony/twig-bridge suggests installing symfony/stopwatch (For using the StopwatchExtension)
22-Aug-2017 10:21:02 symfony/twig-bridge suggests installing symfony/templating (For using the TwigEngine)
22-Aug-2017 10:21:02 symfony/twig-bridge suggests installing symfony/translation (For using the TranslationExtension)
22-Aug-2017 10:21:02 symfony/twig-bridge suggests installing symfony/var-dumper (For using the DumpExtension)
22-Aug-2017 10:21:02 symfony/twig-bridge suggests installing symfony/web-link (For using the WebLinkExtension)
22-Aug-2017 10:21:02 sebastian/global-state suggests installing ext-uopz (*)
22-Aug-2017 10:21:02 phpunit/phpunit-mock-objects suggests installing ext-soap (*)
22-Aug-2017 10:21:02 phpunit/phpunit suggests installing phpunit/php-invoker (~1.1)
22-Aug-2017 10:21:02 Generating autoload files
22-Aug-2017 10:21:03 Buildfile: /data/build/build.xml
22-Aug-2017 10:21:03
22-Aug-2017 10:21:03 phpBB > clean:
22-Aug-2017 10:21:03
22-Aug-2017 10:21:03    [delete] Directory /data/build/logs does not exist or is not a directory.
22-Aug-2017 10:21:03    [delete] Directory /data/build/api does not exist or is not a directory.
22-Aug-2017 10:21:03    [delete] Directory /data/build/codebrowser does not exist or is not a directory.
22-Aug-2017 10:21:03    [delete] Directory /data/build/coverage does not exist or is not a directory.
22-Aug-2017 10:21:03    [delete] Directory /data/build/cpd does not exist or is not a directory.
22-Aug-2017 10:21:03    [delete] Directory /data/build/dependencies does not exist or is not a directory.
22-Aug-2017 10:21:03    [delete] Directory /data/build/new_version does not exist or is not a directory.
22-Aug-2017 10:21:03    [delete] Directory /data/build/old_versions does not exist or is not a directory.
22-Aug-2017 10:21:03    [delete] Directory /data/build/save does not exist or is not a directory.
22-Aug-2017 10:21:03
22-Aug-2017 10:21:03 phpBB > prepare:
22-Aug-2017 10:21:03
22-Aug-2017 10:21:03     [mkdir] Created dir: /data/build/logs
22-Aug-2017 10:21:03     [mkdir] Created dir: /data/build/api
22-Aug-2017 10:21:03     [mkdir] Created dir: /data/build/codebrowser
22-Aug-2017 10:21:03     [mkdir] Created dir: /data/build/coverage
22-Aug-2017 10:21:03     [mkdir] Created dir: /data/build/cpd
22-Aug-2017 10:21:03     [mkdir] Created dir: /data/build/dependencies
22-Aug-2017 10:21:03     [mkdir] Created dir: /data/build/new_version
22-Aug-2017 10:21:03     [mkdir] Created dir: /data/build/new_version/files
22-Aug-2017 10:21:03     [mkdir] Created dir: /data/build/new_version/patches
22-Aug-2017 10:21:03     [mkdir] Created dir: /data/build/new_version/release_files
22-Aug-2017 10:21:03     [mkdir] Created dir: /data/build/new_version/update
22-Aug-2017 10:21:03     [mkdir] Created dir: /data/build/old_versions
22-Aug-2017 10:21:03     [mkdir] Created dir: /data/build/save
22-Aug-2017 10:21:03
22-Aug-2017 10:21:03 BUILD FINISHED
22-Aug-2017 10:21:03
22-Aug-2017 10:21:03 Total time: 0.1254 seconds
22-Aug-2017 10:21:03
22-Aug-2017 10:21:03 Finished task 'Prepare directory' with result: Success
22-Aug-2017 10:21:03 Skipping execution of task 'Run sniffs' as it is disabled
22-Aug-2017 10:21:03
Substituting variable: ${bamboo.working.directory} with /home/bamboo/xml-data/build-dir/PHPBB3-PR-JOB1
22-Aug-2017 10:21:03 Starting task 'Run sniffs' of type 'com.atlassian.bamboo.plugins.bamboo-docker-plugin:task.docker.cli'
22-Aug-2017 10:21:03 Running image name (phpbb:php-5.6)
22-Aug-2017 10:21:03
Beginning to execute external process for build 'phpBB3 - Pull Requests - Build and Test Job #7487 (PHPBB3-PR-JOB1-7487)'
... running command line:
/usr/bin/docker run --volume /home/bamboo/xml-data/build-dir/PHPBB3-PR-JOB1:/data --workdir /data/build --rm -u=991 phpbb:php-5.6 ../phpBB/vendor/bin/phing sniff
... in: /home/bamboo/xml-data/build-dir/PHPBB3-PR-JOB1
... using extra environment variables:
bamboo_planRepository_1_branch=3.1.x
bamboo_planRepository_1_branchDisplayName=3.1.x
bamboo_repository_revision_number=fa3bdedf7bebd64336daaeff7c41b842fa098cf9
bamboo_PRref=master
bamboo_resultsUrl=https://bamboo.phpbb.com/browse/PHPBB3-PR-JOB1-7487
bamboo_capability_system_builder_command_Git=/usr/bin/git
bamboo_repository_75956235_git_username=bantu
bamboo_planRepository_1_name=phpBB Ascraeus
bamboo_build_working_directory=/home/bamboo/xml-data/build-dir/PHPBB3-PR-JOB1
bamboo_buildKey=PHPBB3-PR-JOB1
bamboo_capability_phpbb_tests=true
bamboo_shortPlanName=Pull Requests
bamboo_capability_system_builder_command_fop=/usr/bin/fop
bamboo_capability_dbms_sqlite_2=true
bamboo_planRepository_name=phpBB Ascraeus
bamboo_PRnumber=4916
bamboo_buildNumber=7487
bamboo_repository_75956235_git_repositoryUrl=https://github.com/phpbb/phpbb.git
bamboo_capability_system_builder_phpunit_PHPUnit=/usr/bin/phpunit
bamboo_shortJobName=Build and Test Job
bamboo_buildResultsUrl=https://bamboo.phpbb.com/browse/PHPBB3-PR-JOB1-7487
bamboo_repository_75956235_branch_name=3.1.x
bamboo_planRepository_repositoryUrl=https://github.com/phpbb/phpbb.git
bamboo_agentId=131073
bamboo_planName=phpBB3 - Pull Requests
bamboo_build_commandline_com_atlassian_bamboo_plugins_scripttask_task_builder_script_7=/bin/sh /home/bamboo/temp/PHPBB3-PR-JOB1-7487-ScriptBuildTask-1771009407877498384.sh
bamboo_shortPlanKey=PR
bamboo_shortJobKey=JOB1
bamboo_capability_dbms_mysql_55=true
bamboo_capability_system_jdk_JDK_1_7_0_65=/usr/lib/jvm/java-7-openjdk-amd64
bamboo_planRepository_revision=fa3bdedf7bebd64336daaeff7c41b842fa098cf9
bamboo_repository_previous_revision_number=fa3bdedf7bebd64336daaeff7c41b842fa098cf9
bamboo_buildTimeStamp=2017-08-22T10:19:31.880Z
bamboo_planRepository_previousRevision=fa3bdedf7bebd64336daaeff7c41b842fa098cf9
bamboo_capability_system_builder_mvn2_Maven_2=/usr/share/maven2
bamboo_capability_system_jdk_JDK_1_6_0_16=/usr/lib/jvm/java-6-sun-1.6.0.16
bamboo_build_commandline_com_atlassian_bamboo_plugins_scripttask_task_builder_script_4=/bin/sh /home/bamboo/temp/PHPBB3-PR-JOB1-7487-ScriptBuildTask-1095577484097527425.sh
bamboo_buildResultKey=PHPBB3-PR-JOB1-7487
bamboo_repository_git_branch=3.1.x
bamboo_repository_branch_name=3.1.x
bamboo_buildPlanName=phpBB3 - Pull Requests - Build and Test Job
bamboo_planRepository_1_revision=fa3bdedf7bebd64336daaeff7c41b842fa098cf9
bamboo_repository_name=phpBB Ascraeus
bamboo_buildFailed=false
bamboo_capability_system_docker_executable=/usr/bin/docker
bamboo_build_commandline_com_atlassian_bamboo_plugins_bamboo_docker_plugin_task_docker_cli_12=/usr/bin/docker run --volume /home/bamboo/xml-data/build-dir/PHPBB3-PR-JOB1:/data --workdir /data/phpBB --rm -e HOME=/home/bamboo -u=991 phpbb:php-5.6 /bin/bash -c php ../composer.phar install --dev; cd ../build; ../phpBB/vendor/bin/phing clean prepare
bamboo_planRepository_branch=3.1.x
bamboo_agentWorkingDirectory=/home/bamboo/xml-data/build-dir
bamboo_capability_system_git_executable=/usr/bin/git
bamboo_planRepository_1_previousRevision=fa3bdedf7bebd64336daaeff7c41b842fa098cf9
bamboo_capability_system_builder_phpunit_PHPUnit_3_4=/usr/bin/phpunit
bamboo_repository_git_username=bantu
bamboo_repository_75956235_revision_number=fa3bdedf7bebd64336daaeff7c41b842fa098cf9
bamboo_planRepository_branchDisplayName=3.1.x
bamboo_planRepository_1_type=gitv2
bamboo_planRepository_branchName=3.1.x
bamboo_repository_75956235_previous_revision_number=fa3bdedf7bebd64336daaeff7c41b842fa098cf9
bamboo_capability_system_jdk_JDK=/usr/lib/jvm/java-6-sun
bamboo_plan_storageTag=PHPBB3-PR
bamboo_planRepository_type=gitv2
bamboo_planRepository_1_username=bantu
bamboo_ManualBuildTriggerReason_userName=Build Robot
bamboo_repository_git_repositoryUrl=https://github.com/phpbb/phpbb.git
bamboo_repository_75956235_git_branch=3.1.x
bamboo_capability_system_builder_ant_Ant=/usr/share/ant
bamboo_repository_75956235_name=phpBB Ascraeus
bamboo_working_directory=/home/bamboo/xml-data/build-dir/PHPBB3-PR-JOB1
bamboo_planKey=PHPBB3-PR
bamboo_planRepository_1_repositoryUrl=https://github.com/phpbb/phpbb.git
bamboo_planRepository_username=bantu
bamboo_capability_local=true
bamboo_capability_system_jdk_JDK_1_6=/usr/lib/jvm/java-6-sun
bamboo_capability_system_jdk_JDK_1_7=/usr/lib/jvm/java-7-openjdk-amd64
bamboo_planRepository_1_branchName=3.1.x
22-Aug-2017 10:21:03 Buildfile: /data/build/build.xml
22-Aug-2017 10:21:03
22-Aug-2017 10:21:03 phpBB > sniff:
22-Aug-2017 10:21:03
22-Aug-2017 10:21:13 ............................................................  60 / 734 (8%)
22-Aug-2017 10:21:14 ..........E................................................. 120 / 734 (16%)
22-Aug-2017 10:21:16 ............................................................ 180 / 734 (25%)
22-Aug-2017 10:21:17 ............................................................ 240 / 734 (33%)
22-Aug-2017 10:21:21 ............................................................ 300 / 734 (41%)
22-Aug-2017 10:21:28 ............................................................ 360 / 734 (49%)
22-Aug-2017 10:21:34 ............................................................ 420 / 734 (57%)
22-Aug-2017 10:21:39 ............................................................ 480 / 734 (65%)
22-Aug-2017 10:21:43 ............................................................ 540 / 734 (74%)
22-Aug-2017 10:21:47 ............................................................ 600 / 734 (82%)
22-Aug-2017 10:21:54 ............................................................ 660 / 734 (90%)
22-Aug-2017 10:21:56 ............................................................ 720 / 734 (98%)
22-Aug-2017 10:21:57 ..............
22-Aug-2017 10:21:57
22-Aug-2017 10:21:57
22-Aug-2017 10:21:57 FILE: /data/phpBB/phpbb/db/migration/data/v330/storage_backup.php
22-Aug-2017 10:21:57 ----------------------------------------------------------------------
22-Aug-2017 10:21:57 FOUND 1 ERROR AFFECTING 1 LINE
22-Aug-2017 10:21:57 ----------------------------------------------------------------------
22-Aug-2017 10:21:57 24 | ERROR | [x] TRUE, FALSE and NULL must be lowercase; expected "null"
22-Aug-2017 10:21:57     |       |     but found "NULL" (Generic.PHP.LowerCaseConstant.Found)
22-Aug-2017 10:21:57 ----------------------------------------------------------------------
22-Aug-2017 10:21:57 PHPCBF CAN FIX THE 1 MARKED SNIFF VIOLATIONS AUTOMATICALLY
22-Aug-2017 10:21:57 ----------------------------------------------------------------------
22-Aug-2017 10:21:57
22-Aug-2017 10:21:57 Time: 53.45 secs; Memory: 63.25Mb
22-Aug-2017 10:21:57
22-Aug-2017 10:22:07 ............................................................  60 / 209 (29%)
22-Aug-2017 10:22:29 ............................................................ 120 / 209 (57%)
22-Aug-2017 10:22:46 ............................................................ 180 / 209 (86%)
22-Aug-2017 10:22:57 .............................
22-Aug-2017 10:22:57
22-Aug-2017 10:22:57 Time: 59.62 secs; Memory: 60.25Mb
22-Aug-2017 10:22:57
22-Aug-2017 10:22:57
22-Aug-2017 10:22:57
22-Aug-2017 10:22:57 Time: 22ms; Memory: 3.5Mb
22-Aug-2017 10:22:57
22-Aug-2017 10:22:57        [if] Error in IfTask
22-Aug-2017 10:22:57 Execution of target "sniff" failed for the following reason: /data/build/build.xml:109:6: /data/build/build.xml:115:9: PHP Code Sniffer failed.
22-Aug-2017 10:22:57
22-Aug-2017 10:22:57 BUILD FAILED
22-Aug-2017 10:22:57 /data/build/build.xml:109:6: /data/build/build.xml:115:9: PHP Code Sniffer failed.
22-Aug-2017 10:22:57 Total time: 2 minutes  53.40 seconds
22-Aug-2017 10:22:57
22-Aug-2017 10:22:57 Failing task since return code of [/usr/bin/docker run --volume /home/bamboo/xml-data/build-dir/PHPBB3-PR-JOB1:/data --workdir /data/build --rm -u=991 phpbb:php-5.6 ../phpBB/vendor/bin/phing sniff] was 1 while expected 0
22-Aug-2017 10:22:57 Error occurred while running Task 'Run sniffs(11)' of type com.atlassian.bamboo.plugins.bamboo-docker-plugin:task.docker.cli.
22-Aug-2017 10:22:57 com.atlassian.bamboo.task.TaskException: Failed to execute task
22-Aug-2017 10:22:57         at com.atlassian.bamboo.plugins.docker.service.RunService.execute(RunService.java:71)
22-Aug-2017 10:22:57         at com.atlassian.bamboo.plugins.docker.tasks.cli.DockerCliTask.execute(DockerCliTask.java:64)
22-Aug-2017 10:22:57         at com.atlassian.bamboo.task.TaskExecutorImpl.lambda$executeTasks$3(TaskExecutorImpl.java:284)
22-Aug-2017 10:22:57         at com.atlassian.bamboo.task.TaskExecutorImpl.executeTaskWithPrePostActions(TaskExecutorImpl.java:223)
22-Aug-2017 10:22:57         at com.atlassian.bamboo.task.TaskExecutorImpl.executeTasks(TaskExecutorImpl.java:284)
22-Aug-2017 10:22:57         at com.atlassian.bamboo.task.TaskExecutorImpl.execute(TaskExecutorImpl.java:111)
22-Aug-2017 10:22:57         at com.atlassian.bamboo.build.pipeline.tasks.ExecuteBuildTask.call(ExecuteBuildTask.java:69)
22-Aug-2017 10:22:57         at com.atlassian.bamboo.v2.build.agent.DefaultBuildAgent.build(DefaultBuildAgent.java:185)
22-Aug-2017 10:22:57         at com.atlassian.bamboo.v2.build.agent.BuildAgentControllerImpl$1.call(BuildAgentControllerImpl.java:122)
22-Aug-2017 10:22:57         at com.atlassian.bamboo.v2.build.agent.BuildAgentControllerImpl$1.call(BuildAgentControllerImpl.java:115)
22-Aug-2017 10:22:57         at com.atlassian.bamboo.variable.CustomVariableContextImpl.withVariableSubstitutor(CustomVariableContextImpl.java:185)
22-Aug-2017 10:22:57         at com.atlassian.bamboo.v2.build.agent.BuildAgentControllerImpl.waitAndPerformBuild(BuildAgentControllerImpl.java:115)
22-Aug-2017 10:22:57         at com.atlassian.bamboo.v2.build.agent.DefaultBuildAgent$1.run(DefaultBuildAgent.java:126)
22-Aug-2017 10:22:57         at com.atlassian.bamboo.utils.BambooRunnables$1.run(BambooRunnables.java:47)
22-Aug-2017 10:22:57         at com.atlassian.bamboo.security.ImpersonationHelper.runWith(ImpersonationHelper.java:26)
22-Aug-2017 10:22:57         at com.atlassian.bamboo.security.ImpersonationHelper.runWithSystemAuthority(ImpersonationHelper.java:17)
22-Aug-2017 10:22:57         at com.atlassian.bamboo.security.ImpersonationHelper$1.run(ImpersonationHelper.java:41)
22-Aug-2017 10:22:57         at java.lang.Thread.run(Thread.java:748)
22-Aug-2017 10:22:57 Caused by: com.atlassian.bamboo.plugins.docker.client.DockerException: Error running Docker run command
22-Aug-2017 10:22:57         at com.atlassian.bamboo.plugins.docker.client.DockerCmd.run(DockerCmd.java:103)
22-Aug-2017 10:22:57         at com.atlassian.bamboo.plugins.docker.service.RunService.execute(RunService.java:60)
22-Aug-2017 10:22:57         ... 17 more
22-Aug-2017 10:22:57 Caused by: com.atlassian.utils.process.ProcessException: Error executing /usr/bin/docker run --volume /home/bamboo/xml-data/build-dir/PHPBB3-PR-JOB1:/data --workdir /data/build --rm -u=991 phpbb:php-5.6 ../phpBB/vendor/bin/phing sniff
22-Aug-2017 10:22:57         at com.atlassian.bamboo.plugins.docker.process.DockerTaskProcessService.execute(DockerTaskProcessService.java:60)
22-Aug-2017 10:22:57         at com.atlassian.bamboo.plugins.docker.client.DockerCmd.run(DockerCmd.java:99)
22-Aug-2017 10:22:57         ... 18 more
22-Aug-2017 10:22:57 Starting task 'Parsing test results produced by script' of type 'com.atlassian.bamboo.plugins.testresultparser:task.testresultparser.junit'
22-Aug-2017 10:22:57 Parsing test results under /home/bamboo/xml-data/build-dir/PHPBB3-PR-JOB1...
22-Aug-2017 10:22:57 Failing task since test cases were expected but none were found.
22-Aug-2017 10:22:57 Finished task 'Parsing test results produced by script' with result: Failed
22-Aug-2017 10:22:57
Substituting variable: ${bamboo.PRnumber} with 4916
22-Aug-2017 10:22:57
Substituting variable: ${bamboo.buildResultsUrl} with https://bamboo.phpbb.com/browse/PHPBB3-PR-JOB1-7487
22-Aug-2017 10:22:57
Substituting variable: ${bamboo.buildResultsUrl} with https://bamboo.phpbb.com/browse/PHPBB3-PR-JOB1-7487
22-Aug-2017 10:22:57 Starting task 'Set result build status' of type 'com.atlassian.bamboo.plugins.scripttask:task.builder.script'
22-Aug-2017 10:22:57
Beginning to execute external process for build 'phpBB3 - Pull Requests - Build and Test Job #7487 (PHPBB3-PR-JOB1-7487)'
... running command line:
/bin/sh /home/bamboo/temp/PHPBB3-PR-JOB1-7487-ScriptBuildTask-949370393604820369.sh
... in: /home/bamboo/xml-data/build-dir/PHPBB3-PR-JOB1
... using extra environment variables:
bamboo_planRepository_1_branch=3.1.x
bamboo_planRepository_1_branchDisplayName=3.1.x
bamboo_repository_revision_number=fa3bdedf7bebd64336daaeff7c41b842fa098cf9
bamboo_PRref=master
bamboo_resultsUrl=https://bamboo.phpbb.com/browse/PHPBB3-PR-JOB1-7487
bamboo_capability_system_builder_command_Git=/usr/bin/git
bamboo_repository_75956235_git_username=bantu
bamboo_planRepository_1_name=phpBB Ascraeus
bamboo_build_working_directory=/home/bamboo/xml-data/build-dir/PHPBB3-PR-JOB1
bamboo_buildKey=PHPBB3-PR-JOB1
bamboo_capability_phpbb_tests=true
bamboo_shortPlanName=Pull Requests
bamboo_capability_system_builder_command_fop=/usr/bin/fop
bamboo_capability_dbms_sqlite_2=true
bamboo_planRepository_name=phpBB Ascraeus
bamboo_PRnumber=4916
bamboo_buildNumber=7487
bamboo_repository_75956235_git_repositoryUrl=https://github.com/phpbb/phpbb.git
bamboo_capability_system_builder_phpunit_PHPUnit=/usr/bin/phpunit
bamboo_shortJobName=Build and Test Job
bamboo_buildResultsUrl=https://bamboo.phpbb.com/browse/PHPBB3-PR-JOB1-7487
bamboo_repository_75956235_branch_name=3.1.x
bamboo_planRepository_repositoryUrl=https://github.com/phpbb/phpbb.git
bamboo_agentId=131073
bamboo_planName=phpBB3 - Pull Requests
bamboo_build_commandline_com_atlassian_bamboo_plugins_scripttask_task_builder_script_7=/bin/sh /home/bamboo/temp/PHPBB3-PR-JOB1-7487-ScriptBuildTask-1771009407877498384.sh
bamboo_shortPlanKey=PR
bamboo_shortJobKey=JOB1
bamboo_capability_dbms_mysql_55=true
bamboo_capability_system_jdk_JDK_1_7_0_65=/usr/lib/jvm/java-7-openjdk-amd64
bamboo_planRepository_revision=fa3bdedf7bebd64336daaeff7c41b842fa098cf9
bamboo_repository_previous_revision_number=fa3bdedf7bebd64336daaeff7c41b842fa098cf9
bamboo_buildTimeStamp=2017-08-22T10:19:31.880Z
bamboo_planRepository_previousRevision=fa3bdedf7bebd64336daaeff7c41b842fa098cf9
bamboo_capability_system_builder_mvn2_Maven_2=/usr/share/maven2
bamboo_capability_system_jdk_JDK_1_6_0_16=/usr/lib/jvm/java-6-sun-1.6.0.16
bamboo_build_commandline_com_atlassian_bamboo_plugins_scripttask_task_builder_script_4=/bin/sh /home/bamboo/temp/PHPBB3-PR-JOB1-7487-ScriptBuildTask-1095577484097527425.sh
bamboo_buildResultKey=PHPBB3-PR-JOB1-7487
bamboo_repository_git_branch=3.1.x
bamboo_repository_branch_name=3.1.x
bamboo_buildPlanName=phpBB3 - Pull Requests - Build and Test Job
bamboo_planRepository_1_revision=fa3bdedf7bebd64336daaeff7c41b842fa098cf9
bamboo_repository_name=phpBB Ascraeus
bamboo_buildFailed=true
bamboo_capability_system_docker_executable=/usr/bin/docker
bamboo_build_commandline_com_atlassian_bamboo_plugins_bamboo_docker_plugin_task_docker_cli_11=/usr/bin/docker run --volume /home/bamboo/xml-data/build-dir/PHPBB3-PR-JOB1:/data --workdir /data/build --rm -u=991 phpbb:php-5.6 ../phpBB/vendor/bin/phing sniff
bamboo_build_commandline_com_atlassian_bamboo_plugins_bamboo_docker_plugin_task_docker_cli_12=/usr/bin/docker run --volume /home/bamboo/xml-data/build-dir/PHPBB3-PR-JOB1:/data --workdir /data/phpBB --rm -e HOME=/home/bamboo -u=991 phpbb:php-5.6 /bin/bash -c php ../composer.phar install --dev; cd ../build; ../phpBB/vendor/bin/phing clean prepare
bamboo_planRepository_branch=3.1.x
bamboo_jobFailed=true
bamboo_agentWorkingDirectory=/home/bamboo/xml-data/build-dir
bamboo_capability_system_git_executable=/usr/bin/git
bamboo_planRepository_1_previousRevision=fa3bdedf7bebd64336daaeff7c41b842fa098cf9
bamboo_capability_system_builder_phpunit_PHPUnit_3_4=/usr/bin/phpunit
bamboo_repository_git_username=bantu
bamboo_repository_75956235_revision_number=fa3bdedf7bebd64336daaeff7c41b842fa098cf9
bamboo_planRepository_branchDisplayName=3.1.x
bamboo_planRepository_1_type=gitv2
bamboo_planRepository_branchName=3.1.x
bamboo_repository_75956235_previous_revision_number=fa3bdedf7bebd64336daaeff7c41b842fa098cf9
bamboo_capability_system_jdk_JDK=/usr/lib/jvm/java-6-sun
bamboo_plan_storageTag=PHPBB3-PR
bamboo_planRepository_type=gitv2
bamboo_planRepository_1_username=bantu
bamboo_ManualBuildTriggerReason_userName=Build Robot
bamboo_repository_git_repositoryUrl=https://github.com/phpbb/phpbb.git
bamboo_repository_75956235_git_branch=3.1.x
bamboo_capability_system_builder_ant_Ant=/usr/share/ant
bamboo_repository_75956235_name=phpBB Ascraeus
bamboo_working_directory=/home/bamboo/xml-data/build-dir/PHPBB3-PR-JOB1
bamboo_planKey=PHPBB3-PR
bamboo_planRepository_1_repositoryUrl=https://github.com/phpbb/phpbb.git
bamboo_planRepository_username=bantu
bamboo_capability_local=true
bamboo_capability_system_jdk_JDK_1_6=/usr/lib/jvm/java-6-sun
bamboo_capability_system_jdk_JDK_1_7=/usr/lib/jvm/java-7-openjdk-amd64
bamboo_planRepository_1_branchName=3.1.x
22-Aug-2017 10:22:57 From https://github.com/phpbb/phpbb
22-Aug-2017 10:22:57 * branch            refs/pull/4916/head -> FETCH_HEAD
22-Aug-2017 10:22:57 grep: build/logs/phpunit.xml: No such file or directory
22-Aug-2017 10:22:57 grep: build/logs/phpunit.xml: No such file or directory
22-Aug-2017 10:22:57   % Total    % Received % Xferd  Average Speed   Time    Time     Time  Current
22-Aug-2017 10:22:57                                  Dload  Upload   Total   Spent    Left  Speed
22-Aug-2017 10:22:57
22-Aug-2017 10:22:58   0     0    0     0    0     0      0      0 --:--:-- --:--:-- --:--:--     0
22-Aug-2017 10:22:58 100   273  100    93  100   180    197    381 --:--:-- --:--:-- --:--:--   381
22-Aug-2017 10:22:58 100   273  100    93  100   180    197    381 --:--:-- --:--:-- --:--:--   381
22-Aug-2017 10:22:58 Finished task 'Set result build status' with result: Success
22-Aug-2017 10:22:58 Running post build plugin 'NCover Results Collector'
22-Aug-2017 10:22:58 Running post build plugin 'Artifact Copier'
22-Aug-2017 10:22:58 Running post build plugin 'npm Cache Cleanup'
22-Aug-2017 10:22:58 Running post build plugin 'Clover Results Collector'
22-Aug-2017 10:22:58 Running post build plugin 'Docker Container Cleanup'
22-Aug-2017 10:22:58 Successfully removed working directory at '/home/bamboo/xml-data/build-dir/PHPBB3-PR-JOB1'
22-Aug-2017 10:22:58 Finalising the build...
22-Aug-2017 10:22:58 Stopping timer.
22-Aug-2017 10:22:58 Build PHPBB3-PR-JOB1-7487 completed.
22-Aug-2017 10:22:58 Running on server: post build plugin 'NCover Results Collector'
22-Aug-2017 10:22:58 Running on server: post build plugin 'Build Hanging Detection Configuration'
22-Aug-2017 10:22:58 Running on server: post build plugin 'Clover Delta Calculator'
22-Aug-2017 10:22:58 Running on server: post build plugin 'Maven Dependencies Postprocessor'
22-Aug-2017 10:22:58 All post build plugins have finished
22-Aug-2017 10:22:58 Generating build results summary...
22-Aug-2017 10:22:58 Saving build results to disk...
22-Aug-2017 10:22:58 Logging substituted variables...
22-Aug-2017 10:22:58 Indexing build results...
22-Aug-2017 10:22:58 Finished building PHPBB3-PR-JOB1-7487.
22-Aug-2017 10:22:58
Substituting variable: ${bamboo.PRnumber} with 4916