Tests pending pull requests

Build: #7792 failed

Job: Build and Test Job failed

Stages & jobs

  1. Build and Test

Build log

The build generated 827 lines of output. Download or view full build log

29-Dec-2017 11:05:05 Build phpBB3 - Pull Requests - Build and Test Job #7792 (PHPBB3-PR-JOB1-7792) started building on agent Default Agent
29-Dec-2017 11:05:05
29-Dec-2017 11:05:05 Build working directory is /home/bamboo/xml-data/build-dir/PHPBB3-PR-JOB1
29-Dec-2017 11:05:05 Executing build phpBB3 - Pull Requests - Build and Test Job #7792 (PHPBB3-PR-JOB1-7792)
29-Dec-2017 11:05:05 Starting task 'Checkout develop branch' of type 'com.atlassian.bamboo.plugins.vcs:task.vcs.checkout'
29-Dec-2017 11:05:05 Build always requires a clean checkout
29-Dec-2017 11:05:05 Cleaning build directory '/home/bamboo/xml-data/build-dir/PHPBB3-PR-JOB1'
29-Dec-2017 11:05:05 Updating source code to revision: 93621aa1844ab48d9bae068d9872d2c49ae86de4
29-Dec-2017 11:05:05 Fetching 'refs/heads/3.1.x' from 'https://github.com/phpbb/phpbb.git'.
29-Dec-2017 11:05:06 Checking out revision 93621aa1844ab48d9bae068d9872d2c49ae86de4.
29-Dec-2017 11:05:06 Creating local git repository in '/home/bamboo/xml-data/build-dir/PHPBB3-PR-JOB1/.git'.
29-Dec-2017 11:05:06 Cloning into '/home/bamboo/xml-data/build-dir/PHPBB3-PR-JOB1'...
29-Dec-2017 11:05:06 done.
29-Dec-2017 11:05:08 Branch 3.1.x set up to track remote branch 3.1.x from origin.
29-Dec-2017 11:05:08 Switched to a new branch '3.1.x'
29-Dec-2017 11:05:08 Updated source code to revision: 93621aa1844ab48d9bae068d9872d2c49ae86de4
29-Dec-2017 11:05:08 Finished task 'Checkout develop branch' with result: Success
29-Dec-2017 11:05:08 Running pre-build action: VCS Version Collector
29-Dec-2017 11:05:08
Substituting variable: ${bamboo.PRnumber} with 4933
29-Dec-2017 11:05:08
Substituting variable: ${bamboo.buildResultsUrl} with https://bamboo.phpbb.com/browse/PHPBB3-PR-JOB1-7792
29-Dec-2017 11:05:08 Starting task 'Set pending build status' of type 'com.atlassian.bamboo.plugins.scripttask:task.builder.script'
29-Dec-2017 11:05:08
Beginning to execute external process for build 'phpBB3 - Pull Requests - Build and Test Job #7792 (PHPBB3-PR-JOB1-7792)'
... running command line:
/bin/sh /home/bamboo/temp/PHPBB3-PR-JOB1-7792-ScriptBuildTask-932955968583869166.sh
... in: /home/bamboo/xml-data/build-dir/PHPBB3-PR-JOB1
... using extra environment variables:
bamboo_planRepository_1_branch=3.1.x
bamboo_planRepository_1_branchDisplayName=3.1.x
bamboo_repository_revision_number=93621aa1844ab48d9bae068d9872d2c49ae86de4
bamboo_PRref=master
bamboo_resultsUrl=https://bamboo.phpbb.com/browse/PHPBB3-PR-JOB1-7792
bamboo_capability_system_builder_command_Git=/usr/bin/git
bamboo_repository_75956235_git_username=bantu
bamboo_planRepository_1_name=phpBB Ascraeus
bamboo_build_working_directory=/home/bamboo/xml-data/build-dir/PHPBB3-PR-JOB1
bamboo_buildKey=PHPBB3-PR-JOB1
bamboo_capability_phpbb_tests=true
bamboo_shortPlanName=Pull Requests
bamboo_capability_system_builder_command_fop=/usr/bin/fop
bamboo_capability_dbms_sqlite_2=true
bamboo_planRepository_name=phpBB Ascraeus
bamboo_PRnumber=4933
bamboo_buildNumber=7792
bamboo_repository_75956235_git_repositoryUrl=https://github.com/phpbb/phpbb.git
bamboo_capability_system_builder_phpunit_PHPUnit=/usr/bin/phpunit
bamboo_shortJobName=Build and Test Job
bamboo_buildResultsUrl=https://bamboo.phpbb.com/browse/PHPBB3-PR-JOB1-7792
bamboo_repository_75956235_branch_name=3.1.x
bamboo_planRepository_repositoryUrl=https://github.com/phpbb/phpbb.git
bamboo_agentId=131073
bamboo_planName=phpBB3 - Pull Requests
bamboo_shortPlanKey=PR
bamboo_shortJobKey=JOB1
bamboo_capability_dbms_mysql_55=true
bamboo_capability_system_jdk_JDK_1_7_0_65=/usr/lib/jvm/java-7-openjdk-amd64
bamboo_planRepository_revision=93621aa1844ab48d9bae068d9872d2c49ae86de4
bamboo_repository_previous_revision_number=93621aa1844ab48d9bae068d9872d2c49ae86de4
bamboo_buildTimeStamp=2017-12-29T11:05:05.817Z
bamboo_planRepository_previousRevision=93621aa1844ab48d9bae068d9872d2c49ae86de4
bamboo_capability_system_builder_mvn2_Maven_2=/usr/share/maven2
bamboo_capability_system_jdk_JDK_1_6_0_16=/usr/lib/jvm/java-6-sun-1.6.0.16
bamboo_buildResultKey=PHPBB3-PR-JOB1-7792
bamboo_repository_git_branch=3.1.x
bamboo_repository_branch_name=3.1.x
bamboo_buildPlanName=phpBB3 - Pull Requests - Build and Test Job
bamboo_planRepository_1_revision=93621aa1844ab48d9bae068d9872d2c49ae86de4
bamboo_repository_name=phpBB Ascraeus
bamboo_buildFailed=false
bamboo_capability_system_docker_executable=/usr/bin/docker
bamboo_planRepository_branch=3.1.x
bamboo_agentWorkingDirectory=/home/bamboo/xml-data/build-dir
bamboo_capability_system_git_executable=/usr/bin/git
bamboo_planRepository_1_previousRevision=93621aa1844ab48d9bae068d9872d2c49ae86de4
bamboo_capability_system_builder_phpunit_PHPUnit_3_4=/usr/bin/phpunit
bamboo_repository_git_username=bantu
bamboo_repository_75956235_revision_number=93621aa1844ab48d9bae068d9872d2c49ae86de4
bamboo_planRepository_branchDisplayName=3.1.x
bamboo_planRepository_1_type=gitv2
bamboo_planRepository_branchName=3.1.x
bamboo_repository_75956235_previous_revision_number=93621aa1844ab48d9bae068d9872d2c49ae86de4
bamboo_capability_system_jdk_JDK=/usr/lib/jvm/java-6-sun
bamboo_plan_storageTag=PHPBB3-PR
bamboo_planRepository_type=gitv2
bamboo_planRepository_1_username=bantu
bamboo_ManualBuildTriggerReason_userName=Build Robot
bamboo_repository_git_repositoryUrl=https://github.com/phpbb/phpbb.git
bamboo_repository_75956235_git_branch=3.1.x
bamboo_capability_system_builder_ant_Ant=/usr/share/ant
bamboo_repository_75956235_name=phpBB Ascraeus
bamboo_working_directory=/home/bamboo/xml-data/build-dir/PHPBB3-PR-JOB1
bamboo_planKey=PHPBB3-PR
bamboo_planRepository_1_repositoryUrl=https://github.com/phpbb/phpbb.git
bamboo_planRepository_username=bantu
bamboo_capability_local=true
bamboo_capability_system_jdk_JDK_1_6=/usr/lib/jvm/java-6-sun
bamboo_capability_system_jdk_JDK_1_7=/usr/lib/jvm/java-7-openjdk-amd64
bamboo_planRepository_1_branchName=3.1.x
29-Dec-2017 11:05:11 From https://github.com/phpbb/phpbb
29-Dec-2017 11:05:11 * branch            refs/pull/4933/head -> FETCH_HEAD
29-Dec-2017 11:05:11   % Total    % Received % Xferd  Average Speed   Time    Time     Time  Current
29-Dec-2017 11:05:11                                  Dload  Upload   Total   Spent    Left  Speed
29-Dec-2017 11:05:11
29-Dec-2017 11:05:11   0     0    0     0    0     0      0      0 --:--:-- --:--:-- --:--:--     0
29-Dec-2017 11:05:11 100   275  100    93  100   182    384    751 --:--:-- --:--:-- --:--:--   752
29-Dec-2017 11:05:11 Finished task 'Set pending build status' with result: Success
29-Dec-2017 11:05:11
Substituting variable: ${bamboo.PRnumber} with 4933
29-Dec-2017 11:05:11 Starting task 'Fetch PR' of type 'com.atlassian.bamboo.plugins.scripttask:task.builder.script'
29-Dec-2017 11:05:11
Beginning to execute external process for build 'phpBB3 - Pull Requests - Build and Test Job #7792 (PHPBB3-PR-JOB1-7792)'
... running command line:
/bin/sh /home/bamboo/temp/PHPBB3-PR-JOB1-7792-ScriptBuildTask-7769593734827850648.sh
... in: /home/bamboo/xml-data/build-dir/PHPBB3-PR-JOB1
... using extra environment variables:
bamboo_planRepository_1_branch=3.1.x
bamboo_planRepository_1_branchDisplayName=3.1.x
bamboo_repository_revision_number=93621aa1844ab48d9bae068d9872d2c49ae86de4
bamboo_PRref=master
bamboo_resultsUrl=https://bamboo.phpbb.com/browse/PHPBB3-PR-JOB1-7792
bamboo_capability_system_builder_command_Git=/usr/bin/git
bamboo_repository_75956235_git_username=bantu
bamboo_planRepository_1_name=phpBB Ascraeus
bamboo_build_working_directory=/home/bamboo/xml-data/build-dir/PHPBB3-PR-JOB1
bamboo_buildKey=PHPBB3-PR-JOB1
bamboo_capability_phpbb_tests=true
bamboo_shortPlanName=Pull Requests
bamboo_capability_system_builder_command_fop=/usr/bin/fop
bamboo_capability_dbms_sqlite_2=true
bamboo_planRepository_name=phpBB Ascraeus
bamboo_PRnumber=4933
bamboo_buildNumber=7792
bamboo_repository_75956235_git_repositoryUrl=https://github.com/phpbb/phpbb.git
bamboo_capability_system_builder_phpunit_PHPUnit=/usr/bin/phpunit
bamboo_shortJobName=Build and Test Job
bamboo_buildResultsUrl=https://bamboo.phpbb.com/browse/PHPBB3-PR-JOB1-7792
bamboo_repository_75956235_branch_name=3.1.x
bamboo_planRepository_repositoryUrl=https://github.com/phpbb/phpbb.git
bamboo_agentId=131073
bamboo_planName=phpBB3 - Pull Requests
bamboo_build_commandline_com_atlassian_bamboo_plugins_scripttask_task_builder_script_7=/bin/sh /home/bamboo/temp/PHPBB3-PR-JOB1-7792-ScriptBuildTask-932955968583869166.sh
bamboo_shortPlanKey=PR
bamboo_shortJobKey=JOB1
bamboo_capability_dbms_mysql_55=true
bamboo_capability_system_jdk_JDK_1_7_0_65=/usr/lib/jvm/java-7-openjdk-amd64
bamboo_planRepository_revision=93621aa1844ab48d9bae068d9872d2c49ae86de4
bamboo_repository_previous_revision_number=93621aa1844ab48d9bae068d9872d2c49ae86de4
bamboo_buildTimeStamp=2017-12-29T11:05:05.817Z
bamboo_planRepository_previousRevision=93621aa1844ab48d9bae068d9872d2c49ae86de4
bamboo_capability_system_builder_mvn2_Maven_2=/usr/share/maven2
bamboo_capability_system_jdk_JDK_1_6_0_16=/usr/lib/jvm/java-6-sun-1.6.0.16
bamboo_buildResultKey=PHPBB3-PR-JOB1-7792
bamboo_repository_git_branch=3.1.x
bamboo_repository_branch_name=3.1.x
bamboo_buildPlanName=phpBB3 - Pull Requests - Build and Test Job
bamboo_planRepository_1_revision=93621aa1844ab48d9bae068d9872d2c49ae86de4
bamboo_repository_name=phpBB Ascraeus
bamboo_buildFailed=false
bamboo_capability_system_docker_executable=/usr/bin/docker
bamboo_planRepository_branch=3.1.x
bamboo_agentWorkingDirectory=/home/bamboo/xml-data/build-dir
bamboo_capability_system_git_executable=/usr/bin/git
bamboo_planRepository_1_previousRevision=93621aa1844ab48d9bae068d9872d2c49ae86de4
bamboo_capability_system_builder_phpunit_PHPUnit_3_4=/usr/bin/phpunit
bamboo_repository_git_username=bantu
bamboo_repository_75956235_revision_number=93621aa1844ab48d9bae068d9872d2c49ae86de4
bamboo_planRepository_branchDisplayName=3.1.x
bamboo_planRepository_1_type=gitv2
bamboo_planRepository_branchName=3.1.x
bamboo_repository_75956235_previous_revision_number=93621aa1844ab48d9bae068d9872d2c49ae86de4
bamboo_capability_system_jdk_JDK=/usr/lib/jvm/java-6-sun
bamboo_plan_storageTag=PHPBB3-PR
bamboo_planRepository_type=gitv2
bamboo_planRepository_1_username=bantu
bamboo_ManualBuildTriggerReason_userName=Build Robot
bamboo_repository_git_repositoryUrl=https://github.com/phpbb/phpbb.git
bamboo_repository_75956235_git_branch=3.1.x
bamboo_capability_system_builder_ant_Ant=/usr/share/ant
bamboo_repository_75956235_name=phpBB Ascraeus
bamboo_working_directory=/home/bamboo/xml-data/build-dir/PHPBB3-PR-JOB1
bamboo_planKey=PHPBB3-PR
bamboo_planRepository_1_repositoryUrl=https://github.com/phpbb/phpbb.git
bamboo_planRepository_username=bantu
bamboo_capability_local=true
bamboo_capability_system_jdk_JDK_1_6=/usr/lib/jvm/java-6-sun
bamboo_capability_system_jdk_JDK_1_7=/usr/lib/jvm/java-7-openjdk-amd64
bamboo_planRepository_1_branchName=3.1.x
29-Dec-2017 11:05:14 From https://github.com/phpbb/phpbb
29-Dec-2017 11:05:14 * branch            refs/pull/4933/merge -> FETCH_HEAD
29-Dec-2017 11:05:14 Note: checking out 'FETCH_HEAD'.
29-Dec-2017 11:05:14
29-Dec-2017 11:05:14 You are in 'detached HEAD' state. You can look around, make experimental
29-Dec-2017 11:05:14 changes and commit them, and you can discard any commits you make in this
29-Dec-2017 11:05:14 state without impacting any branches by performing another checkout.
29-Dec-2017 11:05:14
29-Dec-2017 11:05:14 If you want to create a new branch to retain commits you create, you may
29-Dec-2017 11:05:14 do so (now or later) by using -b with the checkout command again. Example:
29-Dec-2017 11:05:14
29-Dec-2017 11:05:14   git checkout -b new_branch_name
29-Dec-2017 11:05:14
29-Dec-2017 11:05:14 HEAD is now at fbf256e... Merge 6b375ccb0d17eaa1e776d64d74d34f35966acb25 into 9e3432cd7b98c2dfcfbd5ea8752d281353ed276a
29-Dec-2017 11:05:14 Finished task 'Fetch PR' with result: Success
29-Dec-2017 11:05:14 Skipping execution of task 'Prepare directory' as it is disabled
29-Dec-2017 11:05:14
Substituting variable: ${bamboo.working.directory} with /home/bamboo/xml-data/build-dir/PHPBB3-PR-JOB1
29-Dec-2017 11:05:14 Starting task 'Prepare directory' of type 'com.atlassian.bamboo.plugins.bamboo-docker-plugin:task.docker.cli'
29-Dec-2017 11:05:14 Running image name (phpbb:php-5.6)
29-Dec-2017 11:05:14
Beginning to execute external process for build 'phpBB3 - Pull Requests - Build and Test Job #7792 (PHPBB3-PR-JOB1-7792)'
... running command line:
/usr/bin/docker run --volume /home/bamboo/xml-data/build-dir/PHPBB3-PR-JOB1:/data --workdir /data/phpBB --rm -e HOME=/home/bamboo -u=991 phpbb:php-5.6 /bin/bash -c php ../composer.phar install --dev; cd ../build; ../phpBB/vendor/bin/phing clean prepare
... in: /home/bamboo/xml-data/build-dir/PHPBB3-PR-JOB1
... using extra environment variables:
bamboo_planRepository_1_branch=3.1.x
bamboo_planRepository_1_branchDisplayName=3.1.x
bamboo_repository_revision_number=93621aa1844ab48d9bae068d9872d2c49ae86de4
bamboo_PRref=master
bamboo_resultsUrl=https://bamboo.phpbb.com/browse/PHPBB3-PR-JOB1-7792
bamboo_capability_system_builder_command_Git=/usr/bin/git
bamboo_repository_75956235_git_username=bantu
bamboo_planRepository_1_name=phpBB Ascraeus
bamboo_build_working_directory=/home/bamboo/xml-data/build-dir/PHPBB3-PR-JOB1
bamboo_buildKey=PHPBB3-PR-JOB1
bamboo_capability_phpbb_tests=true
bamboo_shortPlanName=Pull Requests
bamboo_capability_system_builder_command_fop=/usr/bin/fop
bamboo_capability_dbms_sqlite_2=true
bamboo_planRepository_name=phpBB Ascraeus
bamboo_PRnumber=4933
bamboo_buildNumber=7792
bamboo_repository_75956235_git_repositoryUrl=https://github.com/phpbb/phpbb.git
bamboo_capability_system_builder_phpunit_PHPUnit=/usr/bin/phpunit
bamboo_shortJobName=Build and Test Job
bamboo_buildResultsUrl=https://bamboo.phpbb.com/browse/PHPBB3-PR-JOB1-7792
bamboo_repository_75956235_branch_name=3.1.x
bamboo_planRepository_repositoryUrl=https://github.com/phpbb/phpbb.git
bamboo_agentId=131073
bamboo_planName=phpBB3 - Pull Requests
bamboo_build_commandline_com_atlassian_bamboo_plugins_scripttask_task_builder_script_7=/bin/sh /home/bamboo/temp/PHPBB3-PR-JOB1-7792-ScriptBuildTask-932955968583869166.sh
bamboo_shortPlanKey=PR
bamboo_shortJobKey=JOB1
bamboo_capability_dbms_mysql_55=true
bamboo_capability_system_jdk_JDK_1_7_0_65=/usr/lib/jvm/java-7-openjdk-amd64
bamboo_planRepository_revision=93621aa1844ab48d9bae068d9872d2c49ae86de4
bamboo_repository_previous_revision_number=93621aa1844ab48d9bae068d9872d2c49ae86de4
bamboo_buildTimeStamp=2017-12-29T11:05:05.817Z
bamboo_planRepository_previousRevision=93621aa1844ab48d9bae068d9872d2c49ae86de4
bamboo_capability_system_builder_mvn2_Maven_2=/usr/share/maven2
bamboo_capability_system_jdk_JDK_1_6_0_16=/usr/lib/jvm/java-6-sun-1.6.0.16
bamboo_build_commandline_com_atlassian_bamboo_plugins_scripttask_task_builder_script_4=/bin/sh /home/bamboo/temp/PHPBB3-PR-JOB1-7792-ScriptBuildTask-7769593734827850648.sh
bamboo_buildResultKey=PHPBB3-PR-JOB1-7792
bamboo_repository_git_branch=3.1.x
bamboo_repository_branch_name=3.1.x
bamboo_buildPlanName=phpBB3 - Pull Requests - Build and Test Job
bamboo_planRepository_1_revision=93621aa1844ab48d9bae068d9872d2c49ae86de4
bamboo_repository_name=phpBB Ascraeus
bamboo_buildFailed=false
bamboo_capability_system_docker_executable=/usr/bin/docker
bamboo_planRepository_branch=3.1.x
bamboo_agentWorkingDirectory=/home/bamboo/xml-data/build-dir
bamboo_capability_system_git_executable=/usr/bin/git
bamboo_planRepository_1_previousRevision=93621aa1844ab48d9bae068d9872d2c49ae86de4
bamboo_capability_system_builder_phpunit_PHPUnit_3_4=/usr/bin/phpunit
bamboo_repository_git_username=bantu
bamboo_repository_75956235_revision_number=93621aa1844ab48d9bae068d9872d2c49ae86de4
bamboo_planRepository_branchDisplayName=3.1.x
bamboo_planRepository_1_type=gitv2
bamboo_planRepository_branchName=3.1.x
bamboo_repository_75956235_previous_revision_number=93621aa1844ab48d9bae068d9872d2c49ae86de4
bamboo_capability_system_jdk_JDK=/usr/lib/jvm/java-6-sun
bamboo_plan_storageTag=PHPBB3-PR
bamboo_planRepository_type=gitv2
bamboo_planRepository_1_username=bantu
bamboo_ManualBuildTriggerReason_userName=Build Robot
bamboo_repository_git_repositoryUrl=https://github.com/phpbb/phpbb.git
bamboo_repository_75956235_git_branch=3.1.x
bamboo_capability_system_builder_ant_Ant=/usr/share/ant
bamboo_repository_75956235_name=phpBB Ascraeus
bamboo_working_directory=/home/bamboo/xml-data/build-dir/PHPBB3-PR-JOB1
bamboo_planKey=PHPBB3-PR
bamboo_planRepository_1_repositoryUrl=https://github.com/phpbb/phpbb.git
bamboo_planRepository_username=bantu
bamboo_capability_local=true
bamboo_capability_system_jdk_JDK_1_6=/usr/lib/jvm/java-6-sun
bamboo_capability_system_jdk_JDK_1_7=/usr/lib/jvm/java-7-openjdk-amd64
bamboo_planRepository_1_branchName=3.1.x
29-Dec-2017 11:05:15 You are running composer with xdebug enabled. This has a major impact on runtime performance. See https://getcomposer.org/xdebug
29-Dec-2017 11:05:15 You are using the deprecated option "dev". Dev packages are installed by default now.
29-Dec-2017 11:05:15 Cannot create cache directory /home/bamboo/.composer/cache/repo/https---packagist.org/, or directory is not writable. Proceeding without cache
29-Dec-2017 11:05:15 Cannot create cache directory /home/bamboo/.composer/cache/files/, or directory is not writable. Proceeding without cache
29-Dec-2017 11:05:15 Loading composer repositories with package information
29-Dec-2017 11:05:15 Installing dependencies (including require-dev) from lock file
29-Dec-2017 11:05:15   - Installing composer/installers (v1.4.0)
29-Dec-2017 11:05:16     Downloading: Connecting...    Downloading: 0%               Downloading: 15%    Downloading: 25%    Downloading: 40%    Downloading: 55%    Downloading: 70%    Downloading: 75%    Downloading: 85%    Downloading: 90%    Downloading: 100%    Downloading: 100%
29-Dec-2017 11:05:16
29-Dec-2017 11:05:16   - Installing bantu/ini-get-wrapper (v1.0.1)
29-Dec-2017 11:05:16     Downloading: Connecting...    Downloading: 0%               Downloading: 100%    Downloading: 100%
29-Dec-2017 11:05:16
29-Dec-2017 11:05:16   - Installing symfony/process (v3.3.4)
29-Dec-2017 11:05:17     Downloading: Connecting...    Downloading: 0%               Downloading: 25%    Downloading: 30%    Downloading: 50%    Downloading: 65%    Downloading: 75%    Downloading: 80%    Downloading: 100%    Downloading: 100%
29-Dec-2017 11:05:17
29-Dec-2017 11:05:17   - Installing symfony/finder (v3.3.4)
29-Dec-2017 11:05:17     Downloading: Connecting...    Downloading: 0%               Downloading: 5%    Downloading: 10%    Downloading: 80%    Downloading: 85%    Downloading: 90%    Downloading: 95%    Downloading: 100%    Downloading: 100%
29-Dec-2017 11:05:17
29-Dec-2017 11:05:17   - Installing symfony/filesystem (v3.3.4)
29-Dec-2017 11:05:18     Downloading: Connecting...    Downloading: 0%               Downloading: 50%    Downloading: 55%    Downloading: 100%    Downloading: 100%
29-Dec-2017 11:05:18
29-Dec-2017 11:05:18   - Installing symfony/polyfill-mbstring (v1.6.0)
29-Dec-2017 11:05:18     Downloading: Connecting...    Downloading: 0%               Downloading: 35%    Downloading: 90%    Downloading: 100%    Downloading: 100%
29-Dec-2017 11:05:18
29-Dec-2017 11:05:18   - Installing psr/log (1.0.2)
29-Dec-2017 11:05:19     Downloading: Connecting...    Downloading: 0%               Downloading: 15%    Downloading: 100%    Downloading: 100%
29-Dec-2017 11:05:19
29-Dec-2017 11:05:19   - Installing symfony/debug (v3.3.4)
29-Dec-2017 11:05:19     Downloading: Connecting...    Downloading: 0%               Downloading: 10%    Downloading: 20%    Downloading: 25%    Downloading: 35%    Downloading: 40%    Downloading: 50%    Downloading: 60%    Downloading: 70%    Downloading: 75%    Downloading: 90%    Downloading: 100%    Downloading: 100%
29-Dec-2017 11:05:19
29-Dec-2017 11:05:19   - Installing symfony/console (v3.3.4)
29-Dec-2017 11:05:20     Downloading: Connecting...    Downloading: 0%               Downloading: 5%    Downloading: 10%    Downloading: 15%    Downloading: 20%    Downloading: 25%    Downloading: 30%    Downloading: 35%    Downloading: 40%    Downloading: 45%    Downloading: 50%    Downloading: 55%    Downloading: 60%    Downloading: 65%    Downloading: 70%    Downloading: 75%    Downloading: 80%    Downloading: 85%    Downloading: 90%    Downloading: 95%    Downloading: 100%    Downloading: 100%
29-Dec-2017 11:05:20
29-Dec-2017 11:05:20   - Installing seld/phar-utils (1.0.1)
29-Dec-2017 11:05:21     Downloading: Connecting...    Downloading: 0%               Downloading: 30%    Downloading: 60%    Downloading: 90%    Downloading: 100%    Downloading: 100%
29-Dec-2017 11:05:21
29-Dec-2017 11:05:21   - Installing seld/jsonlint (1.6.1)
29-Dec-2017 11:05:21     Downloading: Connecting...    Downloading: 0%               Downloading: 40%    Downloading: 60%    Downloading: 100%    Downloading: 100%
29-Dec-2017 11:05:21
29-Dec-2017 11:05:21   - Installing seld/cli-prompt (1.0.3)
29-Dec-2017 11:05:21     Downloading: Connecting...    Downloading: 0%               Downloading: 15%    Downloading: 30%    Downloading: 100%    Downloading: 100%
29-Dec-2017 11:05:21
29-Dec-2017 11:05:21   - Installing justinrainbow/json-schema (5.2.1)
29-Dec-2017 11:05:22     Downloading: Connecting...    Downloading: 0%               Downloading: 5%    Downloading: 20%    Downloading: 25%    Downloading: 30%    Downloading: 35%    Downloading: 55%    Downloading: 60%    Downloading: 75%    Downloading: 80%    Downloading: 100%    Downloading: 100%
29-Dec-2017 11:05:22
29-Dec-2017 11:05:22   - Installing composer/spdx-licenses (1.1.6)
29-Dec-2017 11:05:23     Downloading: Connecting...    Downloading: 0%               Downloading: 75%    Downloading: 100%    Downloading: 100%
29-Dec-2017 11:05:23
29-Dec-2017 11:05:23   - Installing composer/semver (1.4.2)
29-Dec-2017 11:05:23     Downloading: Connecting...    Downloading: 0%               Downloading: 35%    Downloading: 75%    Downloading: 100%    Downloading: 100%
29-Dec-2017 11:05:23
29-Dec-2017 11:05:23   - Installing composer/ca-bundle (1.0.7)
29-Dec-2017 11:05:24     Downloading: Connecting...    Downloading: 0%               Downloading: 5%    Downloading: 10%    Downloading: 15%    Downloading: 20%    Downloading: 25%    Downloading: 30%    Downloading: 35%    Downloading: 40%    Downloading: 45%    Downloading: 50%    Downloading: 55%    Downloading: 60%    Downloading: 65%    Downloading: 70%    Downloading: 75%    Downloading: 80%    Downloading: 85%    Downloading: 90%    Downloading: 95%    Downloading: 100%    Downloading: 100%
29-Dec-2017 11:05:24
29-Dec-2017 11:05:24   - Installing composer/composer (1.4.2)
29-Dec-2017 11:05:25     Downloading: Connecting...    Downloading: 0%               Downloading: 5%    Downloading: 10%    Downloading: 15%    Downloading: 20%    Downloading: 25%    Downloading: 30%    Downloading: 35%    Downloading: 40%    Downloading: 45%    Downloading: 50%    Downloading: 55%    Downloading: 60%    Downloading: 65%    Downloading: 70%    Downloading: 75%    Downloading: 80%    Downloading: 85%    Downloading: 90%    Downloading: 95%    Downloading: 100%    Downloading: 100%
29-Dec-2017 11:05:25
29-Dec-2017 11:05:25   - Installing google/recaptcha (1.1.3)
29-Dec-2017 11:05:25     Downloading: Connecting...    Downloading: 0%               Downloading: 25%    Downloading: 30%    Downloading: 55%    Downloading: 80%    Downloading: 95%    Downloading: 100%    Downloading: 100%
29-Dec-2017 11:05:25
29-Dec-2017 11:05:25   - Installing guzzlehttp/promises (v1.3.1)
29-Dec-2017 11:05:26     Downloading: Connecting...    Downloading: 0%               Downloading: 30%    Downloading: 40%    Downloading: 70%    Downloading: 80%    Downloading: 100%    Downloading: 100%
29-Dec-2017 11:05:26
29-Dec-2017 11:05:26   - Installing psr/http-message (1.0.1)
29-Dec-2017 11:05:26     Downloading: Connecting...    Downloading: 0%               Downloading: 65%    Downloading: 90%    Downloading: 100%
29-Dec-2017 11:05:26
29-Dec-2017 11:05:26   - Installing guzzlehttp/psr7 (1.4.2)
29-Dec-2017 11:05:27     Downloading: Connecting...    Downloading: 0%               Downloading: 5%    Downloading: 10%    Downloading: 15%    Downloading: 20%    Downloading: 50%    Downloading: 55%    Downloading: 60%    Downloading: 65%    Downloading: 85%    Downloading: 90%    Downloading: 95%    Downloading: 100%    Downloading: 100%
29-Dec-2017 11:05:27
29-Dec-2017 11:05:27   - Installing lusitanian/oauth (v0.8.10)
29-Dec-2017 11:05:28     Downloading: Connecting...    Downloading: 0%               Downloading: 5%    Downloading: 10%    Downloading: 15%    Downloading: 20%    Downloading: 25%    Downloading: 30%    Downloading: 35%    Downloading: 40%    Downloading: 45%    Downloading: 50%    Downloading: 55%    Downloading: 60%    Downloading: 70%    Downloading: 75%    Downloading: 80%    Downloading: 85%    Downloading: 90%    Downloading: 100%
29-Dec-2017 11:05:28
29-Dec-2017 11:05:28   - Installing marc1706/fast-image-size (v1.1.4)
29-Dec-2017 11:05:28     Downloading: Connecting...    Downloading: 0%               Downloading: 45%    Downloading: 90%    Downloading: 100%    Downloading: 100%
29-Dec-2017 11:05:28
29-Dec-2017 11:05:28   - Installing paragonie/random_compat (v1.4.2)
29-Dec-2017 11:05:28     Downloading: Connecting...    Downloading: 0%               Downloading: 10%    Downloading: 35%    Downloading: 45%    Downloading: 75%    Downloading: 100%    Downloading: 100%
29-Dec-2017 11:05:28
29-Dec-2017 11:05:28   - Installing patchwork/utf8 (v1.3.1)
29-Dec-2017 11:05:29     Downloading: Connecting...    Downloading: 0%               Downloading: 5%    Downloading: 10%    Downloading: 15%    Downloading: 20%    Downloading: 25%    Downloading: 30%    Downloading: 35%    Downloading: 40%    Downloading: 45%    Downloading: 50%    Downloading: 55%    Downloading: 60%    Downloading: 65%    Downloading: 70%    Downloading: 75%    Downloading: 80%    Downloading: 85%    Downloading: 90%    Downloading: 95%    Downloading: 100%    Downloading: 100%
29-Dec-2017 11:05:30
29-Dec-2017 11:05:30   - Installing psr/container (1.0.0)
29-Dec-2017 11:05:30     Downloading: Connecting...    Downloading: 0%               Downloading: 75%    Downloading: 100%    Downloading: 100%
29-Dec-2017 11:05:30
29-Dec-2017 11:05:30   - Installing s9e/text-formatter (0.13.1)
29-Dec-2017 11:05:30     Downloading: Connecting...    Downloading: 0%               Downloading: 5%    Downloading: 10%    Downloading: 15%    Downloading: 20%    Downloading: 25%    Downloading: 30%    Downloading: 35%    Downloading: 40%    Downloading: 45%    Downloading: 50%    Downloading: 55%    Downloading: 60%    Downloading: 65%    Downloading: 75%    Downloading: 85%    Downloading: 90%    Downloading: 95%    Downloading: 100%    Downloading: 100%
29-Dec-2017 11:05:30
29-Dec-2017 11:05:30   - Installing symfony/config (v3.3.4)
29-Dec-2017 11:05:31     Downloading: Connecting...    Downloading: 0%               Downloading: 5%    Downloading: 10%    Downloading: 15%    Downloading: 20%    Downloading: 25%    Downloading: 30%    Downloading: 35%    Downloading: 40%    Downloading: 45%    Downloading: 55%    Downloading: 60%    Downloading: 65%    Downloading: 70%    Downloading: 75%    Downloading: 80%    Downloading: 85%    Downloading: 95%    Downloading: 100%    Downloading: 100%
29-Dec-2017 11:05:31
29-Dec-2017 11:05:31   - Installing symfony/http-foundation (v3.3.4)
29-Dec-2017 11:05:32     Downloading: Connecting...    Downloading: 0%               Downloading: 5%    Downloading: 10%    Downloading: 15%    Downloading: 20%    Downloading: 25%    Downloading: 30%    Downloading: 35%    Downloading: 40%    Downloading: 45%    Downloading: 50%    Downloading: 55%    Downloading: 60%    Downloading: 65%    Downloading: 70%    Downloading: 75%    Downloading: 80%    Downloading: 85%    Downloading: 90%    Downloading: 95%    Downloading: 100%    Downloading: 100%
29-Dec-2017 11:05:32
29-Dec-2017 11:05:32   - Installing symfony/event-dispatcher (v3.3.4)
29-Dec-2017 11:05:32     Downloading: Connecting...    Downloading: 0%               Downloading: 5%    Downloading: 35%    Downloading: 40%    Downloading: 45%    Downloading: 100%    Downloading: 100%
29-Dec-2017 11:05:32
29-Dec-2017 11:05:32   - Installing symfony/http-kernel (v3.3.4)
29-Dec-2017 11:05:33     Downloading: Connecting...    Downloading: 0%               Downloading: 5%    Downloading: 10%    Downloading: 15%    Downloading: 20%    Downloading: 25%    Downloading: 30%    Downloading: 35%    Downloading: 40%    Downloading: 45%    Downloading: 50%    Downloading: 55%    Downloading: 60%    Downloading: 65%    Downloading: 70%    Downloading: 75%    Downloading: 80%    Downloading: 85%    Downloading: 90%    Downloading: 95%    Downloading: 100%    Downloading: 100%
29-Dec-2017 11:05:33
29-Dec-2017 11:05:33   - Installing symfony/dependency-injection (v3.3.4)
29-Dec-2017 11:05:33     Downloading: Connecting...    Downloading: 0%               Downloading: 5%    Downloading: 10%    Downloading: 15%    Downloading: 20%    Downloading: 25%    Downloading: 30%    Downloading: 35%    Downloading: 40%    Downloading: 45%    Downloading: 50%    Downloading: 55%    Downloading: 60%    Downloading: 65%    Downloading: 70%    Downloading: 85%    Downloading: 90%    Downloading: 100%    Downloading: 100%
29-Dec-2017 11:05:34
29-Dec-2017 11:05:34   - Installing zendframework/zend-eventmanager (3.2.0)
29-Dec-2017 11:05:34     Downloading: Connecting...    Downloading: 0%               Downloading: 25%    Downloading: 35%    Downloading: 60%    Downloading: 90%    Downloading: 95%    Downloading: 100%    Downloading: 100%
29-Dec-2017 11:05:34
29-Dec-2017 11:05:34   - Installing zendframework/zend-code (2.6.3)
29-Dec-2017 11:05:35     Downloading: Connecting...    Downloading: 0%               Downloading: 5%    Downloading: 10%    Downloading: 15%    Downloading: 20%    Downloading: 25%    Downloading: 30%    Downloading: 35%    Downloading: 40%    Downloading: 45%    Downloading: 50%    Downloading: 55%    Downloading: 60%    Downloading: 65%    Downloading: 70%    Downloading: 75%    Downloading: 85%    Downloading: 90%    Downloading: 95%    Downloading: 100%    Downloading: 100%
29-Dec-2017 11:05:35
29-Dec-2017 11:05:35   - Installing ocramius/proxy-manager (1.0.2)
29-Dec-2017 11:05:35     Downloading: Connecting...    Downloading: 0%               Downloading: 5%    Downloading: 10%    Downloading: 15%    Downloading: 20%    Downloading: 25%    Downloading: 30%    Downloading: 35%    Downloading: 40%    Downloading: 45%    Downloading: 50%    Downloading: 55%    Downloading: 65%    Downloading: 70%    Downloading: 75%    Downloading: 80%    Downloading: 85%    Downloading: 90%    Downloading: 95%    Downloading: 100%    Downloading: 100%
29-Dec-2017 11:05:35
29-Dec-2017 11:05:35   - Installing symfony/proxy-manager-bridge (v3.3.4)
29-Dec-2017 11:05:36     Downloading: Connecting...    Downloading: 0%               Downloading: 25%    Downloading: 55%    Downloading: 80%    Downloading: 100%    Downloading: 100%
29-Dec-2017 11:05:36
29-Dec-2017 11:05:36   - Installing symfony/routing (v3.3.4)
29-Dec-2017 11:05:37     Downloading: Connecting...    Downloading: 0%               Downloading: 5%    Downloading: 10%    Downloading: 15%    Downloading: 20%    Downloading: 25%    Downloading: 30%    Downloading: 35%    Downloading: 40%    Downloading: 45%    Downloading: 50%    Downloading: 55%    Downloading: 60%    Downloading: 65%    Downloading: 70%    Downloading: 75%    Downloading: 80%    Downloading: 85%    Downloading: 90%    Downloading: 95%    Downloading: 100%    Downloading: 100%
29-Dec-2017 11:05:37
29-Dec-2017 11:05:37   - Installing twig/twig (v1.35.0)
29-Dec-2017 11:05:37     Downloading: Connecting...    Downloading: 0%               Downloading: 5%    Downloading: 10%    Downloading: 15%    Downloading: 20%    Downloading: 25%    Downloading: 30%    Downloading: 35%    Downloading: 40%    Downloading: 45%    Downloading: 50%    Downloading: 55%    Downloading: 65%    Downloading: 70%    Downloading: 75%    Downloading: 80%    Downloading: 85%    Downloading: 90%    Downloading: 95%    Downloading: 100%    Downloading: 100%
29-Dec-2017 11:05:37
29-Dec-2017 11:05:37   - Installing symfony/twig-bridge (v3.3.4)
29-Dec-2017 11:05:38     Downloading: Connecting...    Downloading: 0%               Downloading: 5%    Downloading: 10%    Downloading: 20%    Downloading: 25%    Downloading: 30%    Downloading: 40%    Downloading: 45%    Downloading: 50%    Downloading: 55%    Downloading: 65%    Downloading: 70%    Downloading: 75%    Downloading: 80%    Downloading: 95%    Downloading: 100%    Downloading: 100%
29-Dec-2017 11:05:38
29-Dec-2017 11:05:38   - Installing symfony/dom-crawler (v3.3.4)
29-Dec-2017 11:05:39     Downloading: Connecting...    Downloading: 0%               Downloading: 25%    Downloading: 30%    Downloading: 40%    Downloading: 45%    Downloading: 55%    Downloading: 85%    Downloading: 100%    Downloading: 100%
29-Dec-2017 11:05:39
29-Dec-2017 11:05:39   - Installing symfony/css-selector (v3.3.4)
29-Dec-2017 11:05:39     Downloading: Connecting...    Downloading: 0%               Downloading: 5%    Downloading: 10%    Downloading: 25%    Downloading: 30%    Downloading: 35%    Downloading: 40%    Downloading: 45%    Downloading: 50%    Downloading: 55%    Downloading: 60%    Downloading: 95%    Downloading: 100%    Downloading: 100%
29-Dec-2017 11:05:39
29-Dec-2017 11:05:39   - Installing symfony/browser-kit (v3.3.4)
29-Dec-2017 11:05:40     Downloading: Connecting...    Downloading: 0%               Downloading: 50%    Downloading: 55%    Downloading: 100%    Downloading: 100%
29-Dec-2017 11:05:40
29-Dec-2017 11:05:40   - Installing guzzlehttp/guzzle (6.3.0)
29-Dec-2017 11:05:41     Downloading: Connecting...    Downloading: 0%               Downloading: 5%    Downloading: 15%    Downloading: 25%    Downloading: 30%    Downloading: 35%    Downloading: 45%    Downloading: 50%    Downloading: 60%    Downloading: 65%    Downloading: 75%    Downloading: 80%    Downloading: 90%    Downloading: 95%    Downloading: 100%    Downloading: 100%
29-Dec-2017 11:05:41
29-Dec-2017 11:05:41   - Installing fabpot/goutte (v3.2.1)
29-Dec-2017 11:05:41     Downloading: Connecting...    Downloading: 0%               Downloading: 70%    Downloading: 100%    Downloading: 100%
29-Dec-2017 11:05:41
29-Dec-2017 11:05:41   - Installing facebook/webdriver (1.4.1)
29-Dec-2017 11:05:41     Downloading: Connecting...    Downloading: 0%               Downloading: 5%    Downloading: 10%    Downloading: 15%    Downloading: 20%    Downloading: 25%    Downloading: 30%    Downloading: 35%    Downloading: 40%    Downloading: 45%    Downloading: 50%    Downloading: 55%    Downloading: 60%    Downloading: 65%    Downloading: 70%    Downloading: 75%    Downloading: 80%    Downloading: 85%    Downloading: 90%    Downloading: 95%    Downloading: 100%    Downloading: 100%
29-Dec-2017 11:05:41
29-Dec-2017 11:05:41   - Installing laravel/homestead (v4.0.5)
29-Dec-2017 11:05:42     Downloading: Connecting...    Downloading: 0%               Downloading: 5%    Downloading: 10%    Downloading: 35%    Downloading: 40%    Downloading: 45%    Downloading: 50%    Downloading: 70%    Downloading: 75%    Downloading: 80%    Downloading: 85%    Downloading: 100%    Downloading: 100%
29-Dec-2017 11:05:42
29-Dec-2017 11:05:42   - Installing phing/phing (2.4.14)
29-Dec-2017 11:05:43     Downloading: Connecting...    Downloading: 0%               Downloading: 5%    Downloading: 10%    Downloading: 15%    Downloading: 20%    Downloading: 25%    Downloading: 30%    Downloading: 35%    Downloading: 40%    Downloading: 45%    Downloading: 50%    Downloading: 55%    Downloading: 60%    Downloading: 65%    Downloading: 70%    Downloading: 75%    Downloading: 80%    Downloading: 85%    Downloading: 90%    Downloading: 95%    Downloading: 100%    Downloading: 100%
29-Dec-2017 11:05:43
29-Dec-2017 11:05:43   - Installing webmozart/assert (1.2.0)
29-Dec-2017 11:05:44     Downloading: Connecting...    Downloading: 0%               Downloading: 55%    Downloading: 60%    Downloading: 100%    Downloading: 100%
29-Dec-2017 11:05:44
29-Dec-2017 11:05:44   - Installing phpdocumentor/reflection-common (1.0)
29-Dec-2017 11:05:44     Downloading: Connecting...    Downloading: 0%               Downloading: 65%    Downloading: 100%    Downloading: 100%
29-Dec-2017 11:05:44
29-Dec-2017 11:05:44   - Installing phpdocumentor/type-resolver (0.4.0)
29-Dec-2017 11:05:45     Downloading: Connecting...    Downloading: 0%               Downloading: 5%    Downloading: 35%    Downloading: 40%    Downloading: 45%    Downloading: 50%    Downloading: 80%    Downloading: 85%    Downloading: 90%    Downloading: 100%    Downloading: 100%
29-Dec-2017 11:05:45
29-Dec-2017 11:05:45   - Installing phpdocumentor/reflection-docblock (3.2.0)
29-Dec-2017 11:05:45     Downloading: Connecting...    Downloading: 0%               Downloading: 5%    Downloading: 30%    Downloading: 35%    Downloading: 65%    Downloading: 70%    Downloading: 100%    Downloading: 100%
29-Dec-2017 11:05:45
29-Dec-2017 11:05:45   - Installing symfony/yaml (v3.3.4)
29-Dec-2017 11:05:46     Downloading: Connecting...    Downloading: 0%               Downloading: 5%    Downloading: 10%    Downloading: 15%    Downloading: 25%    Downloading: 30%    Downloading: 35%    Downloading: 40%    Downloading: 45%    Downloading: 75%    Downloading: 80%    Downloading: 85%    Downloading: 90%    Downloading: 95%    Downloading: 100%    Downloading: 100%
29-Dec-2017 11:05:46
29-Dec-2017 11:05:46   - Installing sebastian/version (2.0.1)
29-Dec-2017 11:05:47     Downloading: Connecting...    Downloading: 0%               Downloading: 100%    Downloading: 100%
29-Dec-2017 11:05:47
29-Dec-2017 11:05:47   - Installing sebastian/resource-operations (1.0.0)
29-Dec-2017 11:05:47     Downloading: Connecting...    Downloading: 0%               Downloading: 65%    Downloading: 100%    Downloading: 100%
29-Dec-2017 11:05:47
29-Dec-2017 11:05:47   - Installing sebastian/recursion-context (2.0.0)
29-Dec-2017 11:05:48     Downloading: Connecting...    Downloading: 0%               Downloading: 100%    Downloading: 100%
29-Dec-2017 11:05:48
29-Dec-2017 11:05:48   - Installing sebastian/object-enumerator (2.0.1)
29-Dec-2017 11:05:48     Downloading: Connecting...    Downloading: 0%               Downloading: 95%    Downloading: 100%    Downloading: 100%
29-Dec-2017 11:05:48
29-Dec-2017 11:05:48   - Installing sebastian/global-state (1.1.1)
29-Dec-2017 11:05:49     Downloading: Connecting...    Downloading: 0%               Downloading: 40%    Downloading: 85%    Downloading: 100%    Downloading: 100%
29-Dec-2017 11:05:49
29-Dec-2017 11:05:49   - Installing sebastian/exporter (2.0.0)
29-Dec-2017 11:05:50     Downloading: Connecting...    Downloading: 0%               Downloading: 100%    Downloading: 100%
29-Dec-2017 11:05:50
29-Dec-2017 11:05:50   - Installing sebastian/environment (2.0.0)
29-Dec-2017 11:05:50     Downloading: Connecting...    Downloading: 0%               Downloading: 15%    Downloading: 30%    Downloading: 45%    Downloading: 60%    Downloading: 75%    Downloading: 90%    Downloading: 100%    Downloading: 100%
29-Dec-2017 11:05:50
29-Dec-2017 11:05:50   - Installing sebastian/diff (1.4.3)
29-Dec-2017 11:05:50     Downloading: Connecting...    Downloading: 0%               Downloading: 35%    Downloading: 40%    Downloading: 75%    Downloading: 100%    Downloading: 100%
29-Dec-2017 11:05:50
29-Dec-2017 11:05:50   - Installing sebastian/comparator (1.2.4)
29-Dec-2017 11:05:51     Downloading: Connecting...    Downloading: 0%               Downloading: 10%    Downloading: 70%    Downloading: 80%    Downloading: 90%    Downloading: 95%    Downloading: 100%    Downloading: 100%
29-Dec-2017 11:05:51
29-Dec-2017 11:05:51   - Installing phpunit/php-text-template (1.2.1)
29-Dec-2017 11:05:52     Downloading: Connecting...    Downloading: 0%               Downloading: 35%    Downloading: 100%    Downloading: 100%
29-Dec-2017 11:05:52
29-Dec-2017 11:05:52   - Installing doctrine/instantiator (1.0.5)
29-Dec-2017 11:05:52     Downloading: Connecting...    Downloading: 0%               Downloading: 15%    Downloading: 85%    Downloading: 100%    Downloading: 100%
29-Dec-2017 11:05:52
29-Dec-2017 11:05:52   - Installing phpunit/phpunit-mock-objects (3.4.4)
29-Dec-2017 11:05:53     Downloading: Connecting...    Downloading: 0%               Downloading: 5%    Downloading: 10%    Downloading: 15%    Downloading: 20%    Downloading: 25%    Downloading: 30%    Downloading: 35%    Downloading: 40%    Downloading: 45%    Downloading: 50%    Downloading: 55%    Downloading: 60%    Downloading: 65%    Downloading: 70%    Downloading: 75%    Downloading: 85%    Downloading: 90%    Downloading: 95%    Downloading: 100%    Downloading: 100%
29-Dec-2017 11:05:53
29-Dec-2017 11:05:53   - Installing phpunit/php-timer (1.0.9)
29-Dec-2017 11:05:53     Downloading: Connecting...    Downloading: 0%               Downloading: 45%    Downloading: 90%    Downloading: 100%    Downloading: 100%
29-Dec-2017 11:05:53
29-Dec-2017 11:05:53   - Installing phpunit/php-file-iterator (1.4.5)
29-Dec-2017 11:05:54     Downloading: Connecting...    Downloading: 0%               Downloading: 100%    Downloading: 100%
29-Dec-2017 11:05:54
29-Dec-2017 11:05:54   - Installing sebastian/code-unit-reverse-lookup (1.0.1)
29-Dec-2017 11:05:55     Downloading: Connecting...    Downloading: 0%               Downloading: 55%    Downloading: 100%    Downloading: 100%
29-Dec-2017 11:05:55
29-Dec-2017 11:05:55   - Installing phpunit/php-token-stream (1.4.12)
29-Dec-2017 11:05:55     Downloading: Connecting...    Downloading: 0%               Downloading: 5%    Downloading: 10%    Downloading: 15%    Downloading: 20%    Downloading: 100%    Downloading: 100%
29-Dec-2017 11:05:55
29-Dec-2017 11:05:55   - Installing phpunit/php-code-coverage (4.0.8)
29-Dec-2017 11:05:56     Downloading: Connecting...    Downloading: 0%               Downloading: 5%    Downloading: 10%    Downloading: 15%    Downloading: 20%    Downloading: 25%    Downloading: 30%    Downloading: 35%    Downloading: 40%    Downloading: 45%    Downloading: 50%    Downloading: 55%    Downloading: 60%    Downloading: 65%    Downloading: 70%    Downloading: 80%    Downloading: 85%    Downloading: 95%    Downloading: 100%    Downloading: 100%
29-Dec-2017 11:05:56
29-Dec-2017 11:05:56   - Installing phpspec/prophecy (1.7.3)
29-Dec-2017 11:05:58     Downloading: Connecting...    Downloading: 0%               Downloading: 10%    Downloading: 15%    Downloading: 20%    Downloading: 25%    Downloading: 30%    Downloading: 40%    Downloading: 50%    Downloading: 55%    Downloading: 60%    Downloading: 65%    Downloading: 75%    Downloading: 85%    Downloading: 95%    Downloading: 100%    Downloading: 100%
29-Dec-2017 11:05:58
29-Dec-2017 11:05:58   - Installing myclabs/deep-copy (1.6.1)
29-Dec-2017 11:05:58     Downloading: Connecting...    Downloading: 0%               Downloading: 5%    Downloading: 10%    Downloading: 15%    Downloading: 20%    Downloading: 50%    Downloading: 55%    Downloading: 60%    Downloading: 65%    Downloading: 80%    Downloading: 85%    Downloading: 90%    Downloading: 95%    Downloading: 100%    Downloading: 100%
29-Dec-2017 11:05:58
29-Dec-2017 11:05:58   - Installing phpunit/phpunit (5.7.21)
29-Dec-2017 11:05:59     Downloading: Connecting...    Downloading: 0%               Downloading: 5%    Downloading: 10%    Downloading: 15%    Downloading: 20%    Downloading: 25%    Downloading: 30%    Downloading: 35%    Downloading: 40%    Downloading: 45%    Downloading: 50%    Downloading: 55%    Downloading: 60%    Downloading: 65%    Downloading: 85%    Downloading: 90%    Downloading: 95%    Downloading: 100%    Downloading: 100%
29-Dec-2017 11:05:59
29-Dec-2017 11:05:59   - Installing phpunit/dbunit (2.0.3)
29-Dec-2017 11:06:00     Downloading: Connecting...    Downloading: 0%               Downloading: 5%    Downloading: 10%    Downloading: 15%    Downloading: 20%    Downloading: 25%    Downloading: 30%    Downloading: 35%    Downloading: 40%    Downloading: 45%    Downloading: 50%    Downloading: 55%    Downloading: 60%    Downloading: 65%    Downloading: 70%    Downloading: 75%    Downloading: 80%    Downloading: 85%    Downloading: 90%    Downloading: 95%    Downloading: 100%    Downloading: 100%
29-Dec-2017 11:06:00
29-Dec-2017 11:06:00   - Installing squizlabs/php_codesniffer (2.9.1)
29-Dec-2017 11:06:00     Downloading: Connecting...    Downloading: 0%               Downloading: 5%    Downloading: 10%    Downloading: 15%    Downloading: 20%    Downloading: 25%    Downloading: 30%    Downloading: 35%    Downloading: 40%    Downloading: 45%    Downloading: 50%    Downloading: 55%    Downloading: 60%    Downloading: 65%    Downloading: 70%    Downloading: 75%    Downloading: 80%    Downloading: 85%    Downloading: 90%    Downloading: 95%    Downloading: 100%    Downloading: 100%
29-Dec-2017 11:06:00
29-Dec-2017 11:06:01 lusitanian/oauth suggests installing predis/predis (Allows using the Redis storage backend.)
29-Dec-2017 11:06:01 paragonie/random_compat suggests installing ext-libsodium (Provides a modern crypto API that can be used to generate random bytes.)
29-Dec-2017 11:06:01 patchwork/utf8 suggests installing ext-intl (Use Intl for best performance)
29-Dec-2017 11:06:01 patchwork/utf8 suggests installing ext-wfio (Use WFIO for UTF-8 filesystem access on Windows)
29-Dec-2017 11:06:01 s9e/text-formatter suggests installing ext-intl (Allows international URLs to be accepted by the URL filter)
29-Dec-2017 11:06:01 s9e/text-formatter suggests installing ext-xsl (Enables the XSLT renderer)
29-Dec-2017 11:06:01 symfony/http-kernel suggests installing symfony/class-loader ()
29-Dec-2017 11:06:01 symfony/http-kernel suggests installing symfony/var-dumper ()
29-Dec-2017 11:06:01 symfony/dependency-injection suggests installing symfony/expression-language (For using expressions in service container configuration)
29-Dec-2017 11:06:01 zendframework/zend-eventmanager suggests installing container-interop/container-interop (^1.1.0, to use the lazy listeners feature)
29-Dec-2017 11:06:01 zendframework/zend-eventmanager suggests installing zendframework/zend-stdlib (^2.7.3 || ^3.0, to use the FilterChain feature)
29-Dec-2017 11:06:01 zendframework/zend-code suggests installing doctrine/annotations (Doctrine\Common\Annotations >=1.0 for annotation features)
29-Dec-2017 11:06:01 zendframework/zend-code suggests installing zendframework/zend-stdlib (Zend\Stdlib component)
29-Dec-2017 11:06:01 ocramius/proxy-manager suggests installing ocramius/generated-hydrator (To have very fast object to array to object conversion for ghost objects)
29-Dec-2017 11:06:01 ocramius/proxy-manager suggests installing zendframework/zend-json (To have the JsonRpc adapter (Remote Object feature))
29-Dec-2017 11:06:01 ocramius/proxy-manager suggests installing zendframework/zend-soap (To have the Soap adapter (Remote Object feature))
29-Dec-2017 11:06:01 ocramius/proxy-manager suggests installing zendframework/zend-stdlib (To use the hydrator proxy)
29-Dec-2017 11:06:01 ocramius/proxy-manager suggests installing zendframework/zend-xmlrpc (To have the XmlRpc adapter (Remote Object feature))
29-Dec-2017 11:06:01 symfony/routing suggests installing doctrine/annotations (For using the annotation loader)
29-Dec-2017 11:06:01 symfony/routing suggests installing symfony/expression-language (For using expression matching)
29-Dec-2017 11:06:01 symfony/twig-bridge suggests installing symfony/asset (For using the AssetExtension)
29-Dec-2017 11:06:01 symfony/twig-bridge suggests installing symfony/expression-language (For using the ExpressionExtension)
29-Dec-2017 11:06:01 symfony/twig-bridge suggests installing symfony/form (For using the FormExtension)
29-Dec-2017 11:06:01 symfony/twig-bridge suggests installing symfony/security (For using the SecurityExtension)
29-Dec-2017 11:06:01 symfony/twig-bridge suggests installing symfony/stopwatch (For using the StopwatchExtension)
29-Dec-2017 11:06:01 symfony/twig-bridge suggests installing symfony/templating (For using the TwigEngine)
29-Dec-2017 11:06:01 symfony/twig-bridge suggests installing symfony/translation (For using the TranslationExtension)
29-Dec-2017 11:06:01 symfony/twig-bridge suggests installing symfony/var-dumper (For using the DumpExtension)
29-Dec-2017 11:06:01 symfony/twig-bridge suggests installing symfony/web-link (For using the WebLinkExtension)
29-Dec-2017 11:06:01 sebastian/global-state suggests installing ext-uopz (*)
29-Dec-2017 11:06:01 phpunit/phpunit-mock-objects suggests installing ext-soap (*)
29-Dec-2017 11:06:01 phpunit/phpunit suggests installing phpunit/php-invoker (~1.1)
29-Dec-2017 11:06:01 Generating autoload files
29-Dec-2017 11:06:02 Buildfile: /data/build/build.xml
29-Dec-2017 11:06:02
29-Dec-2017 11:06:02 phpBB > clean:
29-Dec-2017 11:06:02
29-Dec-2017 11:06:02    [delete] Directory /data/build/logs does not exist or is not a directory.
29-Dec-2017 11:06:02    [delete] Directory /data/build/api does not exist or is not a directory.
29-Dec-2017 11:06:02    [delete] Directory /data/build/codebrowser does not exist or is not a directory.
29-Dec-2017 11:06:02    [delete] Directory /data/build/coverage does not exist or is not a directory.
29-Dec-2017 11:06:02    [delete] Directory /data/build/cpd does not exist or is not a directory.
29-Dec-2017 11:06:02    [delete] Directory /data/build/dependencies does not exist or is not a directory.
29-Dec-2017 11:06:02    [delete] Directory /data/build/new_version does not exist or is not a directory.
29-Dec-2017 11:06:02    [delete] Directory /data/build/old_versions does not exist or is not a directory.
29-Dec-2017 11:06:02    [delete] Directory /data/build/save does not exist or is not a directory.
29-Dec-2017 11:06:02
29-Dec-2017 11:06:02 phpBB > prepare:
29-Dec-2017 11:06:02
29-Dec-2017 11:06:02     [mkdir] Created dir: /data/build/logs
29-Dec-2017 11:06:02     [mkdir] Created dir: /data/build/api
29-Dec-2017 11:06:02     [mkdir] Created dir: /data/build/codebrowser
29-Dec-2017 11:06:02     [mkdir] Created dir: /data/build/coverage
29-Dec-2017 11:06:02     [mkdir] Created dir: /data/build/cpd
29-Dec-2017 11:06:02     [mkdir] Created dir: /data/build/dependencies
29-Dec-2017 11:06:02     [mkdir] Created dir: /data/build/new_version
29-Dec-2017 11:06:02     [mkdir] Created dir: /data/build/new_version/files
29-Dec-2017 11:06:02     [mkdir] Created dir: /data/build/new_version/patches
29-Dec-2017 11:06:02     [mkdir] Created dir: /data/build/new_version/release_files
29-Dec-2017 11:06:02     [mkdir] Created dir: /data/build/new_version/update
29-Dec-2017 11:06:02     [mkdir] Created dir: /data/build/old_versions
29-Dec-2017 11:06:02     [mkdir] Created dir: /data/build/save
29-Dec-2017 11:06:02
29-Dec-2017 11:06:02 BUILD FINISHED
29-Dec-2017 11:06:02
29-Dec-2017 11:06:02 Total time: 0.0865 seconds
29-Dec-2017 11:06:02
29-Dec-2017 11:06:02 Finished task 'Prepare directory' with result: Success
29-Dec-2017 11:06:02 Skipping execution of task 'Run sniffs' as it is disabled
29-Dec-2017 11:06:02
Substituting variable: ${bamboo.working.directory} with /home/bamboo/xml-data/build-dir/PHPBB3-PR-JOB1
29-Dec-2017 11:06:02 Starting task 'Run sniffs' of type 'com.atlassian.bamboo.plugins.bamboo-docker-plugin:task.docker.cli'
29-Dec-2017 11:06:02 Running image name (phpbb:php-5.6)
29-Dec-2017 11:06:02
Beginning to execute external process for build 'phpBB3 - Pull Requests - Build and Test Job #7792 (PHPBB3-PR-JOB1-7792)'
... running command line:
/usr/bin/docker run --volume /home/bamboo/xml-data/build-dir/PHPBB3-PR-JOB1:/data --workdir /data/build --rm -u=991 phpbb:php-5.6 ../phpBB/vendor/bin/phing sniff
... in: /home/bamboo/xml-data/build-dir/PHPBB3-PR-JOB1
... using extra environment variables:
bamboo_planRepository_1_branch=3.1.x
bamboo_planRepository_1_branchDisplayName=3.1.x
bamboo_repository_revision_number=93621aa1844ab48d9bae068d9872d2c49ae86de4
bamboo_PRref=master
bamboo_resultsUrl=https://bamboo.phpbb.com/browse/PHPBB3-PR-JOB1-7792
bamboo_capability_system_builder_command_Git=/usr/bin/git
bamboo_repository_75956235_git_username=bantu
bamboo_planRepository_1_name=phpBB Ascraeus
bamboo_build_working_directory=/home/bamboo/xml-data/build-dir/PHPBB3-PR-JOB1
bamboo_buildKey=PHPBB3-PR-JOB1
bamboo_capability_phpbb_tests=true
bamboo_shortPlanName=Pull Requests
bamboo_capability_system_builder_command_fop=/usr/bin/fop
bamboo_capability_dbms_sqlite_2=true
bamboo_planRepository_name=phpBB Ascraeus
bamboo_PRnumber=4933
bamboo_buildNumber=7792
bamboo_repository_75956235_git_repositoryUrl=https://github.com/phpbb/phpbb.git
bamboo_capability_system_builder_phpunit_PHPUnit=/usr/bin/phpunit
bamboo_shortJobName=Build and Test Job
bamboo_buildResultsUrl=https://bamboo.phpbb.com/browse/PHPBB3-PR-JOB1-7792
bamboo_repository_75956235_branch_name=3.1.x
bamboo_planRepository_repositoryUrl=https://github.com/phpbb/phpbb.git
bamboo_agentId=131073
bamboo_planName=phpBB3 - Pull Requests
bamboo_build_commandline_com_atlassian_bamboo_plugins_scripttask_task_builder_script_7=/bin/sh /home/bamboo/temp/PHPBB3-PR-JOB1-7792-ScriptBuildTask-932955968583869166.sh
bamboo_shortPlanKey=PR
bamboo_shortJobKey=JOB1
bamboo_capability_dbms_mysql_55=true
bamboo_capability_system_jdk_JDK_1_7_0_65=/usr/lib/jvm/java-7-openjdk-amd64
bamboo_planRepository_revision=93621aa1844ab48d9bae068d9872d2c49ae86de4
bamboo_repository_previous_revision_number=93621aa1844ab48d9bae068d9872d2c49ae86de4
bamboo_buildTimeStamp=2017-12-29T11:05:05.817Z
bamboo_planRepository_previousRevision=93621aa1844ab48d9bae068d9872d2c49ae86de4
bamboo_capability_system_builder_mvn2_Maven_2=/usr/share/maven2
bamboo_capability_system_jdk_JDK_1_6_0_16=/usr/lib/jvm/java-6-sun-1.6.0.16
bamboo_build_commandline_com_atlassian_bamboo_plugins_scripttask_task_builder_script_4=/bin/sh /home/bamboo/temp/PHPBB3-PR-JOB1-7792-ScriptBuildTask-7769593734827850648.sh
bamboo_buildResultKey=PHPBB3-PR-JOB1-7792
bamboo_repository_git_branch=3.1.x
bamboo_repository_branch_name=3.1.x
bamboo_buildPlanName=phpBB3 - Pull Requests - Build and Test Job
bamboo_planRepository_1_revision=93621aa1844ab48d9bae068d9872d2c49ae86de4
bamboo_repository_name=phpBB Ascraeus
bamboo_buildFailed=false
bamboo_capability_system_docker_executable=/usr/bin/docker
bamboo_build_commandline_com_atlassian_bamboo_plugins_bamboo_docker_plugin_task_docker_cli_12=/usr/bin/docker run --volume /home/bamboo/xml-data/build-dir/PHPBB3-PR-JOB1:/data --workdir /data/phpBB --rm -e HOME=/home/bamboo -u=991 phpbb:php-5.6 /bin/bash -c php ../composer.phar install --dev; cd ../build; ../phpBB/vendor/bin/phing clean prepare
bamboo_planRepository_branch=3.1.x
bamboo_agentWorkingDirectory=/home/bamboo/xml-data/build-dir
bamboo_capability_system_git_executable=/usr/bin/git
bamboo_planRepository_1_previousRevision=93621aa1844ab48d9bae068d9872d2c49ae86de4
bamboo_capability_system_builder_phpunit_PHPUnit_3_4=/usr/bin/phpunit
bamboo_repository_git_username=bantu
bamboo_repository_75956235_revision_number=93621aa1844ab48d9bae068d9872d2c49ae86de4
bamboo_planRepository_branchDisplayName=3.1.x
bamboo_planRepository_1_type=gitv2
bamboo_planRepository_branchName=3.1.x
bamboo_repository_75956235_previous_revision_number=93621aa1844ab48d9bae068d9872d2c49ae86de4
bamboo_capability_system_jdk_JDK=/usr/lib/jvm/java-6-sun
bamboo_plan_storageTag=PHPBB3-PR
bamboo_planRepository_type=gitv2
bamboo_planRepository_1_username=bantu
bamboo_ManualBuildTriggerReason_userName=Build Robot
bamboo_repository_git_repositoryUrl=https://github.com/phpbb/phpbb.git
bamboo_repository_75956235_git_branch=3.1.x
bamboo_capability_system_builder_ant_Ant=/usr/share/ant
bamboo_repository_75956235_name=phpBB Ascraeus
bamboo_working_directory=/home/bamboo/xml-data/build-dir/PHPBB3-PR-JOB1
bamboo_planKey=PHPBB3-PR
bamboo_planRepository_1_repositoryUrl=https://github.com/phpbb/phpbb.git
bamboo_planRepository_username=bantu
bamboo_capability_local=true
bamboo_capability_system_jdk_JDK_1_6=/usr/lib/jvm/java-6-sun
bamboo_capability_system_jdk_JDK_1_7=/usr/lib/jvm/java-7-openjdk-amd64
bamboo_planRepository_1_branchName=3.1.x
29-Dec-2017 11:06:02 Buildfile: /data/build/build.xml
29-Dec-2017 11:06:02
29-Dec-2017 11:06:02 phpBB > sniff:
29-Dec-2017 11:06:02
29-Dec-2017 11:06:09 ............................................................  60 / 744 (8%)
29-Dec-2017 11:06:10 ............................................................ 120 / 744 (16%)
29-Dec-2017 11:06:11 ............................................................ 180 / 744 (24%)
29-Dec-2017 11:06:12 ............................................................ 240 / 744 (32%)
29-Dec-2017 11:06:15 ............................................................ 300 / 744 (40%)
29-Dec-2017 11:06:21 ............................................................ 360 / 744 (48%)
29-Dec-2017 11:06:26 ............................................................ 420 / 744 (56%)
29-Dec-2017 11:06:30 ............................................................ 480 / 744 (65%)
29-Dec-2017 11:06:33 ............................................................ 540 / 744 (73%)
29-Dec-2017 11:06:36 ............................................................ 600 / 744 (81%)
29-Dec-2017 11:06:41 ............................................................ 660 / 744 (89%)
29-Dec-2017 11:06:43 ............................................................ 720 / 744 (97%)
29-Dec-2017 11:06:44 ........................
29-Dec-2017 11:06:44
29-Dec-2017 11:06:44 Time: 41.9 secs; Memory: 63.75Mb
29-Dec-2017 11:06:44
29-Dec-2017 11:06:52 ............................................................  60 / 209 (29%)
29-Dec-2017 11:07:10 ............................................................ 120 / 209 (57%)
29-Dec-2017 11:07:22 ............................................................ 180 / 209 (86%)
29-Dec-2017 11:07:30 .............................
29-Dec-2017 11:07:30
29-Dec-2017 11:07:30 Time: 45.82 secs; Memory: 60.25Mb
29-Dec-2017 11:07:30
29-Dec-2017 11:07:30
29-Dec-2017 11:07:30
29-Dec-2017 11:07:30 Time: 14ms; Memory: 3.5Mb
29-Dec-2017 11:07:30
29-Dec-2017 11:07:30
29-Dec-2017 11:07:30 BUILD FINISHED
29-Dec-2017 11:07:30
29-Dec-2017 11:07:30 Total time: 1 minutes  27.99 seconds
29-Dec-2017 11:07:30
29-Dec-2017 11:07:30 Finished task 'Run sniffs' with result: Success
29-Dec-2017 11:07:30 Skipping execution of task 'Run tests' as it is disabled
29-Dec-2017 11:07:30
Substituting variable: ${bamboo.working.directory} with /home/bamboo/xml-data/build-dir/PHPBB3-PR-JOB1
29-Dec-2017 11:07:30 Starting task 'Run tests' of type 'com.atlassian.bamboo.plugins.bamboo-docker-plugin:task.docker.cli'
29-Dec-2017 11:07:30 Running image name (phpbb:php-5.6)
29-Dec-2017 11:07:30
Beginning to execute external process for build 'phpBB3 - Pull Requests - Build and Test Job #7792 (PHPBB3-PR-JOB1-7792)'
... running command line:
/usr/bin/docker run --volume /home/bamboo/xml-data/build-dir/PHPBB3-PR-JOB1:/data --workdir /data --rm -u=991 -t phpbb:php-5.6 /bin/bash -c phpBB/vendor/bin/phpunit --log-junit build/logs/phpunit.xml
... in: /home/bamboo/xml-data/build-dir/PHPBB3-PR-JOB1
... using extra environment variables:
bamboo_planRepository_1_branch=3.1.x
bamboo_planRepository_1_branchDisplayName=3.1.x
bamboo_repository_revision_number=93621aa1844ab48d9bae068d9872d2c49ae86de4
bamboo_PRref=master
bamboo_resultsUrl=https://bamboo.phpbb.com/browse/PHPBB3-PR-JOB1-7792
bamboo_capability_system_builder_command_Git=/usr/bin/git
bamboo_repository_75956235_git_username=bantu
bamboo_planRepository_1_name=phpBB Ascraeus
bamboo_build_working_directory=/home/bamboo/xml-data/build-dir/PHPBB3-PR-JOB1
bamboo_buildKey=PHPBB3-PR-JOB1
bamboo_capability_phpbb_tests=true
bamboo_shortPlanName=Pull Requests
bamboo_capability_system_builder_command_fop=/usr/bin/fop
bamboo_capability_dbms_sqlite_2=true
bamboo_planRepository_name=phpBB Ascraeus
bamboo_PRnumber=4933
bamboo_buildNumber=7792
bamboo_repository_75956235_git_repositoryUrl=https://github.com/phpbb/phpbb.git
bamboo_capability_system_builder_phpunit_PHPUnit=/usr/bin/phpunit
bamboo_shortJobName=Build and Test Job
bamboo_buildResultsUrl=https://bamboo.phpbb.com/browse/PHPBB3-PR-JOB1-7792
bamboo_repository_75956235_branch_name=3.1.x
bamboo_planRepository_repositoryUrl=https://github.com/phpbb/phpbb.git
bamboo_agentId=131073
bamboo_planName=phpBB3 - Pull Requests
bamboo_build_commandline_com_atlassian_bamboo_plugins_scripttask_task_builder_script_7=/bin/sh /home/bamboo/temp/PHPBB3-PR-JOB1-7792-ScriptBuildTask-932955968583869166.sh
bamboo_shortPlanKey=PR
bamboo_shortJobKey=JOB1
bamboo_capability_dbms_mysql_55=true
bamboo_capability_system_jdk_JDK_1_7_0_65=/usr/lib/jvm/java-7-openjdk-amd64
bamboo_planRepository_revision=93621aa1844ab48d9bae068d9872d2c49ae86de4
bamboo_repository_previous_revision_number=93621aa1844ab48d9bae068d9872d2c49ae86de4
bamboo_buildTimeStamp=2017-12-29T11:05:05.817Z
bamboo_planRepository_previousRevision=93621aa1844ab48d9bae068d9872d2c49ae86de4
bamboo_capability_system_builder_mvn2_Maven_2=/usr/share/maven2
bamboo_capability_system_jdk_JDK_1_6_0_16=/usr/lib/jvm/java-6-sun-1.6.0.16
bamboo_build_commandline_com_atlassian_bamboo_plugins_scripttask_task_builder_script_4=/bin/sh /home/bamboo/temp/PHPBB3-PR-JOB1-7792-ScriptBuildTask-7769593734827850648.sh
bamboo_buildResultKey=PHPBB3-PR-JOB1-7792
bamboo_repository_git_branch=3.1.x
bamboo_repository_branch_name=3.1.x
bamboo_buildPlanName=phpBB3 - Pull Requests - Build and Test Job
bamboo_planRepository_1_revision=93621aa1844ab48d9bae068d9872d2c49ae86de4
bamboo_repository_name=phpBB Ascraeus
bamboo_buildFailed=false
bamboo_capability_system_docker_executable=/usr/bin/docker
bamboo_build_commandline_com_atlassian_bamboo_plugins_bamboo_docker_plugin_task_docker_cli_11=/usr/bin/docker run --volume /home/bamboo/xml-data/build-dir/PHPBB3-PR-JOB1:/data --workdir /data/build --rm -u=991 phpbb:php-5.6 ../phpBB/vendor/bin/phing sniff
bamboo_build_commandline_com_atlassian_bamboo_plugins_bamboo_docker_plugin_task_docker_cli_12=/usr/bin/docker run --volume /home/bamboo/xml-data/build-dir/PHPBB3-PR-JOB1:/data --workdir /data/phpBB --rm -e HOME=/home/bamboo -u=991 phpbb:php-5.6 /bin/bash -c php ../composer.phar install --dev; cd ../build; ../phpBB/vendor/bin/phing clean prepare
bamboo_planRepository_branch=3.1.x
bamboo_agentWorkingDirectory=/home/bamboo/xml-data/build-dir
bamboo_capability_system_git_executable=/usr/bin/git
bamboo_planRepository_1_previousRevision=93621aa1844ab48d9bae068d9872d2c49ae86de4
bamboo_capability_system_builder_phpunit_PHPUnit_3_4=/usr/bin/phpunit
bamboo_repository_git_username=bantu
bamboo_repository_75956235_revision_number=93621aa1844ab48d9bae068d9872d2c49ae86de4
bamboo_planRepository_branchDisplayName=3.1.x
bamboo_planRepository_1_type=gitv2
bamboo_planRepository_branchName=3.1.x
bamboo_repository_75956235_previous_revision_number=93621aa1844ab48d9bae068d9872d2c49ae86de4
bamboo_capability_system_jdk_JDK=/usr/lib/jvm/java-6-sun
bamboo_plan_storageTag=PHPBB3-PR
bamboo_planRepository_type=gitv2
bamboo_planRepository_1_username=bantu
bamboo_ManualBuildTriggerReason_userName=Build Robot
bamboo_repository_git_repositoryUrl=https://github.com/phpbb/phpbb.git
bamboo_repository_75956235_git_branch=3.1.x
bamboo_capability_system_builder_ant_Ant=/usr/share/ant
bamboo_repository_75956235_name=phpBB Ascraeus
bamboo_working_directory=/home/bamboo/xml-data/build-dir/PHPBB3-PR-JOB1
bamboo_planKey=PHPBB3-PR
bamboo_planRepository_1_repositoryUrl=https://github.com/phpbb/phpbb.git
bamboo_planRepository_username=bantu
bamboo_capability_local=true
bamboo_capability_system_jdk_JDK_1_6=/usr/lib/jvm/java-6-sun
bamboo_capability_system_jdk_JDK_1_7=/usr/lib/jvm/java-7-openjdk-amd64
bamboo_planRepository_1_branchName=3.1.x
29-Dec-2017 11:07:33 PHPUnit 5.7.21 by Sebastian Bergmann and contributors.
29-Dec-2017 11:07:33
29-Dec-2017 11:07:40 ..........................................................EEE   61 / 7124 (  0%)
29-Dec-2017 11:07:40 EEEEEEEEEEEEEEEEEEEEEEEEEEEEEEEEEE...........................  122 / 7124 (  1%)
29-Dec-2017 11:07:41 .............I.....SSSSSSSS............SSSS.........S...S....  183 / 7124 (  2%)
29-Dec-2017 11:07:43 .............................................................  244 / 7124 (  3%)
29-Dec-2017 11:07:50 .....S.......................................................  305 / 7124 (  4%)
29-Dec-2017 11:07:51 .............................................................  366 / 7124 (  5%)
29-Dec-2017 11:07:51 .............................................................  427 / 7124 (  5%)
29-Dec-2017 11:07:52 .............................................................  488 / 7124 (  6%)
29-Dec-2017 11:07:52 .............................................................  549 / 7124 (  7%)
29-Dec-2017 11:07:53 .............................................................  610 / 7124 (  8%)
29-Dec-2017 11:07:53 .............................................................  671 / 7124 (  9%)
29-Dec-2017 11:07:54 .............................................................  732 / 7124 ( 10%)
29-Dec-2017 11:07:55 .............................................................  793 / 7124 ( 11%)
29-Dec-2017 11:07:55 .............................................................  854 / 7124 ( 11%)
29-Dec-2017 11:07:56 .............................................................  915 / 7124 ( 12%)
29-Dec-2017 11:07:57 .............................................................  976 / 7124 ( 13%)
29-Dec-2017 11:07:57 ............................................................. 1037 / 7124 ( 14%)
29-Dec-2017 11:08:01 ................................................I............ 1098 / 7124 ( 15%)
29-Dec-2017 11:08:08 ............................................................. 1159 / 7124 ( 16%)
29-Dec-2017 11:08:12 ............................................................. 1220 / 7124 ( 17%)
29-Dec-2017 11:08:14 ...................S.S.S..................................... 1281 / 7124 ( 17%)
29-Dec-2017 11:08:14 ............................................................. 1342 / 7124 ( 18%)
29-Dec-2017 11:08:14 ............................................................. 1403 / 7124 ( 19%)
29-Dec-2017 11:08:14 ............................................................. 1464 / 7124 ( 20%)
29-Dec-2017 11:08:14 ............................................................. 1525 / 7124 ( 21%)
29-Dec-2017 11:08:15 ............................................................. 1586 / 7124 ( 22%)
29-Dec-2017 11:08:15 ............................................................. 1647 / 7124 ( 23%)
29-Dec-2017 11:08:15 ............................................................. 1708 / 7124 ( 23%)
29-Dec-2017 11:08:15 ............................................................. 1769 / 7124 ( 24%)
29-Dec-2017 11:08:15 ............................................................. 1830 / 7124 ( 25%)
29-Dec-2017 11:08:15 ............................................................. 1891 / 7124 ( 26%)
29-Dec-2017 11:08:15 ............................................................. 1952 / 7124 ( 27%)
29-Dec-2017 11:08:15 ............................................................. 2013 / 7124 ( 28%)
29-Dec-2017 11:08:16 ............................................................. 2074 / 7124 ( 29%)
29-Dec-2017 11:08:16 ............................................................. 2135 / 7124 ( 29%)
29-Dec-2017 11:08:17 ............................................................. 2196 / 7124 ( 30%)
29-Dec-2017 11:08:18 ............................................................. 2257 / 7124 ( 31%)
29-Dec-2017 11:08:18 ............................................................. 2318 / 7124 ( 32%)
29-Dec-2017 11:08:20 .....................................................I.II.... 2379 / 7124 ( 33%)
29-Dec-2017 11:08:21 ....WWW...................................................... 2440 / 7124 ( 34%)
29-Dec-2017 11:08:21 ............................................................. 2501 / 7124 ( 35%)
29-Dec-2017 11:08:21 ............................................................. 2562 / 7124 ( 35%)
29-Dec-2017 11:08:21 ............................................................. 2623 / 7124 ( 36%)
29-Dec-2017 11:08:24 ............................................................. 2684 / 7124 ( 37%)
29-Dec-2017 11:08:25 ............................................................. 2745 / 7124 ( 38%)
29-Dec-2017 11:08:25 ............................................................. 2806 / 7124 ( 39%)
29-Dec-2017 11:08:26 ...........SSSSSSSSS......................................... 2867 / 7124 ( 40%)
29-Dec-2017 11:08:29 ............................................................. 2928 / 7124 ( 41%)
29-Dec-2017 11:08:41 ............................................................. 2989 / 7124 ( 41%)
29-Dec-2017 11:08:44 ................................................S............ 3050 / 7124 ( 42%)
29-Dec-2017 11:08:48 ............................................................. 3111 / 7124 ( 43%)
29-Dec-2017 11:08:55 ............................................................. 3172 / 7124 ( 44%)
29-Dec-2017 11:08:58 ............................................................. 3233 / 7124 ( 45%)
29-Dec-2017 11:09:13 ............................................................. 3294 / 7124 ( 46%)
29-Dec-2017 11:09:13 ............................................................. 3355 / 7124 ( 47%)
29-Dec-2017 11:09:14 ............................................................. 3416 / 7124 ( 47%)
29-Dec-2017 11:09:14 ............................................................. 3477 / 7124 ( 48%)
29-Dec-2017 11:09:14 ............................................................. 3538 / 7124 ( 49%)
29-Dec-2017 11:09:14 ............................................................. 3599 / 7124 ( 50%)
29-Dec-2017 11:09:14 ............................................................. 3660 / 7124 ( 51%)
29-Dec-2017 11:09:14 ............................................................. 3721 / 7124 ( 52%)
29-Dec-2017 11:09:14 ............................................................. 3782 / 7124 ( 53%)
29-Dec-2017 11:09:16 ............................................................. 3843 / 7124 ( 53%)
29-Dec-2017 11:09:18 ............................................................. 3904 / 7124 ( 54%)
29-Dec-2017 11:09:20 ............................................................. 3965 / 7124 ( 55%)
29-Dec-2017 11:09:21 ............................................................. 4026 / 7124 ( 56%)
29-Dec-2017 11:09:22 ............................................................. 4087 / 7124 ( 57%)
29-Dec-2017 11:09:24 ............................................................. 4148 / 7124 ( 58%)
29-Dec-2017 11:09:30 ............................................................. 4209 / 7124 ( 59%)
29-Dec-2017 11:09:35 ............................................................. 4270 / 7124 ( 59%)
29-Dec-2017 11:09:36 ............................................................. 4331 / 7124 ( 60%)
29-Dec-2017 11:09:37 ............................................................. 4392 / 7124 ( 61%)
29-Dec-2017 11:09:37 ............................................................. 4453 / 7124 ( 62%)
29-Dec-2017 11:09:37 ............................................................. 4514 / 7124 ( 63%)
29-Dec-2017 11:09:37 ............................................................. 4575 / 7124 ( 64%)
29-Dec-2017 11:09:37 ............................................................. 4636 / 7124 ( 65%)
29-Dec-2017 11:09:37 ............................................................. 4697 / 7124 ( 65%)
29-Dec-2017 11:09:37 ............................................................. 4758 / 7124 ( 66%)
29-Dec-2017 11:09:37 ............................................................. 4819 / 7124 ( 67%)
29-Dec-2017 11:09:46 ............................................................. 4880 / 7124 ( 68%)
29-Dec-2017 11:09:56 ......................................S...................... 4941 / 7124 ( 69%)
29-Dec-2017 11:10:04 ............................................................. 5002 / 7124 ( 70%)
29-Dec-2017 11:10:13 ............................................................. 5063 / 7124 ( 71%)
29-Dec-2017 11:10:14 ............................................................. 5124 / 7124 ( 71%)
29-Dec-2017 11:10:14 ............................................................. 5185 / 7124 ( 72%)
29-Dec-2017 11:10:15 ............................................................. 5246 / 7124 ( 73%)
29-Dec-2017 11:10:15 .......................................................SSSSSS 5307 / 7124 ( 74%)
29-Dec-2017 11:10:15 SSSSSSSSSSSSSSSSSSSSSSSSSSSSSSSSSSSSSSSSSSSSSSSSSSSSSSSSSSSSS 5368 / 7124 ( 75%)
29-Dec-2017 11:10:15 SSSSSSSSSSSSSSSSSSSSSSSSSSSSSSSSSSSSSSSSSSSSSSSSSSSSSSSSSSSSS 5429 / 7124 ( 76%)
29-Dec-2017 11:10:15 SSSSSSSSSSSSSSSSSSSSSSSSSSSSSSSSSSSSSSSSSSSSSSSSSSSSSSSSSSSSS 5490 / 7124 ( 77%)
29-Dec-2017 11:10:15 SSSSSSSSSSSSSSSSSSSSSSSSSSSSSSSSSSSSSSSSSSSSSSSSSSSSSSSSSSSSS 5551 / 7124 ( 77%)
29-Dec-2017 11:10:17 SSSSSSSSSSSS................................................. 5612 / 7124 ( 78%)
29-Dec-2017 11:10:19 ............................................................. 5673 / 7124 ( 79%)
29-Dec-2017 11:10:21 ............................................................. 5734 / 7124 ( 80%)
29-Dec-2017 11:10:22 ............................................................. 5795 / 7124 ( 81%)
29-Dec-2017 11:10:24 ............................................................. 5856 / 7124 ( 82%)
29-Dec-2017 11:10:26 ............................................................. 5917 / 7124 ( 83%)
29-Dec-2017 11:10:28 ............................................................. 5978 / 7124 ( 83%)
29-Dec-2017 11:10:30 ............................................................. 6039 / 7124 ( 84%)
29-Dec-2017 11:10:32 ............................................................. 6100 / 7124 ( 85%)
29-Dec-2017 11:10:34 ............................................................. 6161 / 7124 ( 86%)
29-Dec-2017 11:10:35 ............................................................. 6222 / 7124 ( 87%)
29-Dec-2017 11:10:37 ............................................................. 6283 / 7124 ( 88%)
29-Dec-2017 11:10:39 ............................................................. 6344 / 7124 ( 89%)
29-Dec-2017 11:10:41 ............................................................. 6405 / 7124 ( 89%)
29-Dec-2017 11:10:43 ............................................................. 6466 / 7124 ( 90%)
29-Dec-2017 11:10:44 ............................................................. 6527 / 7124 ( 91%)
29-Dec-2017 11:10:46 ............................................................. 6588 / 7124 ( 92%)
29-Dec-2017 11:10:48 ............................................................. 6649 / 7124 ( 93%)
29-Dec-2017 11:10:50 ............................................................. 6710 / 7124 ( 94%)
29-Dec-2017 11:10:52 ............................................................. 6771 / 7124 ( 95%)
29-Dec-2017 11:10:54 ............................................................. 6832 / 7124 ( 95%)
29-Dec-2017 11:10:56 ............................................................. 6893 / 7124 ( 96%)
29-Dec-2017 11:10:58 ............................................................. 6954 / 7124 ( 97%)
29-Dec-2017 11:11:00 ............................................................. 7015 / 7124 ( 98%)
29-Dec-2017 11:11:01 ............................................................. 7076 / 7124 ( 99%)
29-Dec-2017 11:11:03 ..............................................SS              7124 / 7124 (100%)
29-Dec-2017 11:11:03
29-Dec-2017 11:11:03 Time: 3.53 minutes, Memory: 441.75MB
29-Dec-2017 11:11:03
29-Dec-2017 11:11:03 There were 37 errors:
29-Dec-2017 11:11:03
29-Dec-2017 11:11:03 1) phpbb_avatar_manager_test::test_get_all_drivers
29-Dec-2017 11:11:03 Argument 1 passed to phpbb\storage\storage::__construct() must implement interface phpbb\db\driver\driver_interface, instance of Mock_adapter_factory_23d2351a given, called in /data/tests/avatar/manager_test.php on line 45 and defined
29-Dec-2017 11:11:03
29-Dec-2017 11:11:03 /data/phpBB/phpbb/storage/storage.php:55
29-Dec-2017 11:11:03 /data/tests/avatar/manager_test.php:45
29-Dec-2017 11:11:03
29-Dec-2017 11:11:03 2) phpbb_avatar_manager_test::test_get_enabled_drivers
29-Dec-2017 11:11:03 Argument 1 passed to phpbb\storage\storage::__construct() must implement interface phpbb\db\driver\driver_interface, instance of Mock_adapter_factory_23d2351a given, called in /data/tests/avatar/manager_test.php on line 45 and defined
29-Dec-2017 11:11:03
29-Dec-2017 11:11:03 /data/phpBB/phpbb/storage/storage.php:55
29-Dec-2017 11:11:03 /data/tests/avatar/manager_test.php:45
29-Dec-2017 11:11:03
29-Dec-2017 11:11:03 3) phpbb_avatar_manager_test::test_get_driver_enabled with data set #0 ('avatar.driver.foobar', 'avatar.driver.foobar')
29-Dec-2017 11:11:03 Argument 1 passed to phpbb\storage\storage::__construct() must implement interface phpbb\db\driver\driver_interface, instance of Mock_adapter_factory_23d2351a given, called in /data/tests/avatar/manager_test.php on line 45 and defined
29-Dec-2017 11:11:03
29-Dec-2017 11:11:03 /data/phpBB/phpbb/storage/storage.php:55
29-Dec-2017 11:11:03 /data/tests/avatar/manager_test.php:45
29-Dec-2017 11:11:03
29-Dec-2017 11:11:03 4) phpbb_avatar_manager_test::test_get_driver_enabled with data set #1 ('avatar.driver.gravatar', 'avatar.driver.gravatar')
29-Dec-2017 11:11:03 Argument 1 passed to phpbb\storage\storage::__construct() must implement interface phpbb\db\driver\driver_interface, instance of Mock_adapter_factory_23d2351a given, called in /data/tests/avatar/manager_test.php on line 45 and defined
29-Dec-2017 11:11:03
29-Dec-2017 11:11:03 /data/phpBB/phpbb/storage/storage.php:55
29-Dec-2017 11:11:03 /data/tests/avatar/manager_test.php:45
29-Dec-2017 11:11:03
29-Dec-2017 11:11:03 5) phpbb_avatar_manager_test::test_get_driver_enabled with data set #2 ('avatar.driver.foo_wrong', null)
29-Dec-2017 11:11:03 Argument 1 passed to phpbb\storage\storage::__construct() must implement interface phpbb\db\driver\driver_interface, instance of Mock_adapter_factory_23d2351a given, called in /data/tests/avatar/manager_test.php on line 45 and defined
29-Dec-2017 11:11:03
29-Dec-2017 11:11:03 /data/phpBB/phpbb/storage/storage.php:55
29-Dec-2017 11:11:03 /data/tests/avatar/manager_test.php:45
29-Dec-2017 11:11:03
29-Dec-2017 11:11:03 6) phpbb_avatar_manager_test::test_get_driver_enabled with data set #3 ('avatar.driver.local', null)
29-Dec-2017 11:11:03 Argument 1 passed to phpbb\storage\storage::__construct() must implement interface phpbb\db\driver\driver_interface, instance of Mock_adapter_factory_23d2351a given, called in /data/tests/avatar/manager_test.php on line 45 and defined
29-Dec-2017 11:11:03
29-Dec-2017 11:11:03 /data/phpBB/phpbb/storage/storage.php:55
29-Dec-2017 11:11:03 /data/tests/avatar/manager_test.php:45
29-Dec-2017 11:11:03
29-Dec-2017 11:11:03 7) phpbb_avatar_manager_test::test_get_driver_enabled with data set #4 (3, null)
29-Dec-2017 11:11:03 Argument 1 passed to phpbb\storage\storage::__construct() must implement interface phpbb\db\driver\driver_interface, instance of Mock_adapter_factory_23d2351a given, called in /data/tests/avatar/manager_test.php on line 45 and defined
29-Dec-2017 11:11:03
29-Dec-2017 11:11:03 /data/phpBB/phpbb/storage/storage.php:55
29-Dec-2017 11:11:03 /data/tests/avatar/manager_test.php:45
29-Dec-2017 11:11:03
29-Dec-2017 11:11:03 8) phpbb_avatar_manager_test::test_get_driver_enabled with data set #5 (1, null)
29-Dec-2017 11:11:03 Argument 1 passed to phpbb\storage\storage::__construct() must implement interface phpbb\db\driver\driver_interface, instance of Mock_adapter_factory_23d2351a given, called in /data/tests/avatar/manager_test.php on line 45 and defined
29-Dec-2017 11:11:03
29-Dec-2017 11:11:03 /data/phpBB/phpbb/storage/storage.php:55
29-Dec-2017 11:11:03 /data/tests/avatar/manager_test.php:45
29-Dec-2017 11:11:03
29-Dec-2017 11:11:03 9) phpbb_avatar_manager_test::test_get_driver_enabled with data set #6 (2, null)
29-Dec-2017 11:11:03 Argument 1 passed to phpbb\storage\storage::__construct() must implement interface phpbb\db\driver\driver_interface, instance of Mock_adapter_factory_23d2351a given, called in /data/tests/avatar/manager_test.php on line 45 and defined
29-Dec-2017 11:11:03
29-Dec-2017 11:11:03 /data/phpBB/phpbb/storage/storage.php:55
29-Dec-2017 11:11:03 /data/tests/avatar/manager_test.php:45
29-Dec-2017 11:11:03
29-Dec-2017 11:11:03 10) phpbb_avatar_manager_test::test_get_driver_all with data set #0 ('avatar.driver.foobar', 'avatar.driver.foobar')
29-Dec-2017 11:11:03 Argument 1 passed to phpbb\storage\storage::__construct() must implement interface phpbb\db\driver\driver_interface, instance of Mock_adapter_factory_23d2351a given, called in /data/tests/avatar/manager_test.php on line 45 and defined
29-Dec-2017 11:11:03
29-Dec-2017 11:11:03 /data/phpBB/phpbb/storage/storage.php:55
29-Dec-2017 11:11:03 /data/tests/avatar/manager_test.php:45
29-Dec-2017 11:11:03
29-Dec-2017 11:11:03 11) phpbb_avatar_manager_test::test_get_driver_all with data set #1 ('avatar.driver.foo_wrong', null)
29-Dec-2017 11:11:03 Argument 1 passed to phpbb\storage\storage::__construct() must implement interface phpbb\db\driver\driver_interface, instance of Mock_adapter_factory_23d2351a given, called in /data/tests/avatar/manager_test.php on line 45 and defined
29-Dec-2017 11:11:03
29-Dec-2017 11:11:03 /data/phpBB/phpbb/storage/storage.php:55
29-Dec-2017 11:11:03 /data/tests/avatar/manager_test.php:45
29-Dec-2017 11:11:03
29-Dec-2017 11:11:03 12) phpbb_avatar_manager_test::test_get_driver_all with data set #2 ('avatar.driver.local', 'avatar.driver.local')
29-Dec-2017 11:11:03 Argument 1 passed to phpbb\storage\storage::__construct() must implement interface phpbb\db\driver\driver_interface, instance of Mock_adapter_factory_23d2351a given, called in /data/tests/avatar/manager_test.php on line 45 and defined
29-Dec-2017 11:11:03
29-Dec-2017 11:11:03 /data/phpBB/phpbb/storage/storage.php:55
29-Dec-2017 11:11:03 /data/tests/avatar/manager_test.php:45
29-Dec-2017 11:11:03
29-Dec-2017 11:11:03 13) phpbb_avatar_manager_test::test_get_driver_all with data set #3 (3, 'avatar.driver.local')
29-Dec-2017 11:11:03 Argument 1 passed to phpbb\storage\storage::__construct() must implement interface phpbb\db\driver\driver_interface, instance of Mock_adapter_factory_23d2351a given, called in /data/tests/avatar/manager_test.php on line 45 and defined
29-Dec-2017 11:11:03
29-Dec-2017 11:11:03 /data/phpBB/phpbb/storage/storage.php:55
29-Dec-2017 11:11:03 /data/tests/avatar/manager_test.php:45
29-Dec-2017 11:11:03
29-Dec-2017 11:11:03 14) phpbb_avatar_manager_test::test_get_driver_all with data set #4 (1, 'avatar.driver.upload')
29-Dec-2017 11:11:03 Argument 1 passed to phpbb\storage\storage::__construct() must implement interface phpbb\db\driver\driver_interface, instance of Mock_adapter_factory_23d2351a given, called in /data/tests/avatar/manager_test.php on line 45 and defined
29-Dec-2017 11:11:03
29-Dec-2017 11:11:03 /data/phpBB/phpbb/storage/storage.php:55
29-Dec-2017 11:11:03 /data/tests/avatar/manager_test.php:45
29-Dec-2017 11:11:03
29-Dec-2017 11:11:03 15) phpbb_avatar_manager_test::test_get_driver_all with data set #5 (2, 'avatar.driver.remote')
29-Dec-2017 11:11:03 Argument 1 passed to phpbb\storage\storage::__construct() must implement interface phpbb\db\driver\driver_interface, instance of Mock_adapter_factory_23d2351a given, called in /data/tests/avatar/manager_test.php on line 45 and defined
29-Dec-2017 11:11:03
29-Dec-2017 11:11:03 /data/phpBB/phpbb/storage/storage.php:55
29-Dec-2017 11:11:03 /data/tests/avatar/manager_test.php:45
29-Dec-2017 11:11:03
29-Dec-2017 11:11:03 16) phpbb_avatar_manager_test::test_get_avatar_settings
29-Dec-2017 11:11:03 Argument 1 passed to phpbb\storage\storage::__construct() must implement interface phpbb\db\driver\driver_interface, instance of Mock_adapter_factory_23d2351a given, called in /data/tests/avatar/manager_test.php on line 45 and defined
29-Dec-2017 11:11:03
29-Dec-2017 11:11:03 /data/phpBB/phpbb/storage/storage.php:55
29-Dec-2017 11:11:03 /data/tests/avatar/manager_test.php:45
29-Dec-2017 11:11:03
29-Dec-2017 11:11:03 17) phpbb_avatar_manager_test::test_clean_row with data set #0 (array('', '', '', '', ''), array('', '', '', '', ''), 'foobar')
29-Dec-2017 11:11:03 Argument 1 passed to phpbb\storage\storage::__construct() must implement interface phpbb\db\driver\driver_interface, instance of Mock_adapter_factory_23d2351a given, called in /data/tests/avatar/manager_test.php on line 45 and defined
29-Dec-2017 11:11:03
29-Dec-2017 11:11:03 /data/phpBB/phpbb/storage/storage.php:55
29-Dec-2017 11:11:03 /data/tests/avatar/manager_test.php:45
29-Dec-2017 11:11:03
29-Dec-2017 11:11:03 18) phpbb_avatar_manager_test::test_clean_row with data set #1 (array(), array('', '', 0, 0))
29-Dec-2017 11:11:03 Argument 1 passed to phpbb\storage\storage::__construct() must implement interface phpbb\db\driver\driver_interface, instance of Mock_adapter_factory_23d2351a given, called in /data/tests/avatar/manager_test.php on line 45 and defined
29-Dec-2017 11:11:03
29-Dec-2017 11:11:03 /data/phpBB/phpbb/storage/storage.php:55
29-Dec-2017 11:11:03 /data/tests/avatar/manager_test.php:45
29-Dec-2017 11:11:03
29-Dec-2017 11:11:03 19) phpbb_avatar_manager_test::test_clean_row with data set #2 (array('', 5, 4), array('', 5, 4))
29-Dec-2017 11:11:03 Argument 1 passed to phpbb\storage\storage::__construct() must implement interface phpbb\db\driver\driver_interface, instance of Mock_adapter_factory_23d2351a given, called in /data/tests/avatar/manager_test.php on line 45 and defined
29-Dec-2017 11:11:03
29-Dec-2017 11:11:03 /data/phpBB/phpbb/storage/storage.php:55
29-Dec-2017 11:11:03 /data/tests/avatar/manager_test.php:45
29-Dec-2017 11:11:03
29-Dec-2017 11:11:03 20) phpbb_avatar_manager_test::test_clean_row with data set #3 (array('', 5, 4), array('', 5, 4), 'user')
29-Dec-2017 11:11:03 Argument 1 passed to phpbb\storage\storage::__construct() must implement interface phpbb\db\driver\driver_interface, instance of Mock_adapter_factory_23d2351a given, called in /data/tests/avatar/manager_test.php on line 45 and defined
29-Dec-2017 11:11:03
29-Dec-2017 11:11:03 /data/phpBB/phpbb/storage/storage.php:55
29-Dec-2017 11:11:03 /data/tests/avatar/manager_test.php:45
29-Dec-2017 11:11:03
29-Dec-2017 11:11:03 21) phpbb_avatar_manager_test::test_clean_row with data set #4 (array('', 5, 4), array('', 'g4', 5), 'group')
29-Dec-2017 11:11:03 Argument 1 passed to phpbb\storage\storage::__construct() must implement interface phpbb\db\driver\driver_interface, instance of Mock_adapter_factory_23d2351a given, called in /data/tests/avatar/manager_test.php on line 45 and defined
29-Dec-2017 11:11:03
29-Dec-2017 11:11:03 /data/phpBB/phpbb/storage/storage.php:55
29-Dec-2017 11:11:03 /data/tests/avatar/manager_test.php:45
29-Dec-2017 11:11:03
29-Dec-2017 11:11:03 22) phpbb_avatar_manager_test::test_clean_driver_name
29-Dec-2017 11:11:03 Argument 1 passed to phpbb\storage\storage::__construct() must implement interface phpbb\db\driver\driver_interface, instance of Mock_adapter_factory_23d2351a given, called in /data/tests/avatar/manager_test.php on line 45 and defined
29-Dec-2017 11:11:03
29-Dec-2017 11:11:03 /data/phpBB/phpbb/storage/storage.php:55
29-Dec-2017 11:11:03 /data/tests/avatar/manager_test.php:45
29-Dec-2017 11:11:03
29-Dec-2017 11:11:03 23) phpbb_avatar_manager_test::test_prepare_driver_name
29-Dec-2017 11:11:03 Argument 1 passed to phpbb\storage\storage::__construct() must implement interface phpbb\db\driver\driver_interface, instance of Mock_adapter_factory_23d2351a given, called in /data/tests/avatar/manager_test.php on line 45 and defined
29-Dec-2017 11:11:03
29-Dec-2017 11:11:03 /data/phpBB/phpbb/storage/storage.php:55
29-Dec-2017 11:11:03 /data/tests/avatar/manager_test.php:45
29-Dec-2017 11:11:03
29-Dec-2017 11:11:03 24) phpbb_avatar_manager_test::test_localize_errors
29-Dec-2017 11:11:03 Argument 1 passed to phpbb\storage\storage::__construct() must implement interface phpbb\db\driver\driver_interface, instance of Mock_adapter_factory_23d2351a given, called in /data/tests/avatar/manager_test.php on line 45 and defined
29-Dec-2017 11:11:03
29-Dec-2017 11:11:03 /data/phpBB/phpbb/storage/storage.php:55
29-Dec-2017 11:11:03 /data/tests/avatar/manager_test.php:45
29-Dec-2017 11:11:03
29-Dec-2017 11:11:03 25) phpbb_avatar_manager_test::test_handle_avatar_delete with data set #0 (array('', '', 0, 0), 1, array('foobar@example.com', 'avatar.driver.gravatar', '16', '16'), 'phpbb_users', 'user_')
29-Dec-2017 11:11:03 Argument 1 passed to phpbb\storage\storage::__construct() must implement interface phpbb\db\driver\driver_interface, instance of Mock_adapter_factory_23d2351a given, called in /data/tests/avatar/manager_test.php on line 45 and defined
29-Dec-2017 11:11:03
29-Dec-2017 11:11:03 /data/phpBB/phpbb/storage/storage.php:55
29-Dec-2017 11:11:03 /data/tests/avatar/manager_test.php:45
29-Dec-2017 11:11:03
29-Dec-2017 11:11:03 26) phpbb_avatar_manager_test::test_handle_avatar_delete with data set #1 (array('', '', 0, 0), 5, array('g5_1414350991.jpg', 'avatar.driver.upload', '80', '80'), 'phpbb_groups', 'group_')
29-Dec-2017 11:11:03 Argument 1 passed to phpbb\storage\storage::__construct() must implement interface phpbb\db\driver\driver_interface, instance of Mock_adapter_factory_23d2351a given, called in /data/tests/avatar/manager_test.php on line 45 and defined
29-Dec-2017 11:11:03
29-Dec-2017 11:11:03 /data/phpBB/phpbb/storage/storage.php:55
29-Dec-2017 11:11:03 /data/tests/avatar/manager_test.php:45
29-Dec-2017 11:11:03
29-Dec-2017 11:11:03 27) phpbb_avatar_manager_test::test_user_group_avatar_deleted
29-Dec-2017 11:11:03 Argument 1 passed to phpbb\storage\storage::__construct() must implement interface phpbb\db\driver\driver_interface, instance of Mock_adapter_factory_23d2351a given, called in /data/tests/avatar/manager_test.php on line 45 and defined
29-Dec-2017 11:11:03
29-Dec-2017 11:11:03 /data/phpBB/phpbb/storage/storage.php:55
29-Dec-2017 11:11:03 /data/tests/avatar/manager_test.php:45
29-Dec-2017 11:11:03
29-Dec-2017 11:11:03 28) phpbb_avatar_manager_test::test_remote_avatar_url with data set #0 ('127.0.0.1:91?foo.jpg', 80, 80, array('AVATAR_URL_INVALID'))
29-Dec-2017 11:11:03 Argument 1 passed to phpbb\storage\storage::__construct() must implement interface phpbb\db\driver\driver_interface, instance of Mock_adapter_factory_23d2351a given, called in /data/tests/avatar/manager_test.php on line 45 and defined
29-Dec-2017 11:11:03
29-Dec-2017 11:11:03 /data/phpBB/phpbb/storage/storage.php:55
29-Dec-2017 11:11:03 /data/tests/avatar/manager_test.php:45
29-Dec-2017 11:11:03
29-Dec-2017 11:11:03 29) phpbb_avatar_manager_test::test_remote_avatar_url with data set #1 ('192.0.73.2/avatar/55502f40dc8...d0.jpg', 80, 80, array('AVATAR_URL_INVALID'))
29-Dec-2017 11:11:03 Argument 1 passed to phpbb\storage\storage::__construct() must implement interface phpbb\db\driver\driver_interface, instance of Mock_adapter_factory_23d2351a given, called in /data/tests/avatar/manager_test.php on line 45 and defined
29-Dec-2017 11:11:03
29-Dec-2017 11:11:03 /data/phpBB/phpbb/storage/storage.php:55
29-Dec-2017 11:11:03 /data/tests/avatar/manager_test.php:45
29-Dec-2017 11:11:03
29-Dec-2017 11:11:03 30) phpbb_avatar_manager_test::test_remote_avatar_url with data set #2 ('secure.gravatar.com/avatar/55...d0.jpg', 80, 80)
29-Dec-2017 11:11:03 Argument 1 passed to phpbb\storage\storage::__construct() must implement interface phpbb\db\driver\driver_interface, instance of Mock_adapter_factory_23d2351a given, called in /data/tests/avatar/manager_test.php on line 45 and defined
29-Dec-2017 11:11:03
29-Dec-2017 11:11:03 /data/phpBB/phpbb/storage/storage.php:55
29-Dec-2017 11:11:03 /data/tests/avatar/manager_test.php:45
29-Dec-2017 11:11:03
29-Dec-2017 11:11:03 31) phpbb_avatar_manager_test::test_remote_avatar_url with data set #3 ('192.0.73.2:120/avatar/55502f4...d0.jpg', 80, 80, array('AVATAR_URL_INVALID'))
29-Dec-2017 11:11:03 Argument 1 passed to phpbb\storage\storage::__construct() must implement interface phpbb\db\driver\driver_interface, instance of Mock_adapter_factory_23d2351a given, called in /data/tests/avatar/manager_test.php on line 45 and defined
29-Dec-2017 11:11:03
29-Dec-2017 11:11:03 /data/phpBB/phpbb/storage/storage.php:55
29-Dec-2017 11:11:03 /data/tests/avatar/manager_test.php:45
29-Dec-2017 11:11:03
29-Dec-2017 11:11:03 32) phpbb_avatar_manager_test::test_remote_avatar_url with data set #4 ('secure.gravatar.com:80/avatar...d0.jpg', 80, 80, array('AVATAR_URL_INVALID'))
29-Dec-2017 11:11:03 Argument 1 passed to phpbb\storage\storage::__construct() must implement interface phpbb\db\driver\driver_interface, instance of Mock_adapter_factory_23d2351a given, called in /data/tests/avatar/manager_test.php on line 45 and defined
29-Dec-2017 11:11:03
29-Dec-2017 11:11:03 /data/phpBB/phpbb/storage/storage.php:55
29-Dec-2017 11:11:03 /data/tests/avatar/manager_test.php:45
29-Dec-2017 11:11:03
29-Dec-2017 11:11:03 33) phpbb_avatar_manager_test::test_remote_avatar_url with data set #5 ('secure.gravatar.com:80?55502f...d0.jpg', 80, 80, array('AVATAR_URL_INVALID'))
29-Dec-2017 11:11:03 Argument 1 passed to phpbb\storage\storage::__construct() must implement interface phpbb\db\driver\driver_interface, instance of Mock_adapter_factory_23d2351a given, called in /data/tests/avatar/manager_test.php on line 45 and defined
29-Dec-2017 11:11:03
29-Dec-2017 11:11:03 /data/phpBB/phpbb/storage/storage.php:55
29-Dec-2017 11:11:03 /data/tests/avatar/manager_test.php:45
29-Dec-2017 11:11:03
29-Dec-2017 11:11:03 34) phpbb_avatar_manager_test::test_remote_avatar_url with data set #6 ('secure.gravatar.com?55502f40d...d0.jpg', 80, 80, array('AVATAR_URL_INVALID'))
29-Dec-2017 11:11:03 Argument 1 passed to phpbb\storage\storage::__construct() must implement interface phpbb\db\driver\driver_interface, instance of Mock_adapter_factory_23d2351a given, called in /data/tests/avatar/manager_test.php on line 45 and defined
29-Dec-2017 11:11:03
29-Dec-2017 11:11:03 /data/phpBB/phpbb/storage/storage.php:55
29-Dec-2017 11:11:03 /data/tests/avatar/manager_test.php:45
29-Dec-2017 11:11:03
29-Dec-2017 11:11:03 35) phpbb_avatar_manager_test::test_remote_avatar_url with data set #7 ('2001:db8:0:0:0:0:2:1/avatar/5...d0.jpg', 80, 80, array('AVATAR_URL_INVALID'))
29-Dec-2017 11:11:03 Argument 1 passed to phpbb\storage\storage::__construct() must implement interface phpbb\db\driver\driver_interface, instance of Mock_adapter_factory_23d2351a given, called in /data/tests/avatar/manager_test.php on line 45 and defined
29-Dec-2017 11:11:03
29-Dec-2017 11:11:03 /data/phpBB/phpbb/storage/storage.php:55
29-Dec-2017 11:11:03 /data/tests/avatar/manager_test.php:45
29-Dec-2017 11:11:03
29-Dec-2017 11:11:03 36) phpbb_avatar_manager_test::test_remote_avatar_url with data set #8 ('secure.gravatar.com/2001:db8:...d0.jpg', 80, 80, array('AVATAR_URL_INVALID'))
29-Dec-2017 11:11:03 Argument 1 passed to phpbb\storage\storage::__construct() must implement interface phpbb\db\driver\driver_interface, instance of Mock_adapter_factory_23d2351a given, called in /data/tests/avatar/manager_test.php on line 45 and defined
29-Dec-2017 11:11:03
29-Dec-2017 11:11:03 /data/phpBB/phpbb/storage/storage.php:55
29-Dec-2017 11:11:03 /data/tests/avatar/manager_test.php:45
29-Dec-2017 11:11:03
29-Dec-2017 11:11:03 37) phpbb_avatar_manager_test::test_remote_avatar_url with data set #9 ('secure.gravatar.com/127.0.0.1...d0.jpg', 80, 80, array('AVATAR_URL_INVALID'))
29-Dec-2017 11:11:03 Argument 1 passed to phpbb\storage\storage::__construct() must implement interface phpbb\db\driver\driver_interface, instance of Mock_adapter_factory_23d2351a given, called in /data/tests/avatar/manager_test.php on line 45 and defined
29-Dec-2017 11:11:03
29-Dec-2017 11:11:03 /data/phpBB/phpbb/storage/storage.php:55
29-Dec-2017 11:11:03 /data/tests/avatar/manager_test.php:45
29-Dec-2017 11:11:03
29-Dec-2017 11:11:03 --
29-Dec-2017 11:11:03
29-Dec-2017 11:11:03 There were 3 warnings:
29-Dec-2017 11:11:03
29-Dec-2017 11:11:03 1) phpbb_feed_attachments_base_test::test_fetch_attachments with data set #0 (array(0), array(0))
29-Dec-2017 11:11:03 PHPUnit_Framework_TestCase::getMock() is deprecated, use PHPUnit_Framework_TestCase::createMock() or PHPUnit_Framework_TestCase::getMockBuilder() instead
29-Dec-2017 11:11:03
29-Dec-2017 11:11:03 2) phpbb_feed_attachments_base_test::test_fetch_attachments with data set #1 (array(), array(1))
29-Dec-2017 11:11:03 PHPUnit_Framework_TestCase::getMock() is deprecated, use PHPUnit_Framework_TestCase::createMock() or PHPUnit_Framework_TestCase::getMockBuilder() instead
29-Dec-2017 11:11:03
29-Dec-2017 11:11:03 3) phpbb_feed_attachments_base_test::test_fetch_attachments with data set #2 (array(), array(), 'RuntimeException')
29-Dec-2017 11:11:03 PHPUnit_Framework_TestCase::getMock() is deprecated, use PHPUnit_Framework_TestCase::createMock() or PHPUnit_Framework_TestCase::getMockBuilder() instead
29-Dec-2017 11:11:03
29-Dec-2017 11:11:03 ERRORS!
29-Dec-2017 11:11:03 Tests: 9434, Assertions: 107353, Errors: 37, Warnings: 3, Skipped: 293, Incomplete: 5.
29-Dec-2017 11:11:04 Failing task since return code of [/usr/bin/docker run --volume /home/bamboo/xml-data/build-dir/PHPBB3-PR-JOB1:/data --workdir /data --rm -u=991 -t phpbb:php-5.6 /bin/bash -c phpBB/vendor/bin/phpunit --log-junit build/logs/phpunit.xml] was 2 while expected 0
29-Dec-2017 11:11:04 Error occurred while running Task 'Run tests(10)' of type com.atlassian.bamboo.plugins.bamboo-docker-plugin:task.docker.cli.
29-Dec-2017 11:11:04 com.atlassian.bamboo.task.TaskException: Failed to execute task
29-Dec-2017 11:11:04         at com.atlassian.bamboo.plugins.docker.service.RunService.execute(RunService.java:75)
29-Dec-2017 11:11:04         at com.atlassian.bamboo.plugins.docker.tasks.cli.DockerCliTask.execute(DockerCliTask.java:60)
29-Dec-2017 11:11:04         at com.atlassian.bamboo.task.TaskExecutorImpl.lambda$executeTasks$3(TaskExecutorImpl.java:284)
29-Dec-2017 11:11:04         at com.atlassian.bamboo.task.TaskExecutorImpl.executeTaskWithPrePostActions(TaskExecutorImpl.java:223)
29-Dec-2017 11:11:04         at com.atlassian.bamboo.task.TaskExecutorImpl.executeTasks(TaskExecutorImpl.java:284)
29-Dec-2017 11:11:04         at com.atlassian.bamboo.task.TaskExecutorImpl.execute(TaskExecutorImpl.java:111)
29-Dec-2017 11:11:04         at com.atlassian.bamboo.build.pipeline.tasks.ExecuteBuildTask.call(ExecuteBuildTask.java:71)
29-Dec-2017 11:11:04         at com.atlassian.bamboo.v2.build.agent.DefaultBuildAgent.build(DefaultBuildAgent.java:185)
29-Dec-2017 11:11:04         at com.atlassian.bamboo.v2.build.agent.BuildAgentControllerImpl$1.call(BuildAgentControllerImpl.java:120)
29-Dec-2017 11:11:04         at com.atlassian.bamboo.v2.build.agent.BuildAgentControllerImpl$1.call(BuildAgentControllerImpl.java:113)
29-Dec-2017 11:11:04         at com.atlassian.bamboo.variable.CustomVariableContextImpl.withVariableSubstitutor(CustomVariableContextImpl.java:185)
29-Dec-2017 11:11:04         at com.atlassian.bamboo.v2.build.agent.BuildAgentControllerImpl.waitAndPerformBuild(BuildAgentControllerImpl.java:113)
29-Dec-2017 11:11:04         at com.atlassian.bamboo.v2.build.agent.DefaultBuildAgent$1.run(DefaultBuildAgent.java:126)
29-Dec-2017 11:11:04         at com.atlassian.bamboo.utils.BambooRunnables$1.run(BambooRunnables.java:47)
29-Dec-2017 11:11:04         at com.atlassian.bamboo.security.ImpersonationHelper.runWith(ImpersonationHelper.java:26)
29-Dec-2017 11:11:04         at com.atlassian.bamboo.security.ImpersonationHelper.runWithSystemAuthority(ImpersonationHelper.java:17)
29-Dec-2017 11:11:04         at com.atlassian.bamboo.security.ImpersonationHelper$1.run(ImpersonationHelper.java:41)
29-Dec-2017 11:11:04         at java.lang.Thread.run(Thread.java:748)
29-Dec-2017 11:11:04 Caused by: com.atlassian.bamboo.plugins.docker.client.DockerException: Error running Docker run command
29-Dec-2017 11:11:04         at com.atlassian.bamboo.plugins.docker.client.DockerCmd.run(DockerCmd.java:108)
29-Dec-2017 11:11:04         at com.atlassian.bamboo.plugins.docker.service.RunService.execute(RunService.java:64)
29-Dec-2017 11:11:04         ... 17 more
29-Dec-2017 11:11:04 Caused by: com.atlassian.utils.process.ProcessException: Error executing /usr/bin/docker run --volume /home/bamboo/xml-data/build-dir/PHPBB3-PR-JOB1:/data --workdir /data --rm -u=991 -t phpbb:php-5.6 /bin/bash -c "phpBB/vendor/bin/phpunit --log-junit build/logs/phpunit.xml"
29-Dec-2017 11:11:04         at com.atlassian.bamboo.plugins.docker.process.DockerTaskProcessService.execute(DockerTaskProcessService.java:60)
29-Dec-2017 11:11:04         at com.atlassian.bamboo.plugins.docker.client.DockerCmd.run(DockerCmd.java:104)
29-Dec-2017 11:11:04         ... 18 more
29-Dec-2017 11:11:04 Starting task 'Parsing test results produced by script' of type 'com.atlassian.bamboo.plugins.testresultparser:task.testresultparser.junit'
29-Dec-2017 11:11:04 Parsing test results under /home/bamboo/xml-data/build-dir/PHPBB3-PR-JOB1...
29-Dec-2017 11:11:04 Failing task since 37 failing test cases were found.
29-Dec-2017 11:11:04 Finished task 'Parsing test results produced by script' with result: Failed
29-Dec-2017 11:11:04
Substituting variable: ${bamboo.PRnumber} with 4933
29-Dec-2017 11:11:04
Substituting variable: ${bamboo.buildResultsUrl} with https://bamboo.phpbb.com/browse/PHPBB3-PR-JOB1-7792
29-Dec-2017 11:11:04
Substituting variable: ${bamboo.buildResultsUrl} with https://bamboo.phpbb.com/browse/PHPBB3-PR-JOB1-7792
29-Dec-2017 11:11:04 Starting task 'Set result build status' of type 'com.atlassian.bamboo.plugins.scripttask:task.builder.script'
29-Dec-2017 11:11:04
Beginning to execute external process for build 'phpBB3 - Pull Requests - Build and Test Job #7792 (PHPBB3-PR-JOB1-7792)'
... running command line:
/bin/sh /home/bamboo/temp/PHPBB3-PR-JOB1-7792-ScriptBuildTask-2281965481106909166.sh
... in: /home/bamboo/xml-data/build-dir/PHPBB3-PR-JOB1
... using extra environment variables:
bamboo_planRepository_1_branch=3.1.x
bamboo_planRepository_1_branchDisplayName=3.1.x
bamboo_repository_revision_number=93621aa1844ab48d9bae068d9872d2c49ae86de4
bamboo_PRref=master
bamboo_resultsUrl=https://bamboo.phpbb.com/browse/PHPBB3-PR-JOB1-7792
bamboo_capability_system_builder_command_Git=/usr/bin/git
bamboo_repository_75956235_git_username=bantu
bamboo_planRepository_1_name=phpBB Ascraeus
bamboo_build_working_directory=/home/bamboo/xml-data/build-dir/PHPBB3-PR-JOB1
bamboo_buildKey=PHPBB3-PR-JOB1
bamboo_capability_phpbb_tests=true
bamboo_shortPlanName=Pull Requests
bamboo_capability_system_builder_command_fop=/usr/bin/fop
bamboo_capability_dbms_sqlite_2=true
bamboo_planRepository_name=phpBB Ascraeus
bamboo_PRnumber=4933
bamboo_buildNumber=7792
bamboo_repository_75956235_git_repositoryUrl=https://github.com/phpbb/phpbb.git
bamboo_capability_system_builder_phpunit_PHPUnit=/usr/bin/phpunit
bamboo_shortJobName=Build and Test Job
bamboo_buildResultsUrl=https://bamboo.phpbb.com/browse/PHPBB3-PR-JOB1-7792
bamboo_repository_75956235_branch_name=3.1.x
bamboo_planRepository_repositoryUrl=https://github.com/phpbb/phpbb.git
bamboo_agentId=131073
bamboo_planName=phpBB3 - Pull Requests
bamboo_build_commandline_com_atlassian_bamboo_plugins_scripttask_task_builder_script_7=/bin/sh /home/bamboo/temp/PHPBB3-PR-JOB1-7792-ScriptBuildTask-932955968583869166.sh
bamboo_shortPlanKey=PR
bamboo_shortJobKey=JOB1
bamboo_capability_dbms_mysql_55=true
bamboo_capability_system_jdk_JDK_1_7_0_65=/usr/lib/jvm/java-7-openjdk-amd64
bamboo_planRepository_revision=93621aa1844ab48d9bae068d9872d2c49ae86de4
bamboo_repository_previous_revision_number=93621aa1844ab48d9bae068d9872d2c49ae86de4
bamboo_buildTimeStamp=2017-12-29T11:05:05.817Z
bamboo_planRepository_previousRevision=93621aa1844ab48d9bae068d9872d2c49ae86de4
bamboo_capability_system_builder_mvn2_Maven_2=/usr/share/maven2
bamboo_capability_system_jdk_JDK_1_6_0_16=/usr/lib/jvm/java-6-sun-1.6.0.16
bamboo_build_commandline_com_atlassian_bamboo_plugins_scripttask_task_builder_script_4=/bin/sh /home/bamboo/temp/PHPBB3-PR-JOB1-7792-ScriptBuildTask-7769593734827850648.sh
bamboo_buildResultKey=PHPBB3-PR-JOB1-7792
bamboo_repository_git_branch=3.1.x
bamboo_repository_branch_name=3.1.x
bamboo_buildPlanName=phpBB3 - Pull Requests - Build and Test Job
bamboo_planRepository_1_revision=93621aa1844ab48d9bae068d9872d2c49ae86de4
bamboo_repository_name=phpBB Ascraeus
bamboo_buildFailed=true
bamboo_capability_system_docker_executable=/usr/bin/docker
bamboo_build_commandline_com_atlassian_bamboo_plugins_bamboo_docker_plugin_task_docker_cli_10=/usr/bin/docker run --volume /home/bamboo/xml-data/build-dir/PHPBB3-PR-JOB1:/data --workdir /data --rm -u=991 -t phpbb:php-5.6 /bin/bash -c phpBB/vendor/bin/phpunit --log-junit build/logs/phpunit.xml
bamboo_build_commandline_com_atlassian_bamboo_plugins_bamboo_docker_plugin_task_docker_cli_11=/usr/bin/docker run --volume /home/bamboo/xml-data/build-dir/PHPBB3-PR-JOB1:/data --workdir /data/build --rm -u=991 phpbb:php-5.6 ../phpBB/vendor/bin/phing sniff
bamboo_build_commandline_com_atlassian_bamboo_plugins_bamboo_docker_plugin_task_docker_cli_12=/usr/bin/docker run --volume /home/bamboo/xml-data/build-dir/PHPBB3-PR-JOB1:/data --workdir /data/phpBB --rm -e HOME=/home/bamboo -u=991 phpbb:php-5.6 /bin/bash -c php ../composer.phar install --dev; cd ../build; ../phpBB/vendor/bin/phing clean prepare
bamboo_planRepository_branch=3.1.x
bamboo_jobFailed=true
bamboo_agentWorkingDirectory=/home/bamboo/xml-data/build-dir
bamboo_capability_system_git_executable=/usr/bin/git
bamboo_planRepository_1_previousRevision=93621aa1844ab48d9bae068d9872d2c49ae86de4
bamboo_capability_system_builder_phpunit_PHPUnit_3_4=/usr/bin/phpunit
bamboo_repository_git_username=bantu
bamboo_repository_75956235_revision_number=93621aa1844ab48d9bae068d9872d2c49ae86de4
bamboo_planRepository_branchDisplayName=3.1.x
bamboo_planRepository_1_type=gitv2
bamboo_planRepository_branchName=3.1.x
bamboo_repository_75956235_previous_revision_number=93621aa1844ab48d9bae068d9872d2c49ae86de4
bamboo_capability_system_jdk_JDK=/usr/lib/jvm/java-6-sun
bamboo_plan_storageTag=PHPBB3-PR
bamboo_planRepository_type=gitv2
bamboo_planRepository_1_username=bantu
bamboo_ManualBuildTriggerReason_userName=Build Robot
bamboo_repository_git_repositoryUrl=https://github.com/phpbb/phpbb.git
bamboo_repository_75956235_git_branch=3.1.x
bamboo_capability_system_builder_ant_Ant=/usr/share/ant
bamboo_repository_75956235_name=phpBB Ascraeus
bamboo_working_directory=/home/bamboo/xml-data/build-dir/PHPBB3-PR-JOB1
bamboo_planKey=PHPBB3-PR
bamboo_planRepository_1_repositoryUrl=https://github.com/phpbb/phpbb.git
bamboo_planRepository_username=bantu
bamboo_capability_local=true
bamboo_capability_system_jdk_JDK_1_6=/usr/lib/jvm/java-6-sun
bamboo_capability_system_jdk_JDK_1_7=/usr/lib/jvm/java-7-openjdk-amd64
bamboo_planRepository_1_branchName=3.1.x
29-Dec-2017 11:11:07 From https://github.com/phpbb/phpbb
29-Dec-2017 11:11:07 * branch            refs/pull/4933/head -> FETCH_HEAD
29-Dec-2017 11:11:07         <testsuite name="phpbb_avatar_manager_test::test_get_driver_enabled" tests="7" assertions="0" failures="0" errors="7" time="0.013825">
29-Dec-2017 11:11:07         <testsuite name="phpbb_avatar_manager_test::test_get_driver_all" tests="6" assertions="0" failures="0" errors="6" time="0.011953">
29-Dec-2017 11:11:07         <testsuite name="phpbb_avatar_manager_test::test_clean_row" tests="5" assertions="0" failures="0" errors="5" time="0.009849">
29-Dec-2017 11:11:07         <testsuite name="phpbb_avatar_manager_test::test_handle_avatar_delete" tests="2" assertions="0" failures="0" errors="2" time="0.003904">
29-Dec-2017 11:11:07   % Total    % Received % Xferd  Average Speed   Time    Time     Time  Current
29-Dec-2017 11:11:07                                  Dload  Upload   Total   Spent    Left  Speed
29-Dec-2017 11:11:07
29-Dec-2017 11:11:07   0     0    0     0    0     0      0      0 --:--:-- --:--:-- --:--:--     0
29-Dec-2017 11:11:07 100   267  100    93  100   174    310    581 --:--:-- --:--:-- --:--:--   581
29-Dec-2017 11:11:07 Finished task 'Set result build status' with result: Success
29-Dec-2017 11:11:07 Running post build plugin 'NCover Results Collector'
29-Dec-2017 11:11:07 Running post build plugin 'Artifact Copier'
29-Dec-2017 11:11:07 Running post build plugin 'npm Cache Cleanup'
29-Dec-2017 11:11:07 Running post build plugin 'Clover Results Collector'
29-Dec-2017 11:11:07 Running post build plugin 'Docker Container Cleanup'
29-Dec-2017 11:11:07 Successfully removed working directory at '/home/bamboo/xml-data/build-dir/PHPBB3-PR-JOB1'
29-Dec-2017 11:11:07 Finalising the build...
29-Dec-2017 11:11:07 Stopping timer.
29-Dec-2017 11:11:07 Build PHPBB3-PR-JOB1-7792 completed.
29-Dec-2017 11:11:07 Running on server: post build plugin 'NCover Results Collector'
29-Dec-2017 11:11:07 Running on server: post build plugin 'Build Hanging Detection Configuration'
29-Dec-2017 11:11:07 Running on server: post build plugin 'Clover Delta Calculator'
29-Dec-2017 11:11:07 Running on server: post build plugin 'Maven Dependencies Postprocessor'
29-Dec-2017 11:11:07 All post build plugins have finished
29-Dec-2017 11:11:07 Generating build results summary...
29-Dec-2017 11:11:12 Saving build results to disk...
29-Dec-2017 11:11:12 Logging substituted variables...
29-Dec-2017 11:11:12 Indexing build results...
29-Dec-2017 11:11:12 Finished building PHPBB3-PR-JOB1-7792.
29-Dec-2017 11:11:13
Substituting variable: ${bamboo.PRnumber} with 4933