Tests pending pull requests

Build: #8182 failed

Job: Build and Test Job failed

Stages & jobs

  1. Build and Test

Build log

The build generated 532 lines of output. Download or view full build log

06-Jun-2018 09:40:12 Build phpBB3 - Pull Requests - Build and Test Job #8182 (PHPBB3-PR-JOB1-8182) started building on agent Default Agent
06-Jun-2018 09:40:12
06-Jun-2018 09:40:12 Build working directory is /home/bamboo/xml-data/build-dir/PHPBB3-PR-JOB1
06-Jun-2018 09:40:12 Executing build phpBB3 - Pull Requests - Build and Test Job #8182 (PHPBB3-PR-JOB1-8182)
06-Jun-2018 09:40:12 Starting task 'Checkout develop branch' of type 'com.atlassian.bamboo.plugins.vcs:task.vcs.checkout'
06-Jun-2018 09:40:12 Build always requires a clean checkout
06-Jun-2018 09:40:12 Cleaning build directory '/home/bamboo/xml-data/build-dir/PHPBB3-PR-JOB1'
06-Jun-2018 09:40:12 Checking out into /home/bamboo/xml-data/build-dir/PHPBB3-PR-JOB1
06-Jun-2018 09:40:12 Updating source code to revision: dc8ff9da28b8ab4ad11c7ea94cca526f17c87fe5
06-Jun-2018 09:40:12 Fetching 'refs/heads/3.1.x' from 'https://github.com/phpbb/phpbb.git'.
06-Jun-2018 09:40:13 Checking out revision dc8ff9da28b8ab4ad11c7ea94cca526f17c87fe5.
06-Jun-2018 09:40:13 Creating local git repository in '/home/bamboo/xml-data/build-dir/PHPBB3-PR-JOB1/.git'.
06-Jun-2018 09:40:13 Cloning into '/home/bamboo/xml-data/build-dir/PHPBB3-PR-JOB1'...
06-Jun-2018 09:40:13 done.
06-Jun-2018 09:40:15 Switched to a new branch '3.1.x'
06-Jun-2018 09:40:15 Branch 3.1.x set up to track remote branch 3.1.x from origin.
06-Jun-2018 09:40:15 Updated source code to revision: dc8ff9da28b8ab4ad11c7ea94cca526f17c87fe5
06-Jun-2018 09:40:15 Finished task 'Checkout develop branch' with result: Success
06-Jun-2018 09:40:15 Running pre-build action: VCS Version Collector
06-Jun-2018 09:40:15
Substituting variable: ${bamboo.PRnumber} with 5225
06-Jun-2018 09:40:15
Substituting variable: ${bamboo.buildResultsUrl} with https://bamboo.phpbb.com/browse/PHPBB3-PR-JOB1-8182
06-Jun-2018 09:40:15 Starting task 'Set pending build status' of type 'com.atlassian.bamboo.plugins.scripttask:task.builder.script'
06-Jun-2018 09:40:15
Beginning to execute external process for build 'phpBB3 - Pull Requests - Build and Test Job #8182 (PHPBB3-PR-JOB1-8182)'
... running command line:
/bin/sh /home/bamboo/temp/PHPBB3-PR-JOB1-8182-ScriptBuildTask-7127911333156034676.sh
... in: /home/bamboo/xml-data/build-dir/PHPBB3-PR-JOB1
... using extra environment variables:
bamboo_planRepository_1_branch=3.1.x
bamboo_planRepository_1_branchDisplayName=3.1.x
bamboo_repository_revision_number=dc8ff9da28b8ab4ad11c7ea94cca526f17c87fe5
bamboo_PRref=master
bamboo_resultsUrl=https://bamboo.phpbb.com/browse/PHPBB3-PR-JOB1-8182
bamboo_capability_system_builder_command_Git=/usr/bin/git
bamboo_repository_75956235_git_username=bantu
bamboo_build_working_directory=/home/bamboo/xml-data/build-dir/PHPBB3-PR-JOB1
bamboo_planRepository_1_name=phpBB Ascraeus
bamboo_buildKey=PHPBB3-PR-JOB1
bamboo_capability_phpbb_tests=true
bamboo_shortPlanName=Pull Requests
bamboo_capability_system_builder_command_fop=/usr/bin/fop
bamboo_capability_dbms_sqlite_2=true
bamboo_planRepository_name=phpBB Ascraeus
bamboo_PRnumber=5225
bamboo_buildNumber=8182
bamboo_repository_75956235_git_repositoryUrl=https://github.com/phpbb/phpbb.git
bamboo_capability_system_builder_phpunit_PHPUnit=/usr/bin/phpunit
bamboo_shortJobName=Build and Test Job
bamboo_buildResultsUrl=https://bamboo.phpbb.com/browse/PHPBB3-PR-JOB1-8182
bamboo_repository_75956235_branch_name=3.1.x
bamboo_planRepository_repositoryUrl=https://github.com/phpbb/phpbb.git
bamboo_agentId=131073
bamboo_planName=phpBB3 - Pull Requests
bamboo_shortPlanKey=PR
bamboo_shortJobKey=JOB1
bamboo_capability_dbms_mysql_55=true
bamboo_capability_system_jdk_JDK_1_7_0_65=/usr/lib/jvm/java-7-openjdk-amd64
bamboo_planRepository_revision=dc8ff9da28b8ab4ad11c7ea94cca526f17c87fe5
bamboo_buildTimeStamp=2018-06-06T09:40:12.044Z
bamboo_repository_previous_revision_number=dc8ff9da28b8ab4ad11c7ea94cca526f17c87fe5
bamboo_capability_system_jdk_JDK_1_6_0_16=/usr/lib/jvm/java-6-sun-1.6.0.16
bamboo_capability_system_builder_mvn2_Maven_2=/usr/share/maven2
bamboo_planRepository_previousRevision=dc8ff9da28b8ab4ad11c7ea94cca526f17c87fe5
bamboo_repository_git_branch=3.1.x
bamboo_buildResultKey=PHPBB3-PR-JOB1-8182
bamboo_repository_branch_name=3.1.x
bamboo_buildPlanName=phpBB3 - Pull Requests - Build and Test Job
bamboo_planRepository_1_revision=dc8ff9da28b8ab4ad11c7ea94cca526f17c87fe5
bamboo_repository_name=phpBB Ascraeus
bamboo_buildFailed=false
bamboo_capability_system_docker_executable=/usr/bin/docker
bamboo_planRepository_branch=3.1.x
bamboo_agentWorkingDirectory=/home/bamboo/xml-data/build-dir
bamboo_capability_system_git_executable=/usr/bin/git
bamboo_capability_system_builder_phpunit_PHPUnit_3_4=/usr/bin/phpunit
bamboo_repository_git_username=bantu
bamboo_planRepository_1_previousRevision=dc8ff9da28b8ab4ad11c7ea94cca526f17c87fe5
bamboo_repository_75956235_revision_number=dc8ff9da28b8ab4ad11c7ea94cca526f17c87fe5
bamboo_planRepository_branchDisplayName=3.1.x
bamboo_planRepository_1_type=gitv2
bamboo_planRepository_branchName=3.1.x
bamboo_repository_75956235_previous_revision_number=dc8ff9da28b8ab4ad11c7ea94cca526f17c87fe5
bamboo_capability_system_jdk_JDK=/usr/lib/jvm/java-6-sun
bamboo_plan_storageTag=PHPBB3-PR
bamboo_hg_cache_directory=/home/bamboo/xml-data/build-dir/_hg-repositories-cache
bamboo_planRepository_1_username=bantu
bamboo_planRepository_type=gitv2
bamboo_git_cache_directory=/home/bamboo/xml-data/build-dir/_git-repositories-cache
bamboo_ManualBuildTriggerReason_userName=Build Robot
bamboo_repository_git_repositoryUrl=https://github.com/phpbb/phpbb.git
bamboo_repository_75956235_git_branch=3.1.x
bamboo_capability_system_builder_ant_Ant=/usr/share/ant
bamboo_repository_75956235_name=phpBB Ascraeus
bamboo_tmp_directory=/home/bamboo/temp
bamboo_working_directory=/home/bamboo/xml-data/build-dir/PHPBB3-PR-JOB1
bamboo_planKey=PHPBB3-PR
bamboo_capability_local=true
bamboo_planRepository_1_repositoryUrl=https://github.com/phpbb/phpbb.git
bamboo_planRepository_username=bantu
bamboo_capability_system_jdk_JDK_1_6=/usr/lib/jvm/java-6-sun
bamboo_capability_system_jdk_JDK_1_7=/usr/lib/jvm/java-7-openjdk-amd64
bamboo_planRepository_1_branchName=3.1.x
06-Jun-2018 09:40:19 From https://github.com/phpbb/phpbb
06-Jun-2018 09:40:19 * branch            refs/pull/5225/head -> FETCH_HEAD
06-Jun-2018 09:40:19   % Total    % Received % Xferd  Average Speed   Time    Time     Time  Current
06-Jun-2018 09:40:19                                  Dload  Upload   Total   Spent    Left  Speed
06-Jun-2018 09:40:19
06-Jun-2018 09:40:20   0     0    0     0    0     0      0      0 --:--:-- --:--:-- --:--:--     0
06-Jun-2018 09:40:20   0     0    0     0    0     0      0      0 --:--:-- --:--:-- --:--:--     0
06-Jun-2018 09:40:20 100   275  100    93  100   182    312    612 --:--:-- --:--:-- --:--:--   612
06-Jun-2018 09:40:20 Finished task 'Set pending build status' with result: Success
06-Jun-2018 09:40:20
Substituting variable: ${bamboo.PRnumber} with 5225
06-Jun-2018 09:40:20 Starting task 'Fetch PR' of type 'com.atlassian.bamboo.plugins.scripttask:task.builder.script'
06-Jun-2018 09:40:20
Beginning to execute external process for build 'phpBB3 - Pull Requests - Build and Test Job #8182 (PHPBB3-PR-JOB1-8182)'
... running command line:
/bin/sh /home/bamboo/temp/PHPBB3-PR-JOB1-8182-ScriptBuildTask-156286310472212748.sh
... in: /home/bamboo/xml-data/build-dir/PHPBB3-PR-JOB1
... using extra environment variables:
bamboo_planRepository_1_branch=3.1.x
bamboo_planRepository_1_branchDisplayName=3.1.x
bamboo_repository_revision_number=dc8ff9da28b8ab4ad11c7ea94cca526f17c87fe5
bamboo_PRref=master
bamboo_resultsUrl=https://bamboo.phpbb.com/browse/PHPBB3-PR-JOB1-8182
bamboo_capability_system_builder_command_Git=/usr/bin/git
bamboo_repository_75956235_git_username=bantu
bamboo_build_working_directory=/home/bamboo/xml-data/build-dir/PHPBB3-PR-JOB1
bamboo_planRepository_1_name=phpBB Ascraeus
bamboo_buildKey=PHPBB3-PR-JOB1
bamboo_capability_phpbb_tests=true
bamboo_shortPlanName=Pull Requests
bamboo_capability_system_builder_command_fop=/usr/bin/fop
bamboo_capability_dbms_sqlite_2=true
bamboo_planRepository_name=phpBB Ascraeus
bamboo_PRnumber=5225
bamboo_buildNumber=8182
bamboo_repository_75956235_git_repositoryUrl=https://github.com/phpbb/phpbb.git
bamboo_capability_system_builder_phpunit_PHPUnit=/usr/bin/phpunit
bamboo_shortJobName=Build and Test Job
bamboo_buildResultsUrl=https://bamboo.phpbb.com/browse/PHPBB3-PR-JOB1-8182
bamboo_repository_75956235_branch_name=3.1.x
bamboo_planRepository_repositoryUrl=https://github.com/phpbb/phpbb.git
bamboo_agentId=131073
bamboo_planName=phpBB3 - Pull Requests
bamboo_build_commandline_com_atlassian_bamboo_plugins_scripttask_task_builder_script_7=/bin/sh /home/bamboo/temp/PHPBB3-PR-JOB1-8182-ScriptBuildTask-7127911333156034676.sh
bamboo_shortPlanKey=PR
bamboo_shortJobKey=JOB1
bamboo_capability_dbms_mysql_55=true
bamboo_capability_system_jdk_JDK_1_7_0_65=/usr/lib/jvm/java-7-openjdk-amd64
bamboo_planRepository_revision=dc8ff9da28b8ab4ad11c7ea94cca526f17c87fe5
bamboo_buildTimeStamp=2018-06-06T09:40:12.044Z
bamboo_repository_previous_revision_number=dc8ff9da28b8ab4ad11c7ea94cca526f17c87fe5
bamboo_capability_system_jdk_JDK_1_6_0_16=/usr/lib/jvm/java-6-sun-1.6.0.16
bamboo_capability_system_builder_mvn2_Maven_2=/usr/share/maven2
bamboo_planRepository_previousRevision=dc8ff9da28b8ab4ad11c7ea94cca526f17c87fe5
bamboo_repository_git_branch=3.1.x
bamboo_buildResultKey=PHPBB3-PR-JOB1-8182
bamboo_repository_branch_name=3.1.x
bamboo_buildPlanName=phpBB3 - Pull Requests - Build and Test Job
bamboo_planRepository_1_revision=dc8ff9da28b8ab4ad11c7ea94cca526f17c87fe5
bamboo_repository_name=phpBB Ascraeus
bamboo_buildFailed=false
bamboo_capability_system_docker_executable=/usr/bin/docker
bamboo_planRepository_branch=3.1.x
bamboo_agentWorkingDirectory=/home/bamboo/xml-data/build-dir
bamboo_capability_system_git_executable=/usr/bin/git
bamboo_capability_system_builder_phpunit_PHPUnit_3_4=/usr/bin/phpunit
bamboo_repository_git_username=bantu
bamboo_planRepository_1_previousRevision=dc8ff9da28b8ab4ad11c7ea94cca526f17c87fe5
bamboo_repository_75956235_revision_number=dc8ff9da28b8ab4ad11c7ea94cca526f17c87fe5
bamboo_planRepository_branchDisplayName=3.1.x
bamboo_planRepository_1_type=gitv2
bamboo_planRepository_branchName=3.1.x
bamboo_repository_75956235_previous_revision_number=dc8ff9da28b8ab4ad11c7ea94cca526f17c87fe5
bamboo_capability_system_jdk_JDK=/usr/lib/jvm/java-6-sun
bamboo_plan_storageTag=PHPBB3-PR
bamboo_hg_cache_directory=/home/bamboo/xml-data/build-dir/_hg-repositories-cache
bamboo_planRepository_1_username=bantu
bamboo_planRepository_type=gitv2
bamboo_git_cache_directory=/home/bamboo/xml-data/build-dir/_git-repositories-cache
bamboo_ManualBuildTriggerReason_userName=Build Robot
bamboo_repository_git_repositoryUrl=https://github.com/phpbb/phpbb.git
bamboo_repository_75956235_git_branch=3.1.x
bamboo_capability_system_builder_ant_Ant=/usr/share/ant
bamboo_repository_75956235_name=phpBB Ascraeus
bamboo_tmp_directory=/home/bamboo/temp
bamboo_working_directory=/home/bamboo/xml-data/build-dir/PHPBB3-PR-JOB1
bamboo_planKey=PHPBB3-PR
bamboo_capability_local=true
bamboo_planRepository_1_repositoryUrl=https://github.com/phpbb/phpbb.git
bamboo_planRepository_username=bantu
bamboo_capability_system_jdk_JDK_1_6=/usr/lib/jvm/java-6-sun
bamboo_capability_system_jdk_JDK_1_7=/usr/lib/jvm/java-7-openjdk-amd64
bamboo_planRepository_1_branchName=3.1.x
06-Jun-2018 09:40:23 From https://github.com/phpbb/phpbb
06-Jun-2018 09:40:23 * branch            refs/pull/5225/merge -> FETCH_HEAD
06-Jun-2018 09:40:24 Note: checking out 'FETCH_HEAD'.
06-Jun-2018 09:40:24
06-Jun-2018 09:40:24 You are in 'detached HEAD' state. You can look around, make experimental
06-Jun-2018 09:40:24 changes and commit them, and you can discard any commits you make in this
06-Jun-2018 09:40:24 state without impacting any branches by performing another checkout.
06-Jun-2018 09:40:24
06-Jun-2018 09:40:24 If you want to create a new branch to retain commits you create, you may
06-Jun-2018 09:40:24 do so (now or later) by using -b with the checkout command again. Example:
06-Jun-2018 09:40:24
06-Jun-2018 09:40:24   git checkout -b new_branch_name
06-Jun-2018 09:40:24
06-Jun-2018 09:40:24 HEAD is now at b012f57... Merge 5a0dd18e58408468a48b18c4af371bb751e4237d into da30ddd483d1e834e2db0c2b4f126b5f0e3077c7
06-Jun-2018 09:40:24 Finished task 'Fetch PR' with result: Success
06-Jun-2018 09:40:24 Skipping execution of task 'Prepare directory' as it is disabled
06-Jun-2018 09:40:24
Substituting variable: ${bamboo.working.directory} with /home/bamboo/xml-data/build-dir/PHPBB3-PR-JOB1
06-Jun-2018 09:40:24 Starting task 'Prepare directory' of type 'com.atlassian.bamboo.plugins.bamboo-docker-plugin:task.docker.cli'
06-Jun-2018 09:40:24 Running image name (phpbb:php-5.6)
06-Jun-2018 09:40:24
Beginning to execute external process for build 'phpBB3 - Pull Requests - Build and Test Job #8182 (PHPBB3-PR-JOB1-8182)'
... running command line:
/usr/bin/docker run --volume /home/bamboo/xml-data/build-dir/PHPBB3-PR-JOB1:/data --workdir /data/phpBB --rm -e HOME=/home/bamboo -u=991 phpbb:php-5.6 /bin/bash -c php ../composer.phar install --dev; cd ../build; ../phpBB/vendor/bin/phing clean prepare
... in: /home/bamboo/xml-data/build-dir/PHPBB3-PR-JOB1
... using extra environment variables:
bamboo_planRepository_1_branch=3.1.x
bamboo_planRepository_1_branchDisplayName=3.1.x
bamboo_repository_revision_number=dc8ff9da28b8ab4ad11c7ea94cca526f17c87fe5
bamboo_PRref=master
bamboo_resultsUrl=https://bamboo.phpbb.com/browse/PHPBB3-PR-JOB1-8182
bamboo_capability_system_builder_command_Git=/usr/bin/git
bamboo_repository_75956235_git_username=bantu
bamboo_build_working_directory=/home/bamboo/xml-data/build-dir/PHPBB3-PR-JOB1
bamboo_planRepository_1_name=phpBB Ascraeus
bamboo_buildKey=PHPBB3-PR-JOB1
bamboo_capability_phpbb_tests=true
bamboo_shortPlanName=Pull Requests
bamboo_capability_system_builder_command_fop=/usr/bin/fop
bamboo_capability_dbms_sqlite_2=true
bamboo_planRepository_name=phpBB Ascraeus
bamboo_PRnumber=5225
bamboo_buildNumber=8182
bamboo_repository_75956235_git_repositoryUrl=https://github.com/phpbb/phpbb.git
bamboo_capability_system_builder_phpunit_PHPUnit=/usr/bin/phpunit
bamboo_shortJobName=Build and Test Job
bamboo_buildResultsUrl=https://bamboo.phpbb.com/browse/PHPBB3-PR-JOB1-8182
bamboo_repository_75956235_branch_name=3.1.x
bamboo_planRepository_repositoryUrl=https://github.com/phpbb/phpbb.git
bamboo_agentId=131073
bamboo_planName=phpBB3 - Pull Requests
bamboo_build_commandline_com_atlassian_bamboo_plugins_scripttask_task_builder_script_7=/bin/sh /home/bamboo/temp/PHPBB3-PR-JOB1-8182-ScriptBuildTask-7127911333156034676.sh
bamboo_shortPlanKey=PR
bamboo_shortJobKey=JOB1
bamboo_capability_dbms_mysql_55=true
bamboo_capability_system_jdk_JDK_1_7_0_65=/usr/lib/jvm/java-7-openjdk-amd64
bamboo_planRepository_revision=dc8ff9da28b8ab4ad11c7ea94cca526f17c87fe5
bamboo_buildTimeStamp=2018-06-06T09:40:12.044Z
bamboo_repository_previous_revision_number=dc8ff9da28b8ab4ad11c7ea94cca526f17c87fe5
bamboo_capability_system_jdk_JDK_1_6_0_16=/usr/lib/jvm/java-6-sun-1.6.0.16
bamboo_capability_system_builder_mvn2_Maven_2=/usr/share/maven2
bamboo_planRepository_previousRevision=dc8ff9da28b8ab4ad11c7ea94cca526f17c87fe5
bamboo_build_commandline_com_atlassian_bamboo_plugins_scripttask_task_builder_script_4=/bin/sh /home/bamboo/temp/PHPBB3-PR-JOB1-8182-ScriptBuildTask-156286310472212748.sh
bamboo_repository_git_branch=3.1.x
bamboo_buildResultKey=PHPBB3-PR-JOB1-8182
bamboo_repository_branch_name=3.1.x
bamboo_buildPlanName=phpBB3 - Pull Requests - Build and Test Job
bamboo_planRepository_1_revision=dc8ff9da28b8ab4ad11c7ea94cca526f17c87fe5
bamboo_repository_name=phpBB Ascraeus
bamboo_buildFailed=false
bamboo_capability_system_docker_executable=/usr/bin/docker
bamboo_planRepository_branch=3.1.x
bamboo_agentWorkingDirectory=/home/bamboo/xml-data/build-dir
bamboo_capability_system_git_executable=/usr/bin/git
bamboo_capability_system_builder_phpunit_PHPUnit_3_4=/usr/bin/phpunit
bamboo_repository_git_username=bantu
bamboo_planRepository_1_previousRevision=dc8ff9da28b8ab4ad11c7ea94cca526f17c87fe5
bamboo_repository_75956235_revision_number=dc8ff9da28b8ab4ad11c7ea94cca526f17c87fe5
bamboo_planRepository_branchDisplayName=3.1.x
bamboo_planRepository_1_type=gitv2
bamboo_planRepository_branchName=3.1.x
bamboo_repository_75956235_previous_revision_number=dc8ff9da28b8ab4ad11c7ea94cca526f17c87fe5
bamboo_capability_system_jdk_JDK=/usr/lib/jvm/java-6-sun
bamboo_plan_storageTag=PHPBB3-PR
bamboo_hg_cache_directory=/home/bamboo/xml-data/build-dir/_hg-repositories-cache
bamboo_planRepository_1_username=bantu
bamboo_planRepository_type=gitv2
bamboo_git_cache_directory=/home/bamboo/xml-data/build-dir/_git-repositories-cache
bamboo_ManualBuildTriggerReason_userName=Build Robot
bamboo_repository_git_repositoryUrl=https://github.com/phpbb/phpbb.git
bamboo_repository_75956235_git_branch=3.1.x
bamboo_capability_system_builder_ant_Ant=/usr/share/ant
bamboo_repository_75956235_name=phpBB Ascraeus
bamboo_tmp_directory=/home/bamboo/temp
bamboo_working_directory=/home/bamboo/xml-data/build-dir/PHPBB3-PR-JOB1
bamboo_planKey=PHPBB3-PR
bamboo_capability_local=true
bamboo_planRepository_1_repositoryUrl=https://github.com/phpbb/phpbb.git
bamboo_planRepository_username=bantu
bamboo_capability_system_jdk_JDK_1_6=/usr/lib/jvm/java-6-sun
bamboo_capability_system_jdk_JDK_1_7=/usr/lib/jvm/java-7-openjdk-amd64
bamboo_planRepository_1_branchName=3.1.x
06-Jun-2018 09:40:24 Cannot create cache directory /home/bamboo/.composer/cache/repo/https---packagist.org/, or directory is not writable. Proceeding without cache
06-Jun-2018 09:40:24 Cannot create cache directory /home/bamboo/.composer/cache/files/, or directory is not writable. Proceeding without cache
06-Jun-2018 09:40:24 You are using the deprecated option "dev". Dev packages are installed by default now.
06-Jun-2018 09:40:24 Loading composer repositories with package information
06-Jun-2018 09:40:24 Installing dependencies (including require-dev) from lock file
06-Jun-2018 09:40:24 Package operations: 75 installs, 0 updates, 0 removals
06-Jun-2018 09:40:25   - Installing composer/installers (v1.5.0): Downloading (connecting...)Downloading (0%)           Downloading (5%)Downloading (20%)Downloading (40%)Downloading (45%)Downloading (50%)Downloading (65%)Downloading (70%)Downloading (75%)Downloading (80%)Downloading (100%)
06-Jun-2018 09:40:26   - Installing bantu/ini-get-wrapper (v1.0.1): Downloading (connecting...)Downloading (0%)           Downloading (100%)
06-Jun-2018 09:40:27   - Installing symfony/process (v3.4.3): Downloading (connecting...)Downloading (0%)           Downloading (5%)Downloading (30%)Downloading (35%)Downloading (70%)Downloading (85%)Downloading (90%)Downloading (95%)Downloading (100%)
06-Jun-2018 09:40:28   - Installing symfony/finder (v3.4.3): Downloading (connecting...)Downloading (0%)           Downloading (5%)Downloading (10%)Downloading (40%)Downloading (45%)Downloading (70%)Downloading (75%)Downloading (80%)Downloading (85%)Downloading (100%)
06-Jun-2018 09:40:29   - Installing symfony/filesystem (v3.4.3): Downloading (connecting...)Downloading (0%)           Downloading (5%)Downloading (70%)Downloading (100%)
06-Jun-2018 09:40:30   - Installing symfony/polyfill-mbstring (v1.7.0): Downloading (connecting...)Downloading (0%)           Downloading (20%)Downloading (40%)Downloading (100%)
06-Jun-2018 09:40:31   - Installing psr/log (1.0.2): Downloading (connecting...)Downloading (0%)           Downloading (15%)Downloading (100%)
06-Jun-2018 09:40:32   - Installing symfony/debug (v3.4.3): Downloading (connecting...)Downloading (0%)           Downloading (5%)Downloading (15%)Downloading (20%)Downloading (30%)Downloading (35%)Downloading (40%)Downloading (50%)Downloading (60%)Downloading (65%)Downloading (70%)Downloading (80%)Downloading (85%)Downloading (100%)
06-Jun-2018 09:40:32   - Installing symfony/console (v3.4.3): Downloading (connecting...)Downloading (0%)           Downloading (5%)Downloading (10%)Downloading (15%)Downloading (20%)Downloading (25%)Downloading (30%)Downloading (35%)Downloading (40%)Downloading (45%)Downloading (50%)Downloading (55%)Downloading (60%)Downloading (65%)Downloading (70%)Downloading (75%)Downloading (80%)Downloading (85%)Downloading (90%)Downloading (95%)Downloading (100%)
06-Jun-2018 09:40:33   - Installing seld/phar-utils (1.0.1): Downloading (connecting...)Downloading (0%)           Downloading (30%)Downloading (60%)Downloading (90%)Downloading (100%)
06-Jun-2018 09:40:34   - Installing seld/jsonlint (1.7.0): Downloading (connecting...)Downloading (0%)           Downloading (15%)Downloading (60%)Downloading (75%)Downloading (90%)Downloading (100%)
06-Jun-2018 09:40:35   - Installing seld/cli-prompt (1.0.3): Downloading (connecting...)Downloading (0%)           Downloading (15%)Downloading (30%)Downloading (100%)
06-Jun-2018 09:40:36   - Installing justinrainbow/json-schema (5.2.6): Downloading (connecting...)Downloading (0%)           Downloading (15%)Downloading (20%)Downloading (35%)Downloading (40%)Downloading (45%)Downloading (50%)Downloading (65%)Downloading (70%)Downloading (85%)Downloading (90%)Downloading (100%)
06-Jun-2018 09:40:36   - Installing composer/spdx-licenses (1.2.0): Downloading (connecting...)Downloading (0%)           Downloading (65%)Downloading (75%)Downloading (100%)
06-Jun-2018 09:40:37   - Installing composer/semver (1.4.2): Downloading (connecting...)Downloading (0%)           Downloading (35%)Downloading (75%)Downloading (100%)
06-Jun-2018 09:40:38   - Installing composer/ca-bundle (1.1.0): Downloading (connecting...)Downloading (0%)           Downloading (5%)Downloading (10%)Downloading (15%)Downloading (20%)Downloading (25%)Downloading (30%)Downloading (35%)Downloading (40%)Downloading (45%)Downloading (50%)Downloading (55%)Downloading (60%)Downloading (65%)Downloading (70%)Downloading (75%)Downloading (80%)Downloading (85%)Downloading (90%)Downloading (95%)Downloading (100%)
06-Jun-2018 09:40:39   - Installing composer/composer (1.6.2): Downloading (connecting...)Downloading (0%)           Downloading (5%)Downloading (10%)Downloading (15%)Downloading (20%)Downloading (25%)Downloading (30%)Downloading (35%)Downloading (40%)Downloading (45%)Downloading (50%)Downloading (55%)Downloading (60%)Downloading (65%)Downloading (70%)Downloading (75%)Downloading (80%)Downloading (85%)Downloading (90%)Downloading (95%)Downloading (100%)
06-Jun-2018 09:40:40   - Installing google/recaptcha (1.1.3): Downloading (connecting...)Downloading (0%)           Downloading (25%)Downloading (30%)Downloading (55%)Downloading (80%)Downloading (95%)Downloading (100%)
06-Jun-2018 09:40:41   - Installing guzzlehttp/promises (v1.3.1): Downloading (connecting...)Downloading (0%)           Downloading (30%)Downloading (60%)Downloading (80%)Downloading (100%)
06-Jun-2018 09:40:41   - Installing psr/http-message (1.0.1): Downloading (connecting...)Downloading (0%)           Downloading (95%)Downloading (100%)
06-Jun-2018 09:40:42   - Installing guzzlehttp/psr7 (1.4.2): Downloading (connecting...)Downloading (0%)           Downloading (5%)Downloading (10%)Downloading (15%)Downloading (20%)Downloading (50%)Downloading (55%)Downloading (60%)Downloading (65%)Downloading (70%)Downloading (100%)
06-Jun-2018 09:40:43   - Installing lusitanian/oauth (v0.8.10): Downloading (connecting...)Downloading (0%)           Downloading (5%)Downloading (10%)Downloading (15%)Downloading (20%)Downloading (30%)Downloading (35%)Downloading (45%)Downloading (50%)Downloading (55%)Downloading (60%)Downloading (65%)Downloading (70%)Downloading (75%)Downloading (80%)Downloading (85%)Downloading (95%)Downloading (100%)
06-Jun-2018 09:40:44   - Installing marc1706/fast-image-size (v1.1.4): Downloading (connecting...)Downloading (0%)           Downloading (45%)Downloading (90%)Downloading (100%)
06-Jun-2018 09:40:45   - Installing patchwork/utf8 (v1.3.1): Downloading (connecting...)Downloading (100%)         
06-Jun-2018 09:40:46   - Installing psr/container (1.0.0): Downloading (connecting...)Downloading (0%)           Downloading (75%)Downloading (100%)
06-Jun-2018 09:40:47   - Installing s9e/text-formatter (0.13.1): Downloading (connecting...)Downloading (100%)         
06-Jun-2018 09:40:48   - Installing symfony/config (v3.4.3): Downloading (connecting...)Downloading (0%)           Downloading (5%)Downloading (10%)Downloading (15%)Downloading (20%)Downloading (25%)Downloading (30%)Downloading (35%)Downloading (40%)Downloading (45%)Downloading (50%)Downloading (55%)Downloading (60%)Downloading (65%)Downloading (70%)Downloading (75%)Downloading (80%)Downloading (85%)Downloading (90%)Downloading (95%)Downloading (100%)
06-Jun-2018 09:40:49   - Installing paragonie/random_compat (v1.4.2): Downloading (connecting...)Downloading (0%)           Downloading (10%)Downloading (35%)Downloading (45%)Downloading (50%)Downloading (60%)Downloading (70%)Downloading (80%)Downloading (100%)
06-Jun-2018 09:40:49   - Installing symfony/polyfill-php70 (v1.6.0): Downloading (connecting...)Downloading (0%)           Downloading (85%)Downloading (100%)
06-Jun-2018 09:40:50   - Installing symfony/http-foundation (v3.4.3): Downloading (connecting...)Downloading (0%)           Downloading (5%)Downloading (10%)Downloading (15%)Downloading (20%)Downloading (25%)Downloading (30%)Downloading (35%)Downloading (40%)Downloading (45%)Downloading (50%)Downloading (55%)Downloading (60%)Downloading (65%)Downloading (70%)Downloading (75%)Downloading (80%)Downloading (85%)Downloading (90%)Downloading (95%)Downloading (100%)
06-Jun-2018 09:40:51   - Installing symfony/event-dispatcher (v3.4.3): Downloading (connecting...)Downloading (0%)           Downloading (5%)Downloading (65%)Downloading (70%)Downloading (75%)Downloading (100%)
06-Jun-2018 09:40:52   - Installing symfony/http-kernel (v3.4.3): Downloading (connecting...)Downloading (0%)           Downloading (5%)Downloading (10%)Downloading (15%)Downloading (20%)Downloading (25%)Downloading (30%)Downloading (35%)Downloading (40%)Downloading (45%)Downloading (50%)Downloading (55%)Downloading (60%)Downloading (65%)Downloading (70%)Downloading (75%)Downloading (80%)Downloading (85%)Downloading (90%)Downloading (95%)Downloading (100%)
06-Jun-2018 09:40:53   - Installing symfony/dependency-injection (v3.4.3): Downloading (connecting...)Downloading (0%)           Downloading (5%)Downloading (10%)Downloading (15%)Downloading (20%)Downloading (25%)Downloading (30%)Downloading (35%)Downloading (40%)Downloading (45%)Downloading (50%)Downloading (55%)Downloading (60%)Downloading (65%)Downloading (70%)Downloading (75%)Downloading (80%)Downloading (85%)Downloading (90%)Downloading (95%)Downloading (100%)
06-Jun-2018 09:40:54   - Installing zendframework/zend-eventmanager (3.2.0): Downloading (connecting...)Downloading (0%)           Downloading (25%)Downloading (35%)Downloading (50%)Downloading (70%)Downloading (95%)Downloading (100%)
06-Jun-2018 09:40:55   - Installing zendframework/zend-code (2.6.3): Downloading (connecting...)Downloading (0%)           Downloading (5%)Downloading (10%)Downloading (15%)Downloading (20%)Downloading (25%)Downloading (30%)Downloading (35%)Downloading (40%)Downloading (45%)Downloading (50%)Downloading (55%)Downloading (60%)Downloading (65%)Downloading (70%)Downloading (75%)Downloading (85%)Downloading (90%)Downloading (95%)Downloading (100%)
06-Jun-2018 09:40:56   - Installing ocramius/proxy-manager (1.0.2): Downloading (connecting...)Downloading (0%)           Downloading (5%)Downloading (10%)Downloading (15%)Downloading (20%)Downloading (25%)Downloading (30%)Downloading (35%)Downloading (40%)Downloading (45%)Downloading (50%)Downloading (55%)Downloading (60%)Downloading (65%)Downloading (70%)Downloading (75%)Downloading (85%)Downloading (90%)Downloading (95%)Downloading (100%)
06-Jun-2018 09:40:57   - Installing symfony/proxy-manager-bridge (v3.4.3): Downloading (connecting...)Downloading (0%)           Downloading (60%)Downloading (95%)Downloading (100%)
06-Jun-2018 09:40:58   - Installing symfony/routing (v3.4.3): Downloading (connecting...)Downloading (0%)           Downloading (5%)Downloading (10%)Downloading (15%)Downloading (20%)Downloading (25%)Downloading (30%)Downloading (35%)Downloading (40%)Downloading (45%)Downloading (50%)Downloading (55%)Downloading (60%)Downloading (65%)Downloading (70%)Downloading (75%)Downloading (80%)Downloading (85%)Downloading (90%)Downloading (95%)Downloading (100%)
06-Jun-2018 09:40:59   - Installing twig/twig (v1.35.0): Downloading (connecting...)Downloading (0%)           Downloading (5%)Downloading (10%)Downloading (15%)Downloading (20%)Downloading (25%)Downloading (30%)Downloading (35%)Downloading (40%)Downloading (45%)Downloading (50%)Downloading (55%)Downloading (60%)Downloading (65%)Downloading (70%)Downloading (75%)Downloading (80%)Downloading (85%)Downloading (90%)Downloading (95%)Downloading (100%)
06-Jun-2018 09:41:00   - Installing symfony/twig-bridge (v3.4.3): Downloading (connecting...)Downloading (0%)           Downloading (5%)Downloading (10%)Downloading (15%)Downloading (20%)Downloading (25%)Downloading (30%)Downloading (40%)Downloading (45%)Downloading (50%)Downloading (55%)Downloading (65%)Downloading (70%)Downloading (75%)Downloading (85%)Downloading (90%)Downloading (95%)Downloading (100%)
06-Jun-2018 09:41:01   - Installing symfony/dom-crawler (v3.4.3): Downloading (connecting...)Downloading (0%)           Downloading (5%)Downloading (25%)Downloading (30%)Downloading (45%)Downloading (50%)Downloading (70%)Downloading (75%)Downloading (100%)
06-Jun-2018 09:41:03   - Installing symfony/css-selector (v3.4.3): Downloading (connecting...)Downloading (0%)           Downloading (5%)Downloading (10%)Downloading (15%)Downloading (20%)Downloading (25%)Downloading (30%)Downloading (65%)Downloading (70%)Downloading (75%)Downloading (80%)Downloading (85%)Downloading (90%)Downloading (95%)Downloading (100%)
06-Jun-2018 09:41:04   - Installing symfony/browser-kit (v3.4.3): Downloading (connecting...)Downloading (0%)           Downloading (5%)Downloading (70%)Downloading (75%)Downloading (100%)
06-Jun-2018 09:41:04   - Installing guzzlehttp/guzzle (6.3.0): Downloading (connecting...)Downloading (0%)           Downloading (5%)Downloading (15%)Downloading (20%)Downloading (30%)Downloading (35%)Downloading (40%)Downloading (45%)Downloading (50%)Downloading (55%)Downloading (65%)Downloading (70%)Downloading (80%)Downloading (85%)Downloading (90%)Downloading (95%)Downloading (100%)
06-Jun-2018 09:41:05   - Installing fabpot/goutte (v3.2.2): Downloading (connecting...)Downloading (0%)           Downloading (55%)Downloading (90%)Downloading (100%)
06-Jun-2018 09:41:06   - Installing facebook/webdriver (1.5.0): Downloading (connecting...)Downloading (0%)           Downloading (5%)Downloading (10%)Downloading (15%)Downloading (20%)Downloading (25%)Downloading (30%)Downloading (35%)Downloading (40%)Downloading (45%)Downloading (50%)Downloading (55%)Downloading (60%)Downloading (65%)Downloading (70%)Downloading (75%)Downloading (80%)Downloading (85%)Downloading (90%)Downloading (95%)Downloading (100%)
06-Jun-2018 09:41:07   - Installing laravel/homestead (v4.0.5): Downloading (connecting...)Downloading (0%)           Downloading (5%)Downloading (10%)Downloading (70%)Downloading (75%)Downloading (80%)Downloading (85%)Downloading (100%)
06-Jun-2018 09:41:10   - Installing phing/phing (2.4.14): Downloading (connecting...)Downloading (100%)         
06-Jun-2018 09:41:11   - Installing webmozart/assert (1.2.0): Downloading (connecting...)Downloading (0%)           Downloading (55%)Downloading (75%)Downloading (95%)Downloading (100%)
06-Jun-2018 09:41:12   - Installing phpdocumentor/reflection-common (1.0.1): Downloading (connecting...)Downloading (0%)           Downloading (100%)
06-Jun-2018 09:41:12   - Installing phpdocumentor/type-resolver (0.4.0): Downloading (connecting...)Downloading (0%)           Downloading (5%)Downloading (80%)Downloading (85%)Downloading (90%)Downloading (100%)
06-Jun-2018 09:41:13   - Installing phpdocumentor/reflection-docblock (3.3.2): Downloading (connecting...)Downloading (0%)           Downloading (5%)Downloading (10%)Downloading (15%)Downloading (70%)Downloading (75%)Downloading (80%)Downloading (85%)Downloading (90%)Downloading (95%)Downloading (100%)
06-Jun-2018 09:41:14   - Installing symfony/yaml (v3.4.3): Downloading (connecting...)Downloading (0%)           Downloading (5%)Downloading (10%)Downloading (35%)Downloading (40%)Downloading (45%)Downloading (50%)Downloading (100%)
06-Jun-2018 09:41:15   - Installing sebastian/version (2.0.1): Downloading (connecting...)Downloading (0%)           Downloading (100%)
06-Jun-2018 09:41:16   - Installing sebastian/resource-operations (1.0.0): Downloading (connecting...)Downloading (0%)           Downloading (65%)Downloading (100%)
06-Jun-2018 09:41:17   - Installing sebastian/recursion-context (2.0.0): Downloading (connecting...)Downloading (0%)           Downloading (100%)
06-Jun-2018 09:41:17   - Installing sebastian/object-enumerator (2.0.1): Downloading (connecting...)Downloading (0%)           Downloading (95%)Downloading (100%)
06-Jun-2018 09:41:18   - Installing sebastian/global-state (1.1.1): Downloading (connecting...)Downloading (0%)           Downloading (40%)Downloading (70%)Downloading (100%)
06-Jun-2018 09:41:19   - Installing sebastian/exporter (2.0.0): Downloading (connecting...)Downloading (0%)           Downloading (95%)Downloading (100%)
06-Jun-2018 09:41:20   - Installing sebastian/environment (2.0.0): Downloading (connecting...)Downloading (0%)           Downloading (15%)Downloading (30%)Downloading (45%)Downloading (60%)Downloading (75%)Downloading (90%)Downloading (100%)
06-Jun-2018 09:41:21   - Installing sebastian/diff (1.4.3): Downloading (connecting...)Downloading (0%)           Downloading (35%)Downloading (40%)Downloading (75%)Downloading (100%)
06-Jun-2018 09:41:21   - Installing sebastian/comparator (1.2.4): Downloading (connecting...)Downloading (0%)           Downloading (10%)Downloading (75%)Downloading (85%)Downloading (95%)Downloading (100%)
06-Jun-2018 09:41:22   - Installing phpunit/php-text-template (1.2.1): Downloading (connecting...)Downloading (0%)           Downloading (35%)Downloading (100%)
06-Jun-2018 09:41:23   - Installing doctrine/instantiator (1.0.5): Downloading (connecting...)Downloading (0%)           Downloading (15%)Downloading (30%)Downloading (45%)Downloading (50%)Downloading (65%)Downloading (80%)Downloading (95%)Downloading (100%)
06-Jun-2018 09:41:24   - Installing phpunit/phpunit-mock-objects (3.4.4): Downloading (connecting...)Downloading (0%)           Downloading (5%)Downloading (10%)Downloading (15%)Downloading (20%)Downloading (25%)Downloading (30%)Downloading (40%)Downloading (45%)Downloading (50%)Downloading (55%)Downloading (60%)Downloading (65%)Downloading (75%)Downloading (80%)Downloading (85%)Downloading (90%)Downloading (95%)Downloading (100%)
06-Jun-2018 09:41:24   - Installing phpunit/php-timer (1.0.9): Downloading (connecting...)Downloading (0%)           Downloading (45%)Downloading (90%)Downloading (100%)
06-Jun-2018 09:41:25   - Installing phpunit/php-file-iterator (1.4.5): Downloading (connecting...)Downloading (0%)           Downloading (100%)
06-Jun-2018 09:41:26   - Installing sebastian/code-unit-reverse-lookup (1.0.1): Downloading (connecting...)Downloading (0%)           Downloading (55%)Downloading (100%)
06-Jun-2018 09:41:27   - Installing phpunit/php-token-stream (1.4.12): Downloading (connecting...)Downloading (0%)           Downloading (5%)Downloading (10%)Downloading (15%)Downloading (20%)Downloading (90%)Downloading (95%)Downloading (100%)
06-Jun-2018 09:41:28   - Installing phpunit/php-code-coverage (4.0.8): Downloading (connecting...)Downloading (0%)           Downloading (5%)Downloading (10%)Downloading (15%)Downloading (20%)Downloading (25%)Downloading (30%)Downloading (35%)Downloading (40%)Downloading (45%)Downloading (50%)Downloading (55%)Downloading (60%)Downloading (65%)Downloading (70%)Downloading (75%)Downloading (80%)Downloading (85%)Downloading (90%)Downloading (95%)Downloading (100%)
06-Jun-2018 09:41:29   - Installing phpspec/prophecy (1.7.5): Downloading (connecting...)Downloading (0%)           Downloading (10%)Downloading (15%)Downloading (25%)Downloading (35%)Downloading (45%)Downloading (55%)Downloading (60%)Downloading (65%)Downloading (70%)Downloading (80%)Downloading (90%)Downloading (100%)
06-Jun-2018 09:41:30   - Installing myclabs/deep-copy (1.7.0): Downloading (connecting...)Downloading (0%)           Downloading (25%)Downloading (30%)Downloading (45%)Downloading (50%)Downloading (65%)Downloading (70%)Downloading (85%)Downloading (90%)Downloading (100%)
06-Jun-2018 09:41:31   - Installing phpunit/phpunit (5.7.26): Downloading (connecting...)Downloading (0%)           Downloading (5%)Downloading (10%)Downloading (15%)Downloading (20%)Downloading (25%)Downloading (30%)Downloading (35%)Downloading (40%)Downloading (45%)Downloading (50%)Downloading (55%)Downloading (60%)Downloading (65%)Downloading (70%)Downloading (75%)Downloading (80%)Downloading (85%)Downloading (90%)Downloading (95%)Downloading (100%)
06-Jun-2018 09:41:32   - Installing phpunit/dbunit (2.0.3): Downloading (connecting...)Downloading (0%)           Downloading (5%)Downloading (10%)Downloading (15%)Downloading (20%)Downloading (25%)Downloading (30%)Downloading (35%)Downloading (40%)Downloading (45%)Downloading (50%)Downloading (55%)Downloading (60%)Downloading (65%)Downloading (70%)Downloading (75%)Downloading (80%)Downloading (85%)Downloading (90%)Downloading (95%)Downloading (100%)
06-Jun-2018 09:41:33   - Installing squizlabs/php_codesniffer (2.9.1): Downloading (connecting...)Downloading (0%)           Downloading (5%)Downloading (10%)Downloading (15%)Downloading (20%)Downloading (25%)Downloading (30%)Downloading (35%)Downloading (40%)Downloading (45%)Downloading (50%)Downloading (55%)Downloading (60%)Downloading (65%)Downloading (70%)Downloading (75%)Downloading (80%)Downloading (85%)Downloading (90%)Downloading (95%)Downloading (100%)
06-Jun-2018 09:41:34 symfony/console suggests installing symfony/lock ()
06-Jun-2018 09:41:34 lusitanian/oauth suggests installing predis/predis (Allows using the Redis storage backend.)
06-Jun-2018 09:41:34 patchwork/utf8 suggests installing ext-intl (Use Intl for best performance)
06-Jun-2018 09:41:34 patchwork/utf8 suggests installing ext-wfio (Use WFIO for UTF-8 filesystem access on Windows)
06-Jun-2018 09:41:34 s9e/text-formatter suggests installing ext-intl (Allows international URLs to be accepted by the URL filter)
06-Jun-2018 09:41:34 s9e/text-formatter suggests installing ext-xsl (Enables the XSLT renderer)
06-Jun-2018 09:41:34 paragonie/random_compat suggests installing ext-libsodium (Provides a modern crypto API that can be used to generate random bytes.)
06-Jun-2018 09:41:34 symfony/http-kernel suggests installing symfony/var-dumper ()
06-Jun-2018 09:41:34 symfony/dependency-injection suggests installing symfony/expression-language (For using expressions in service container configuration)
06-Jun-2018 09:41:34 zendframework/zend-eventmanager suggests installing container-interop/container-interop (^1.1.0, to use the lazy listeners feature)
06-Jun-2018 09:41:34 zendframework/zend-eventmanager suggests installing zendframework/zend-stdlib (^2.7.3 || ^3.0, to use the FilterChain feature)
06-Jun-2018 09:41:34 zendframework/zend-code suggests installing doctrine/annotations (Doctrine\Common\Annotations >=1.0 for annotation features)
06-Jun-2018 09:41:34 zendframework/zend-code suggests installing zendframework/zend-stdlib (Zend\Stdlib component)
06-Jun-2018 09:41:34 ocramius/proxy-manager suggests installing ocramius/generated-hydrator (To have very fast object to array to object conversion for ghost objects)
06-Jun-2018 09:41:34 ocramius/proxy-manager suggests installing zendframework/zend-json (To have the JsonRpc adapter (Remote Object feature))
06-Jun-2018 09:41:34 ocramius/proxy-manager suggests installing zendframework/zend-soap (To have the Soap adapter (Remote Object feature))
06-Jun-2018 09:41:34 ocramius/proxy-manager suggests installing zendframework/zend-stdlib (To use the hydrator proxy)
06-Jun-2018 09:41:34 ocramius/proxy-manager suggests installing zendframework/zend-xmlrpc (To have the XmlRpc adapter (Remote Object feature))
06-Jun-2018 09:41:34 symfony/routing suggests installing doctrine/annotations (For using the annotation loader)
06-Jun-2018 09:41:34 symfony/routing suggests installing symfony/expression-language (For using expression matching)
06-Jun-2018 09:41:34 symfony/twig-bridge suggests installing symfony/asset (For using the AssetExtension)
06-Jun-2018 09:41:34 symfony/twig-bridge suggests installing symfony/expression-language (For using the ExpressionExtension)
06-Jun-2018 09:41:34 symfony/twig-bridge suggests installing symfony/form (For using the FormExtension)
06-Jun-2018 09:41:34 symfony/twig-bridge suggests installing symfony/security (For using the SecurityExtension)
06-Jun-2018 09:41:34 symfony/twig-bridge suggests installing symfony/stopwatch (For using the StopwatchExtension)
06-Jun-2018 09:41:34 symfony/twig-bridge suggests installing symfony/templating (For using the TwigEngine)
06-Jun-2018 09:41:34 symfony/twig-bridge suggests installing symfony/translation (For using the TranslationExtension)
06-Jun-2018 09:41:34 symfony/twig-bridge suggests installing symfony/var-dumper (For using the DumpExtension)
06-Jun-2018 09:41:34 symfony/twig-bridge suggests installing symfony/web-link (For using the WebLinkExtension)
06-Jun-2018 09:41:34 sebastian/global-state suggests installing ext-uopz (*)
06-Jun-2018 09:41:34 phpunit/phpunit-mock-objects suggests installing ext-soap (*)
06-Jun-2018 09:41:34 phpunit/phpunit suggests installing phpunit/php-invoker (~1.1)
06-Jun-2018 09:41:34 Generating autoload files
06-Jun-2018 09:41:35 Buildfile: /data/build/build.xml
06-Jun-2018 09:41:35
06-Jun-2018 09:41:35 phpBB > clean:
06-Jun-2018 09:41:35
06-Jun-2018 09:41:35    [delete] Directory /data/build/logs does not exist or is not a directory.
06-Jun-2018 09:41:35    [delete] Directory /data/build/api does not exist or is not a directory.
06-Jun-2018 09:41:35    [delete] Directory /data/build/codebrowser does not exist or is not a directory.
06-Jun-2018 09:41:35    [delete] Directory /data/build/coverage does not exist or is not a directory.
06-Jun-2018 09:41:35    [delete] Directory /data/build/cpd does not exist or is not a directory.
06-Jun-2018 09:41:35    [delete] Directory /data/build/dependencies does not exist or is not a directory.
06-Jun-2018 09:41:35    [delete] Directory /data/build/new_version does not exist or is not a directory.
06-Jun-2018 09:41:35    [delete] Directory /data/build/old_versions does not exist or is not a directory.
06-Jun-2018 09:41:35    [delete] Directory /data/build/save does not exist or is not a directory.
06-Jun-2018 09:41:35
06-Jun-2018 09:41:35 phpBB > prepare:
06-Jun-2018 09:41:35
06-Jun-2018 09:41:35     [mkdir] Created dir: /data/build/logs
06-Jun-2018 09:41:35     [mkdir] Created dir: /data/build/api
06-Jun-2018 09:41:35     [mkdir] Created dir: /data/build/codebrowser
06-Jun-2018 09:41:35     [mkdir] Created dir: /data/build/coverage
06-Jun-2018 09:41:35     [mkdir] Created dir: /data/build/cpd
06-Jun-2018 09:41:35     [mkdir] Created dir: /data/build/dependencies
06-Jun-2018 09:41:35     [mkdir] Created dir: /data/build/new_version
06-Jun-2018 09:41:35     [mkdir] Created dir: /data/build/new_version/files
06-Jun-2018 09:41:35     [mkdir] Created dir: /data/build/new_version/patches
06-Jun-2018 09:41:35     [mkdir] Created dir: /data/build/new_version/release_files
06-Jun-2018 09:41:35     [mkdir] Created dir: /data/build/new_version/update
06-Jun-2018 09:41:35     [mkdir] Created dir: /data/build/old_versions
06-Jun-2018 09:41:35     [mkdir] Created dir: /data/build/save
06-Jun-2018 09:41:35
06-Jun-2018 09:41:35 BUILD FINISHED
06-Jun-2018 09:41:35
06-Jun-2018 09:41:35 Total time: 0.1220 seconds
06-Jun-2018 09:41:35
06-Jun-2018 09:41:35 Finished task 'Prepare directory' with result: Success
06-Jun-2018 09:41:35 Skipping execution of task 'Run sniffs' as it is disabled
06-Jun-2018 09:41:35
Substituting variable: ${bamboo.working.directory} with /home/bamboo/xml-data/build-dir/PHPBB3-PR-JOB1
06-Jun-2018 09:41:35 Starting task 'Run sniffs' of type 'com.atlassian.bamboo.plugins.bamboo-docker-plugin:task.docker.cli'
06-Jun-2018 09:41:35 Running image name (phpbb:php-5.6)
06-Jun-2018 09:41:35
Beginning to execute external process for build 'phpBB3 - Pull Requests - Build and Test Job #8182 (PHPBB3-PR-JOB1-8182)'
... running command line:
/usr/bin/docker run --volume /home/bamboo/xml-data/build-dir/PHPBB3-PR-JOB1:/data --workdir /data/build --rm -u=991 phpbb:php-5.6 ../phpBB/vendor/bin/phing sniff
... in: /home/bamboo/xml-data/build-dir/PHPBB3-PR-JOB1
... using extra environment variables:
bamboo_planRepository_1_branch=3.1.x
bamboo_planRepository_1_branchDisplayName=3.1.x
bamboo_repository_revision_number=dc8ff9da28b8ab4ad11c7ea94cca526f17c87fe5
bamboo_PRref=master
bamboo_resultsUrl=https://bamboo.phpbb.com/browse/PHPBB3-PR-JOB1-8182
bamboo_capability_system_builder_command_Git=/usr/bin/git
bamboo_repository_75956235_git_username=bantu
bamboo_build_working_directory=/home/bamboo/xml-data/build-dir/PHPBB3-PR-JOB1
bamboo_planRepository_1_name=phpBB Ascraeus
bamboo_buildKey=PHPBB3-PR-JOB1
bamboo_capability_phpbb_tests=true
bamboo_shortPlanName=Pull Requests
bamboo_capability_system_builder_command_fop=/usr/bin/fop
bamboo_capability_dbms_sqlite_2=true
bamboo_planRepository_name=phpBB Ascraeus
bamboo_PRnumber=5225
bamboo_buildNumber=8182
bamboo_repository_75956235_git_repositoryUrl=https://github.com/phpbb/phpbb.git
bamboo_capability_system_builder_phpunit_PHPUnit=/usr/bin/phpunit
bamboo_shortJobName=Build and Test Job
bamboo_buildResultsUrl=https://bamboo.phpbb.com/browse/PHPBB3-PR-JOB1-8182
bamboo_repository_75956235_branch_name=3.1.x
bamboo_planRepository_repositoryUrl=https://github.com/phpbb/phpbb.git
bamboo_agentId=131073
bamboo_planName=phpBB3 - Pull Requests
bamboo_build_commandline_com_atlassian_bamboo_plugins_scripttask_task_builder_script_7=/bin/sh /home/bamboo/temp/PHPBB3-PR-JOB1-8182-ScriptBuildTask-7127911333156034676.sh
bamboo_shortPlanKey=PR
bamboo_shortJobKey=JOB1
bamboo_capability_dbms_mysql_55=true
bamboo_capability_system_jdk_JDK_1_7_0_65=/usr/lib/jvm/java-7-openjdk-amd64
bamboo_planRepository_revision=dc8ff9da28b8ab4ad11c7ea94cca526f17c87fe5
bamboo_buildTimeStamp=2018-06-06T09:40:12.044Z
bamboo_repository_previous_revision_number=dc8ff9da28b8ab4ad11c7ea94cca526f17c87fe5
bamboo_capability_system_jdk_JDK_1_6_0_16=/usr/lib/jvm/java-6-sun-1.6.0.16
bamboo_capability_system_builder_mvn2_Maven_2=/usr/share/maven2
bamboo_planRepository_previousRevision=dc8ff9da28b8ab4ad11c7ea94cca526f17c87fe5
bamboo_build_commandline_com_atlassian_bamboo_plugins_scripttask_task_builder_script_4=/bin/sh /home/bamboo/temp/PHPBB3-PR-JOB1-8182-ScriptBuildTask-156286310472212748.sh
bamboo_repository_git_branch=3.1.x
bamboo_buildResultKey=PHPBB3-PR-JOB1-8182
bamboo_repository_branch_name=3.1.x
bamboo_buildPlanName=phpBB3 - Pull Requests - Build and Test Job
bamboo_planRepository_1_revision=dc8ff9da28b8ab4ad11c7ea94cca526f17c87fe5
bamboo_repository_name=phpBB Ascraeus
bamboo_buildFailed=false
bamboo_capability_system_docker_executable=/usr/bin/docker
bamboo_build_commandline_com_atlassian_bamboo_plugins_bamboo_docker_plugin_task_docker_cli_12=/usr/bin/docker run --volume /home/bamboo/xml-data/build-dir/PHPBB3-PR-JOB1:/data --workdir /data/phpBB --rm -e HOME=/home/bamboo -u=991 phpbb:php-5.6 /bin/bash -c php ../composer.phar install --dev; cd ../build; ../phpBB/vendor/bin/phing clean prepare
bamboo_planRepository_branch=3.1.x
bamboo_agentWorkingDirectory=/home/bamboo/xml-data/build-dir
bamboo_capability_system_git_executable=/usr/bin/git
bamboo_capability_system_builder_phpunit_PHPUnit_3_4=/usr/bin/phpunit
bamboo_repository_git_username=bantu
bamboo_planRepository_1_previousRevision=dc8ff9da28b8ab4ad11c7ea94cca526f17c87fe5
bamboo_repository_75956235_revision_number=dc8ff9da28b8ab4ad11c7ea94cca526f17c87fe5
bamboo_planRepository_branchDisplayName=3.1.x
bamboo_planRepository_1_type=gitv2
bamboo_planRepository_branchName=3.1.x
bamboo_repository_75956235_previous_revision_number=dc8ff9da28b8ab4ad11c7ea94cca526f17c87fe5
bamboo_capability_system_jdk_JDK=/usr/lib/jvm/java-6-sun
bamboo_plan_storageTag=PHPBB3-PR
bamboo_hg_cache_directory=/home/bamboo/xml-data/build-dir/_hg-repositories-cache
bamboo_planRepository_1_username=bantu
bamboo_planRepository_type=gitv2
bamboo_git_cache_directory=/home/bamboo/xml-data/build-dir/_git-repositories-cache
bamboo_ManualBuildTriggerReason_userName=Build Robot
bamboo_repository_git_repositoryUrl=https://github.com/phpbb/phpbb.git
bamboo_repository_75956235_git_branch=3.1.x
bamboo_capability_system_builder_ant_Ant=/usr/share/ant
bamboo_repository_75956235_name=phpBB Ascraeus
bamboo_tmp_directory=/home/bamboo/temp
bamboo_working_directory=/home/bamboo/xml-data/build-dir/PHPBB3-PR-JOB1
bamboo_planKey=PHPBB3-PR
bamboo_capability_local=true
bamboo_planRepository_1_repositoryUrl=https://github.com/phpbb/phpbb.git
bamboo_planRepository_username=bantu
bamboo_capability_system_jdk_JDK_1_6=/usr/lib/jvm/java-6-sun
bamboo_capability_system_jdk_JDK_1_7=/usr/lib/jvm/java-7-openjdk-amd64
bamboo_planRepository_1_branchName=3.1.x
06-Jun-2018 09:41:36 Buildfile: /data/build/build.xml
06-Jun-2018 09:41:36
06-Jun-2018 09:41:36 phpBB > sniff:
06-Jun-2018 09:41:36
06-Jun-2018 09:41:44 ............................................................  60 / 758 (8%)
06-Jun-2018 09:41:45 ............................................................ 120 / 758 (16%)
06-Jun-2018 09:41:46 ............................................................ 180 / 758 (24%)
06-Jun-2018 09:41:47 ............................................................ 240 / 758 (32%)
06-Jun-2018 09:41:51 ............................................................ 300 / 758 (40%)
06-Jun-2018 09:41:57 ............................................................ 360 / 758 (47%)
06-Jun-2018 09:42:03 ............................................................ 420 / 758 (55%)
06-Jun-2018 09:42:07 ............................................................ 480 / 758 (63%)
06-Jun-2018 09:42:11 ............................................................ 540 / 758 (71%)
06-Jun-2018 09:42:15 ............................................................ 600 / 758 (79%)
06-Jun-2018 09:42:19 ............................................................ 660 / 758 (87%)
06-Jun-2018 09:42:23 ............................................................ 720 / 758 (95%)
06-Jun-2018 09:42:25 ......................................
06-Jun-2018 09:42:25
06-Jun-2018 09:42:25 Time: 48.92 secs; Memory: 64Mb
06-Jun-2018 09:42:25
06-Jun-2018 09:42:33 ............................................................  60 / 209 (29%)
06-Jun-2018 09:42:53 ............................................................ 120 / 209 (57%)
06-Jun-2018 09:43:08 ............................................................ 180 / 209 (86%)
06-Jun-2018 09:43:16 .............................
06-Jun-2018 09:43:16
06-Jun-2018 09:43:16 Time: 51.39 secs; Memory: 60.5Mb
06-Jun-2018 09:43:16
06-Jun-2018 09:43:16
06-Jun-2018 09:43:16
06-Jun-2018 09:43:16 Time: 25ms; Memory: 3.75Mb
06-Jun-2018 09:43:16
06-Jun-2018 09:43:16
06-Jun-2018 09:43:16 BUILD FINISHED
06-Jun-2018 09:43:16
06-Jun-2018 09:43:16 Total time: 2 minutes  40.75 seconds
06-Jun-2018 09:43:16
06-Jun-2018 09:43:17 Finished task 'Run sniffs' with result: Success
06-Jun-2018 09:43:17 Skipping execution of task 'Run tests' as it is disabled
06-Jun-2018 09:43:17
Substituting variable: ${bamboo.working.directory} with /home/bamboo/xml-data/build-dir/PHPBB3-PR-JOB1
06-Jun-2018 09:43:17 Starting task 'Run tests' of type 'com.atlassian.bamboo.plugins.bamboo-docker-plugin:task.docker.cli'
06-Jun-2018 09:43:17 Running image name (phpbb:php-5.6)
06-Jun-2018 09:43:17
Beginning to execute external process for build 'phpBB3 - Pull Requests - Build and Test Job #8182 (PHPBB3-PR-JOB1-8182)'
... running command line:
/usr/bin/docker run --volume /home/bamboo/xml-data/build-dir/PHPBB3-PR-JOB1:/data --workdir /data --rm -u=991 -t phpbb:php-5.6 /bin/bash -c phpBB/vendor/bin/phpunit --log-junit build/logs/phpunit.xml
... in: /home/bamboo/xml-data/build-dir/PHPBB3-PR-JOB1
... using extra environment variables:
bamboo_planRepository_1_branch=3.1.x
bamboo_planRepository_1_branchDisplayName=3.1.x
bamboo_repository_revision_number=dc8ff9da28b8ab4ad11c7ea94cca526f17c87fe5
bamboo_PRref=master
bamboo_resultsUrl=https://bamboo.phpbb.com/browse/PHPBB3-PR-JOB1-8182
bamboo_capability_system_builder_command_Git=/usr/bin/git
bamboo_repository_75956235_git_username=bantu
bamboo_build_working_directory=/home/bamboo/xml-data/build-dir/PHPBB3-PR-JOB1
bamboo_planRepository_1_name=phpBB Ascraeus
bamboo_buildKey=PHPBB3-PR-JOB1
bamboo_capability_phpbb_tests=true
bamboo_shortPlanName=Pull Requests
bamboo_capability_system_builder_command_fop=/usr/bin/fop
bamboo_capability_dbms_sqlite_2=true
bamboo_planRepository_name=phpBB Ascraeus
bamboo_PRnumber=5225
bamboo_buildNumber=8182
bamboo_repository_75956235_git_repositoryUrl=https://github.com/phpbb/phpbb.git
bamboo_capability_system_builder_phpunit_PHPUnit=/usr/bin/phpunit
bamboo_shortJobName=Build and Test Job
bamboo_buildResultsUrl=https://bamboo.phpbb.com/browse/PHPBB3-PR-JOB1-8182
bamboo_repository_75956235_branch_name=3.1.x
bamboo_planRepository_repositoryUrl=https://github.com/phpbb/phpbb.git
bamboo_agentId=131073
bamboo_planName=phpBB3 - Pull Requests
bamboo_build_commandline_com_atlassian_bamboo_plugins_scripttask_task_builder_script_7=/bin/sh /home/bamboo/temp/PHPBB3-PR-JOB1-8182-ScriptBuildTask-7127911333156034676.sh
bamboo_shortPlanKey=PR
bamboo_shortJobKey=JOB1
bamboo_capability_dbms_mysql_55=true
bamboo_capability_system_jdk_JDK_1_7_0_65=/usr/lib/jvm/java-7-openjdk-amd64
bamboo_planRepository_revision=dc8ff9da28b8ab4ad11c7ea94cca526f17c87fe5
bamboo_buildTimeStamp=2018-06-06T09:40:12.044Z
bamboo_repository_previous_revision_number=dc8ff9da28b8ab4ad11c7ea94cca526f17c87fe5
bamboo_capability_system_jdk_JDK_1_6_0_16=/usr/lib/jvm/java-6-sun-1.6.0.16
bamboo_capability_system_builder_mvn2_Maven_2=/usr/share/maven2
bamboo_planRepository_previousRevision=dc8ff9da28b8ab4ad11c7ea94cca526f17c87fe5
bamboo_build_commandline_com_atlassian_bamboo_plugins_scripttask_task_builder_script_4=/bin/sh /home/bamboo/temp/PHPBB3-PR-JOB1-8182-ScriptBuildTask-156286310472212748.sh
bamboo_repository_git_branch=3.1.x
bamboo_buildResultKey=PHPBB3-PR-JOB1-8182
bamboo_repository_branch_name=3.1.x
bamboo_buildPlanName=phpBB3 - Pull Requests - Build and Test Job
bamboo_planRepository_1_revision=dc8ff9da28b8ab4ad11c7ea94cca526f17c87fe5
bamboo_repository_name=phpBB Ascraeus
bamboo_buildFailed=false
bamboo_capability_system_docker_executable=/usr/bin/docker
bamboo_build_commandline_com_atlassian_bamboo_plugins_bamboo_docker_plugin_task_docker_cli_11=/usr/bin/docker run --volume /home/bamboo/xml-data/build-dir/PHPBB3-PR-JOB1:/data --workdir /data/build --rm -u=991 phpbb:php-5.6 ../phpBB/vendor/bin/phing sniff
bamboo_build_commandline_com_atlassian_bamboo_plugins_bamboo_docker_plugin_task_docker_cli_12=/usr/bin/docker run --volume /home/bamboo/xml-data/build-dir/PHPBB3-PR-JOB1:/data --workdir /data/phpBB --rm -e HOME=/home/bamboo -u=991 phpbb:php-5.6 /bin/bash -c php ../composer.phar install --dev; cd ../build; ../phpBB/vendor/bin/phing clean prepare
bamboo_planRepository_branch=3.1.x
bamboo_agentWorkingDirectory=/home/bamboo/xml-data/build-dir
bamboo_capability_system_git_executable=/usr/bin/git
bamboo_capability_system_builder_phpunit_PHPUnit_3_4=/usr/bin/phpunit
bamboo_repository_git_username=bantu
bamboo_planRepository_1_previousRevision=dc8ff9da28b8ab4ad11c7ea94cca526f17c87fe5
bamboo_repository_75956235_revision_number=dc8ff9da28b8ab4ad11c7ea94cca526f17c87fe5
bamboo_planRepository_branchDisplayName=3.1.x
bamboo_planRepository_1_type=gitv2
bamboo_planRepository_branchName=3.1.x
bamboo_repository_75956235_previous_revision_number=dc8ff9da28b8ab4ad11c7ea94cca526f17c87fe5
bamboo_capability_system_jdk_JDK=/usr/lib/jvm/java-6-sun
bamboo_plan_storageTag=PHPBB3-PR
bamboo_hg_cache_directory=/home/bamboo/xml-data/build-dir/_hg-repositories-cache
bamboo_planRepository_1_username=bantu
bamboo_planRepository_type=gitv2
bamboo_git_cache_directory=/home/bamboo/xml-data/build-dir/_git-repositories-cache
bamboo_ManualBuildTriggerReason_userName=Build Robot
bamboo_repository_git_repositoryUrl=https://github.com/phpbb/phpbb.git
bamboo_repository_75956235_git_branch=3.1.x
bamboo_capability_system_builder_ant_Ant=/usr/share/ant
bamboo_repository_75956235_name=phpBB Ascraeus
bamboo_tmp_directory=/home/bamboo/temp
bamboo_working_directory=/home/bamboo/xml-data/build-dir/PHPBB3-PR-JOB1
bamboo_planKey=PHPBB3-PR
bamboo_capability_local=true
bamboo_planRepository_1_repositoryUrl=https://github.com/phpbb/phpbb.git
bamboo_planRepository_username=bantu
bamboo_capability_system_jdk_JDK_1_6=/usr/lib/jvm/java-6-sun
bamboo_capability_system_jdk_JDK_1_7=/usr/lib/jvm/java-7-openjdk-amd64
bamboo_planRepository_1_branchName=3.1.x
06-Jun-2018 09:43:20 PHPUnit 5.7.26 by Sebastian Bergmann and contributors.
06-Jun-2018 09:43:20
06-Jun-2018 09:43:28 .............................................................   61 / 7186 (  0%)
06-Jun-2018 09:43:29 .............................................................  122 / 7186 (  1%)
06-Jun-2018 09:43:30 .............I.....SSSSSSSS............SSSS.........S...S....  183 / 7186 (  2%)
06-Jun-2018 09:43:31 .............................................................  244 / 7186 (  3%)
06-Jun-2018 09:43:39 .....S............W..........................................  305 / 7186 (  4%)
06-Jun-2018 09:43:39 .............................................................  366 / 7186 (  5%)
06-Jun-2018 09:43:40 .............................................................  427 / 7186 (  5%)
06-Jun-2018 09:43:41 .............................................................  488 / 7186 (  6%)
06-Jun-2018 09:43:41 .............................................................  549 / 7186 (  7%)
06-Jun-2018 09:43:42 .............................................................  610 / 7186 (  8%)
06-Jun-2018 09:43:43 .............................................................  671 / 7186 (  9%)
06-Jun-2018 09:43:44 .............................................................  732 / 7186 ( 10%)
06-Jun-2018 09:43:45 .............................................................  793 / 7186 ( 11%)
06-Jun-2018 09:43:45 .............................................................  854 / 7186 ( 11%)
06-Jun-2018 09:43:46 .............................................................  915 / 7186 ( 12%)
06-Jun-2018 09:43:47 .............................................................  976 / 7186 ( 13%)
06-Jun-2018 09:43:48 ............................................................. 1037 / 7186 ( 14%)
06-Jun-2018 09:43:52 ................................................I............ 1098 / 7186 ( 15%)
06-Jun-2018 09:43:57 ............................................................. 1159 / 7186 ( 16%)
06-Jun-2018 09:44:03 ............................................................. 1220 / 7186 ( 16%)
06-Jun-2018 09:44:06 ........................................S.S.S................ 1281 / 7186 ( 17%)
06-Jun-2018 09:44:06 ............................................................. 1342 / 7186 ( 18%)
06-Jun-2018 09:44:06 ............................................................. 1403 / 7186 ( 19%)
06-Jun-2018 09:44:07 ............................................................. 1464 / 7186 ( 20%)
06-Jun-2018 09:44:07 ............................................................. 1525 / 7186 ( 21%)
06-Jun-2018 09:44:07 ............................................................. 1586 / 7186 ( 22%)
06-Jun-2018 09:44:07 ............................................................. 1647 / 7186 ( 22%)
06-Jun-2018 09:44:07 ............................................................. 1708 / 7186 ( 23%)
06-Jun-2018 09:44:07 ............................................................. 1769 / 7186 ( 24%)
06-Jun-2018 09:44:07 ............................................................. 1830 / 7186 ( 25%)
06-Jun-2018 09:44:07 ............................................................. 1891 / 7186 ( 26%)
06-Jun-2018 09:44:07 ............................................................. 1952 / 7186 ( 27%)
06-Jun-2018 09:44:08 ............................................................. 2013 / 7186 ( 28%)
06-Jun-2018 09:44:08 ............................................................. 2074 / 7186 ( 28%)
06-Jun-2018 09:44:08 ............................................................. 2135 / 7186 ( 29%)
06-Jun-2018 09:44:09 ............................................................. 2196 / 7186 ( 30%)
06-Jun-2018 09:44:11 ............................................................. 2257 / 7186 ( 31%)
06-Jun-2018 09:44:11 ............................................................. 2318 / 7186 ( 32%)
06-Jun-2018 09:44:11 ............................................................. 2379 / 7186 ( 33%)
06-Jun-2018 09:44:14 .......................I.II.................................. 2440 / 7186 ( 33%)
06-Jun-2018 09:44:14 ............................................................. 2501 / 7186 ( 34%)
06-Jun-2018 09:44:14 ............................................................. 2562 / 7186 ( 35%)
06-Jun-2018 09:44:14 ............................................................. 2623 / 7186 ( 36%)
06-Jun-2018 09:44:15 ............................................................. 2684 / 7186 ( 37%)
06-Jun-2018 09:44:18 ............................................................. 2745 / 7186 ( 38%)
06-Jun-2018 09:44:19 ............................................................. 2806 / 7186 ( 39%)
06-Jun-2018 09:44:19 .............................................SSSSSSSSS....... 2867 / 7186 ( 39%)
06-Jun-2018 09:44:19 ............................................................. 2928 / 7186 ( 40%)
06-Jun-2018 09:44:30 ............................................................. 2989 / 7186 ( 41%)
06-Jun-2018 09:44:37 ............................................................. 3050 / 7186 ( 42%)
06-Jun-2018 09:44:42 .....................S....................................... 3111 / 7186 ( 43%)
06-Jun-2018 09:44:42 ............................................................. 3172 / 7186 ( 44%)
06-Jun-2018 09:44:50 ............................................................. 3233 / 7186 ( 44%)
06-Jun-2018 09:45:01 ..............................................SSSS........... 3294 / 7186 ( 45%)
06-Jun-2018 09:45:07 ............................................................. 3355 / 7186 ( 46%)
06-Jun-2018 09:45:08 ............................................................. 3416 / 7186 ( 47%)
06-Jun-2018 09:45:08 ............................................................. 3477 / 7186 ( 48%)
06-Jun-2018 09:45:08 ............................................................. 3538 / 7186 ( 49%)
06-Jun-2018 09:45:09 ............................................................. 3599 / 7186 ( 50%)
06-Jun-2018 09:45:09 ............................................................. 3660 / 7186 ( 50%)
06-Jun-2018 09:45:09 ............................................................. 3721 / 7186 ( 51%)
06-Jun-2018 09:45:09 ............................................................. 3782 / 7186 ( 52%)
06-Jun-2018 09:45:09 ............................................................. 3843 / 7186 ( 53%)
06-Jun-2018 09:45:12 ............................................................. 3904 / 7186 ( 54%)
06-Jun-2018 09:45:13 ............................................................. 3965 / 7186 ( 55%)
06-Jun-2018 09:45:16 ............................................................. 4026 / 7186 ( 56%)
06-Jun-2018 09:45:17 ............................................................. 4087 / 7186 ( 56%)
06-Jun-2018 09:45:18 ............................................................. 4148 / 7186 ( 57%)
06-Jun-2018 09:45:21 ............................................................. 4209 / 7186 ( 58%)
06-Jun-2018 09:45:30 .............E........E...................................... 4270 / 7186 ( 59%)
06-Jun-2018 09:45:33 .EEE......................................................... 4331 / 7186 ( 60%)
06-Jun-2018 09:45:35 ............................................................. 4392 / 7186 ( 61%)
06-Jun-2018 09:45:35 ............................................................. 4453 / 7186 ( 61%)
06-Jun-2018 09:45:35 ............................................................. 4514 / 7186 ( 62%)
06-Jun-2018 09:45:35 ............................................................. 4575 / 7186 ( 63%)
06-Jun-2018 09:45:35 ............................................................. 4636 / 7186 ( 64%)
06-Jun-2018 09:45:35 ............................................................. 4697 / 7186 ( 65%)
06-Jun-2018 09:45:35 ............................................................. 4758 / 7186 ( 66%)
06-Jun-2018 09:45:35 ............................................................. 4819 / 7186 ( 67%)
06-Jun-2018 09:45:35 ............................................................. 4880 / 7186 ( 67%)
06-Jun-2018 09:45:50 ............................................................. 4941 / 7186 ( 68%)
06-Jun-2018 09:45:59 .........................S................................... 5002 / 7186 ( 69%)
06-Jun-2018 09:46:07 ............................................................. 5063 / 7186 ( 70%)
06-Jun-2018 09:46:14 ............................................................. 5124 / 7186 ( 71%)
06-Jun-2018 09:46:15 ............................................................. 5185 / 7186 ( 72%)
06-Jun-2018 09:46:16 ............................................................. 5246 / 7186 ( 73%)
06-Jun-2018 09:46:16 ............................................................. 5307 / 7186 ( 73%)
06-Jun-2018 09:46:16 ..........................................SSSSSSSSSSSSSSSSSSS 5368 / 7186 ( 74%)
06-Jun-2018 09:46:16 SSSSSSSSSSSSSSSSSSSSSSSSSSSSSSSSSSSSSSSSSSSSSSSSSSSSSSSSSSSSS 5429 / 7186 ( 75%)
06-Jun-2018 09:46:17 SSSSSSSSSSSSSSSSSSSSSSSSSSSSSSSSSSSSSSSSSSSSSSSSSSSSSSSSSSSSS 5490 / 7186 ( 76%)
06-Jun-2018 09:46:17 SSSSSSSSSSSSSSSSSSSSSSSSSSSSSSSSSSSSSSSSSSSSSSSSSSSSSSSSSSSSS 5551 / 7186 ( 77%)
06-Jun-2018 09:46:17 SSSSSSSSSSSSSSSSSSSSSSSSSSSSSSSSSSSSSSSSSSSSSSSSSSSSSSSSSSSS. 5612 / 7186 ( 78%)
06-Jun-2018 09:46:20 ............................................................. 5673 / 7186 ( 78%)
06-Jun-2018 09:46:23 ............................................................. 5734 / 7186 ( 79%)
06-Jun-2018 09:46:26 ............................................................. 5795 / 7186 ( 80%)
06-Jun-2018 09:46:29 ............................................................. 5856 / 7186 ( 81%)
06-Jun-2018 09:46:32 ............................................................. 5917 / 7186 ( 82%)
06-Jun-2018 09:46:35 ............................................................. 5978 / 7186 ( 83%)
06-Jun-2018 09:46:38 ............................................................. 6039 / 7186 ( 84%)
06-Jun-2018 09:46:41 ............................................................. 6100 / 7186 ( 84%)
06-Jun-2018 09:46:44 ............................................................. 6161 / 7186 ( 85%)
06-Jun-2018 09:46:47 ............................................................. 6222 / 7186 ( 86%)
06-Jun-2018 09:46:50 ............................................................. 6283 / 7186 ( 87%)
06-Jun-2018 09:46:53 ............................................................. 6344 / 7186 ( 88%)
06-Jun-2018 09:46:56 ............................................................. 6405 / 7186 ( 89%)
06-Jun-2018 09:46:59 ............................................................. 6466 / 7186 ( 89%)
06-Jun-2018 09:47:01 ............................................................. 6527 / 7186 ( 90%)
06-Jun-2018 09:47:04 ............................................................. 6588 / 7186 ( 91%)
06-Jun-2018 09:47:08 ............................................................. 6649 / 7186 ( 92%)
06-Jun-2018 09:47:11 ............................................................. 6710 / 7186 ( 93%)
06-Jun-2018 09:47:14 ............................................................. 6771 / 7186 ( 94%)
06-Jun-2018 09:47:17 ............................................................. 6832 / 7186 ( 95%)
06-Jun-2018 09:47:20 ............................................................. 6893 / 7186 ( 95%)
06-Jun-2018 09:47:22 ............................................................. 6954 / 7186 ( 96%)
06-Jun-2018 09:47:25 ............................................................. 7015 / 7186 ( 97%)
06-Jun-2018 09:47:28 ............................................................. 7076 / 7186 ( 98%)
06-Jun-2018 09:47:31 ............................................................. 7137 / 7186 ( 99%)
06-Jun-2018 09:47:34 ...............................................SS             7186 / 7186 (100%)
06-Jun-2018 09:47:34
06-Jun-2018 09:47:34 Time: 4.27 minutes, Memory: 522.00MB
06-Jun-2018 09:47:34
06-Jun-2018 09:47:34 There were 5 errors:
06-Jun-2018 09:47:34
06-Jun-2018 09:47:34 1) phpbb_textformatter_s9e_factory_test::test_get_configurator
06-Jun-2018 09:47:34 Argument 1 passed to phpbb\textformatter\s9e\factory::merge_templates() must be of the type array, null given, called in /data/phpBB/phpbb/textformatter/s9e/factory.php on line 546 and defined
06-Jun-2018 09:47:34
06-Jun-2018 09:47:34 /data/phpBB/phpbb/textformatter/s9e/factory.php:640
06-Jun-2018 09:47:34 /data/phpBB/phpbb/textformatter/s9e/factory.php:546
06-Jun-2018 09:47:34 /data/phpBB/phpbb/textformatter/s9e/factory.php:286
06-Jun-2018 09:47:34 /data/tests/text_formatter/s9e/factory_test.php:112
06-Jun-2018 09:47:34
06-Jun-2018 09:47:34 2) phpbb_textformatter_s9e_factory_test::test_unsafe_default_bbcodes
06-Jun-2018 09:47:34 Argument 1 passed to phpbb\textformatter\s9e\factory::merge_templates() must be of the type array, null given, called in /data/phpBB/phpbb/textformatter/s9e/factory.php on line 546 and defined
06-Jun-2018 09:47:34
06-Jun-2018 09:47:34 /data/phpBB/phpbb/textformatter/s9e/factory.php:640
06-Jun-2018 09:47:34 /data/phpBB/phpbb/textformatter/s9e/factory.php:546
06-Jun-2018 09:47:34 /data/phpBB/phpbb/textformatter/s9e/factory.php:286
06-Jun-2018 09:47:34 /data/phpBB/phpbb/textformatter/s9e/factory.php:385
06-Jun-2018 09:47:34 /data/phpBB/phpbb/textformatter/s9e/parser.php:47
06-Jun-2018 09:47:34 /data/tests/test_framework/phpbb_test_case_helpers.php:557
06-Jun-2018 09:47:34 /data/tests/text_formatter/s9e/factory_test.php:258
06-Jun-2018 09:47:34
06-Jun-2018 09:47:34 3) phpbb_textformatter_s9e_renderer_test::test_styles
06-Jun-2018 09:47:34 Argument 1 passed to phpbb\textformatter\s9e\factory::merge_templates() must be of the type array, null given, called in /data/phpBB/phpbb/textformatter/s9e/factory.php on line 546 and defined
06-Jun-2018 09:47:34
06-Jun-2018 09:47:34 /data/phpBB/phpbb/textformatter/s9e/factory.php:640
06-Jun-2018 09:47:34 /data/phpBB/phpbb/textformatter/s9e/factory.php:546
06-Jun-2018 09:47:34 /data/phpBB/phpbb/textformatter/s9e/factory.php:286
06-Jun-2018 09:47:34 /data/phpBB/phpbb/textformatter/s9e/factory.php:385
06-Jun-2018 09:47:34 /data/phpBB/phpbb/textformatter/s9e/parser.php:47
06-Jun-2018 09:47:34 /data/tests/test_framework/phpbb_test_case_helpers.php:557
06-Jun-2018 09:47:34 /data/tests/text_formatter/s9e/renderer_test.php:328
06-Jun-2018 09:47:34
06-Jun-2018 09:47:34 4) phpbb_textformatter_s9e_renderer_test::test_style_inheritance1
06-Jun-2018 09:47:34 Argument 1 passed to phpbb\textformatter\s9e\factory::merge_templates() must be of the type array, null given, called in /data/phpBB/phpbb/textformatter/s9e/factory.php on line 546 and defined
06-Jun-2018 09:47:34
06-Jun-2018 09:47:34 /data/phpBB/phpbb/textformatter/s9e/factory.php:640
06-Jun-2018 09:47:34 /data/phpBB/phpbb/textformatter/s9e/factory.php:546
06-Jun-2018 09:47:34 /data/phpBB/phpbb/textformatter/s9e/factory.php:286
06-Jun-2018 09:47:34 /data/phpBB/phpbb/textformatter/s9e/factory.php:385
06-Jun-2018 09:47:34 /data/phpBB/phpbb/textformatter/s9e/parser.php:47
06-Jun-2018 09:47:34 /data/tests/test_framework/phpbb_test_case_helpers.php:557
06-Jun-2018 09:47:34 /data/tests/text_formatter/s9e/renderer_test.php:351
06-Jun-2018 09:47:34
06-Jun-2018 09:47:34 5) phpbb_textformatter_s9e_renderer_test::test_style_inheritance2
06-Jun-2018 09:47:34 Argument 1 passed to phpbb\textformatter\s9e\factory::merge_templates() must be of the type array, null given, called in /data/phpBB/phpbb/textformatter/s9e/factory.php on line 546 and defined
06-Jun-2018 09:47:34
06-Jun-2018 09:47:34 /data/phpBB/phpbb/textformatter/s9e/factory.php:640
06-Jun-2018 09:47:34 /data/phpBB/phpbb/textformatter/s9e/factory.php:546
06-Jun-2018 09:47:34 /data/phpBB/phpbb/textformatter/s9e/factory.php:286
06-Jun-2018 09:47:34 /data/phpBB/phpbb/textformatter/s9e/factory.php:385
06-Jun-2018 09:47:34 /data/phpBB/phpbb/textformatter/s9e/parser.php:47
06-Jun-2018 09:47:34 /data/tests/test_framework/phpbb_test_case_helpers.php:557
06-Jun-2018 09:47:34 /data/tests/text_formatter/s9e/renderer_test.php:380
06-Jun-2018 09:47:34
06-Jun-2018 09:47:34 --
06-Jun-2018 09:47:34
06-Jun-2018 09:47:34 There was 1 warning:
06-Jun-2018 09:47:34
06-Jun-2018 09:47:34 1) phpbb_console_user_add_test::test_add_dialog
06-Jun-2018 09:47:34 PHPUnit_Framework_TestCase::getMock() is deprecated, use PHPUnit_Framework_TestCase::createMock() or PHPUnit_Framework_TestCase::getMockBuilder() instead
06-Jun-2018 09:47:34
06-Jun-2018 09:47:34 ERRORS!
06-Jun-2018 09:47:34 Tests: 9496, Assertions: 92301, Errors: 5, Warnings: 1, Skipped: 297, Incomplete: 5.
06-Jun-2018 09:47:35 Error occurred while running Task 'Run tests(10)' of type com.atlassian.bamboo.plugins.bamboo-docker-plugin:task.docker.cli.
06-Jun-2018 09:47:35 com.atlassian.bamboo.task.TaskException: Failed to execute task
06-Jun-2018 09:47:35         at com.atlassian.bamboo.plugins.docker.service.RunService.execute(RunService.java:75)
06-Jun-2018 09:47:35         at com.atlassian.bamboo.plugins.docker.tasks.cli.DockerCliTask.execute(DockerCliTask.java:70)
06-Jun-2018 09:47:35         at com.atlassian.bamboo.task.TaskExecutorImpl.lambda$executeTasks$3(TaskExecutorImpl.java:285)
06-Jun-2018 09:47:35         at com.atlassian.bamboo.task.TaskExecutorImpl.executeTaskWithPrePostActions(TaskExecutorImpl.java:224)
06-Jun-2018 09:47:35         at com.atlassian.bamboo.task.TaskExecutorImpl.executeTasks(TaskExecutorImpl.java:285)
06-Jun-2018 09:47:35         at com.atlassian.bamboo.task.TaskExecutorImpl.execute(TaskExecutorImpl.java:112)
06-Jun-2018 09:47:35         at com.atlassian.bamboo.build.pipeline.tasks.ExecuteBuildTask.call(ExecuteBuildTask.java:71)
06-Jun-2018 09:47:35         at com.atlassian.bamboo.v2.build.agent.DefaultBuildAgent.executeBuildPhase(DefaultBuildAgent.java:203)
06-Jun-2018 09:47:35         at com.atlassian.bamboo.v2.build.agent.DefaultBuildAgent.build(DefaultBuildAgent.java:175)
06-Jun-2018 09:47:35         at com.atlassian.bamboo.v2.build.agent.BuildAgentControllerImpl.lambda$waitAndPerformBuild$0(BuildAgentControllerImpl.java:122)
06-Jun-2018 09:47:35         at com.atlassian.bamboo.variable.CustomVariableContextImpl.withVariableSubstitutor(CustomVariableContextImpl.java:185)
06-Jun-2018 09:47:35         at com.atlassian.bamboo.v2.build.agent.BuildAgentControllerImpl.waitAndPerformBuild(BuildAgentControllerImpl.java:117)
06-Jun-2018 09:47:35         at com.atlassian.bamboo.v2.build.agent.DefaultBuildAgent$1.run(DefaultBuildAgent.java:126)
06-Jun-2018 09:47:35         at com.atlassian.bamboo.utils.BambooRunnables$1.run(BambooRunnables.java:48)
06-Jun-2018 09:47:35         at com.atlassian.bamboo.security.ImpersonationHelper.runWith(ImpersonationHelper.java:26)
06-Jun-2018 09:47:35         at com.atlassian.bamboo.security.ImpersonationHelper.runWithSystemAuthority(ImpersonationHelper.java:17)
06-Jun-2018 09:47:35         at com.atlassian.bamboo.security.ImpersonationHelper$1.run(ImpersonationHelper.java:41)
06-Jun-2018 09:47:35         at java.lang.Thread.run(Thread.java:748)
06-Jun-2018 09:47:35 Caused by: com.atlassian.bamboo.docker.DockerException: Error running Docker run command
06-Jun-2018 09:47:35         at com.atlassian.bamboo.docker.DockerContainerServiceImpl.run(DockerContainerServiceImpl.java:118)
06-Jun-2018 09:47:35         at sun.reflect.GeneratedMethodAccessor2553.invoke(Unknown Source)
06-Jun-2018 09:47:35         at sun.reflect.DelegatingMethodAccessorImpl.invoke(DelegatingMethodAccessorImpl.java:43)
06-Jun-2018 09:47:35         at java.lang.reflect.Method.invoke(Method.java:498)
06-Jun-2018 09:47:35         at com.atlassian.plugin.util.ContextClassLoaderSettingInvocationHandler.invoke(ContextClassLoaderSettingInvocationHandler.java:26)
06-Jun-2018 09:47:35         at com.sun.proxy.$Proxy401.run(Unknown Source)
06-Jun-2018 09:47:35         at sun.reflect.GeneratedMethodAccessor2553.invoke(Unknown Source)
06-Jun-2018 09:47:35         at sun.reflect.DelegatingMethodAccessorImpl.invoke(DelegatingMethodAccessorImpl.java:43)
06-Jun-2018 09:47:35         at java.lang.reflect.Method.invoke(Method.java:498)
06-Jun-2018 09:47:35         at org.springframework.aop.support.AopUtils.invokeJoinpointUsingReflection(AopUtils.java:302)
06-Jun-2018 09:47:35         at org.eclipse.gemini.blueprint.service.importer.support.internal.aop.ServiceInvoker.doInvoke(ServiceInvoker.java:56)
06-Jun-2018 09:47:35         at org.eclipse.gemini.blueprint.service.importer.support.internal.aop.ServiceInvoker.invoke(ServiceInvoker.java:60)
06-Jun-2018 09:47:35         at org.springframework.aop.framework.ReflectiveMethodInvocation.proceed(ReflectiveMethodInvocation.java:179)
06-Jun-2018 09:47:35         at org.springframework.aop.support.DelegatingIntroductionInterceptor.doProceed(DelegatingIntroductionInterceptor.java:133)
06-Jun-2018 09:47:35         at org.springframework.aop.support.DelegatingIntroductionInterceptor.invoke(DelegatingIntroductionInterceptor.java:121)
06-Jun-2018 09:47:35         at org.springframework.aop.framework.ReflectiveMethodInvocation.proceed(ReflectiveMethodInvocation.java:179)
06-Jun-2018 09:47:35         at org.eclipse.gemini.blueprint.service.util.internal.aop.ServiceTCCLInterceptor.invokeUnprivileged(ServiceTCCLInterceptor.java:70)
06-Jun-2018 09:47:35         at org.eclipse.gemini.blueprint.service.util.internal.aop.ServiceTCCLInterceptor.invoke(ServiceTCCLInterceptor.java:53)
06-Jun-2018 09:47:35         at org.springframework.aop.framework.ReflectiveMethodInvocation.proceed(ReflectiveMethodInvocation.java:179)
06-Jun-2018 09:47:35         at org.eclipse.gemini.blueprint.service.importer.support.LocalBundleContextAdvice.invoke(LocalBundleContextAdvice.java:57)
06-Jun-2018 09:47:35         at org.springframework.aop.framework.ReflectiveMethodInvocation.proceed(ReflectiveMethodInvocation.java:179)
06-Jun-2018 09:47:35         at org.springframework.aop.support.DelegatingIntroductionInterceptor.doProceed(DelegatingIntroductionInterceptor.java:133)
06-Jun-2018 09:47:35         at org.springframework.aop.support.DelegatingIntroductionInterceptor.invoke(DelegatingIntroductionInterceptor.java:121)
06-Jun-2018 09:47:35         at org.springframework.aop.framework.ReflectiveMethodInvocation.proceed(ReflectiveMethodInvocation.java:179)
06-Jun-2018 09:47:35         at org.springframework.aop.framework.JdkDynamicAopProxy.invoke(JdkDynamicAopProxy.java:207)
06-Jun-2018 09:47:35         at com.sun.proxy.$Proxy679.run(Unknown Source)
06-Jun-2018 09:47:35         at com.atlassian.bamboo.plugins.docker.client.DockerCmd.run(DockerCmd.java:51)
06-Jun-2018 09:47:35         at com.atlassian.bamboo.plugins.docker.service.RunService.execute(RunService.java:64)
06-Jun-2018 09:47:35         ... 17 more
06-Jun-2018 09:47:35 Caused by: com.atlassian.utils.process.ProcessException: Error executing /usr/bin/docker run --volume /home/bamboo/xml-data/build-dir/PHPBB3-PR-JOB1:/data --workdir /data --rm -u=991 -t phpbb:php-5.6 /bin/bash -c "phpBB/vendor/bin/phpunit --log-junit build/logs/phpunit.xml"
06-Jun-2018 09:47:35         at com.atlassian.bamboo.docker.DockerContainerServiceImpl.execute(DockerContainerServiceImpl.java:252)
06-Jun-2018 09:47:35         at com.atlassian.bamboo.docker.DockerContainerServiceImpl.run(DockerContainerServiceImpl.java:106)
06-Jun-2018 09:47:35         ... 44 more
06-Jun-2018 09:47:35 Starting task 'Parsing test results produced by script' of type 'com.atlassian.bamboo.plugins.testresultparser:task.testresultparser.junit'
06-Jun-2018 09:47:35 Parsing test results under /home/bamboo/xml-data/build-dir/PHPBB3-PR-JOB1...
06-Jun-2018 09:47:36 Failing task since 5 failing test cases were found.
06-Jun-2018 09:47:36 Finished task 'Parsing test results produced by script' with result: Failed
06-Jun-2018 09:47:36
Substituting variable: ${bamboo.PRnumber} with 5225
06-Jun-2018 09:47:36
Substituting variable: ${bamboo.buildResultsUrl} with https://bamboo.phpbb.com/browse/PHPBB3-PR-JOB1-8182
06-Jun-2018 09:47:36
Substituting variable: ${bamboo.buildResultsUrl} with https://bamboo.phpbb.com/browse/PHPBB3-PR-JOB1-8182
06-Jun-2018 09:47:36 Starting task 'Set result build status' of type 'com.atlassian.bamboo.plugins.scripttask:task.builder.script'
06-Jun-2018 09:47:36
Beginning to execute external process for build 'phpBB3 - Pull Requests - Build and Test Job #8182 (PHPBB3-PR-JOB1-8182)'
... running command line:
/bin/sh /home/bamboo/temp/PHPBB3-PR-JOB1-8182-ScriptBuildTask-278805541408745291.sh
... in: /home/bamboo/xml-data/build-dir/PHPBB3-PR-JOB1
... using extra environment variables:
bamboo_planRepository_1_branch=3.1.x
bamboo_planRepository_1_branchDisplayName=3.1.x
bamboo_repository_revision_number=dc8ff9da28b8ab4ad11c7ea94cca526f17c87fe5
bamboo_PRref=master
bamboo_resultsUrl=https://bamboo.phpbb.com/browse/PHPBB3-PR-JOB1-8182
bamboo_capability_system_builder_command_Git=/usr/bin/git
bamboo_repository_75956235_git_username=bantu
bamboo_build_working_directory=/home/bamboo/xml-data/build-dir/PHPBB3-PR-JOB1
bamboo_planRepository_1_name=phpBB Ascraeus
bamboo_buildKey=PHPBB3-PR-JOB1
bamboo_capability_phpbb_tests=true
bamboo_shortPlanName=Pull Requests
bamboo_capability_system_builder_command_fop=/usr/bin/fop
bamboo_capability_dbms_sqlite_2=true
bamboo_planRepository_name=phpBB Ascraeus
bamboo_PRnumber=5225
bamboo_buildNumber=8182
bamboo_repository_75956235_git_repositoryUrl=https://github.com/phpbb/phpbb.git
bamboo_capability_system_builder_phpunit_PHPUnit=/usr/bin/phpunit
bamboo_shortJobName=Build and Test Job
bamboo_buildResultsUrl=https://bamboo.phpbb.com/browse/PHPBB3-PR-JOB1-8182
bamboo_repository_75956235_branch_name=3.1.x
bamboo_planRepository_repositoryUrl=https://github.com/phpbb/phpbb.git
bamboo_agentId=131073
bamboo_planName=phpBB3 - Pull Requests
bamboo_build_commandline_com_atlassian_bamboo_plugins_scripttask_task_builder_script_7=/bin/sh /home/bamboo/temp/PHPBB3-PR-JOB1-8182-ScriptBuildTask-7127911333156034676.sh
bamboo_shortPlanKey=PR
bamboo_shortJobKey=JOB1
bamboo_capability_dbms_mysql_55=true
bamboo_capability_system_jdk_JDK_1_7_0_65=/usr/lib/jvm/java-7-openjdk-amd64
bamboo_planRepository_revision=dc8ff9da28b8ab4ad11c7ea94cca526f17c87fe5
bamboo_buildTimeStamp=2018-06-06T09:40:12.044Z
bamboo_repository_previous_revision_number=dc8ff9da28b8ab4ad11c7ea94cca526f17c87fe5
bamboo_capability_system_jdk_JDK_1_6_0_16=/usr/lib/jvm/java-6-sun-1.6.0.16
bamboo_capability_system_builder_mvn2_Maven_2=/usr/share/maven2
bamboo_planRepository_previousRevision=dc8ff9da28b8ab4ad11c7ea94cca526f17c87fe5
bamboo_build_commandline_com_atlassian_bamboo_plugins_scripttask_task_builder_script_4=/bin/sh /home/bamboo/temp/PHPBB3-PR-JOB1-8182-ScriptBuildTask-156286310472212748.sh
bamboo_repository_git_branch=3.1.x
bamboo_buildResultKey=PHPBB3-PR-JOB1-8182
bamboo_repository_branch_name=3.1.x
bamboo_buildPlanName=phpBB3 - Pull Requests - Build and Test Job
bamboo_planRepository_1_revision=dc8ff9da28b8ab4ad11c7ea94cca526f17c87fe5
bamboo_repository_name=phpBB Ascraeus
bamboo_buildFailed=true
bamboo_build_commandline_com_atlassian_bamboo_plugins_bamboo_docker_plugin_task_docker_cli_10=/usr/bin/docker run --volume /home/bamboo/xml-data/build-dir/PHPBB3-PR-JOB1:/data --workdir /data --rm -u=991 -t phpbb:php-5.6 /bin/bash -c phpBB/vendor/bin/phpunit --log-junit build/logs/phpunit.xml
bamboo_capability_system_docker_executable=/usr/bin/docker
bamboo_build_commandline_com_atlassian_bamboo_plugins_bamboo_docker_plugin_task_docker_cli_11=/usr/bin/docker run --volume /home/bamboo/xml-data/build-dir/PHPBB3-PR-JOB1:/data --workdir /data/build --rm -u=991 phpbb:php-5.6 ../phpBB/vendor/bin/phing sniff
bamboo_build_commandline_com_atlassian_bamboo_plugins_bamboo_docker_plugin_task_docker_cli_12=/usr/bin/docker run --volume /home/bamboo/xml-data/build-dir/PHPBB3-PR-JOB1:/data --workdir /data/phpBB --rm -e HOME=/home/bamboo -u=991 phpbb:php-5.6 /bin/bash -c php ../composer.phar install --dev; cd ../build; ../phpBB/vendor/bin/phing clean prepare
bamboo_planRepository_branch=3.1.x
bamboo_agentWorkingDirectory=/home/bamboo/xml-data/build-dir
bamboo_jobFailed=true
bamboo_capability_system_git_executable=/usr/bin/git
bamboo_capability_system_builder_phpunit_PHPUnit_3_4=/usr/bin/phpunit
bamboo_repository_git_username=bantu
bamboo_planRepository_1_previousRevision=dc8ff9da28b8ab4ad11c7ea94cca526f17c87fe5
bamboo_repository_75956235_revision_number=dc8ff9da28b8ab4ad11c7ea94cca526f17c87fe5
bamboo_planRepository_branchDisplayName=3.1.x
bamboo_planRepository_1_type=gitv2
bamboo_planRepository_branchName=3.1.x
bamboo_repository_75956235_previous_revision_number=dc8ff9da28b8ab4ad11c7ea94cca526f17c87fe5
bamboo_capability_system_jdk_JDK=/usr/lib/jvm/java-6-sun
bamboo_plan_storageTag=PHPBB3-PR
bamboo_hg_cache_directory=/home/bamboo/xml-data/build-dir/_hg-repositories-cache
bamboo_planRepository_1_username=bantu
bamboo_planRepository_type=gitv2
bamboo_git_cache_directory=/home/bamboo/xml-data/build-dir/_git-repositories-cache
bamboo_ManualBuildTriggerReason_userName=Build Robot
bamboo_repository_git_repositoryUrl=https://github.com/phpbb/phpbb.git
bamboo_repository_75956235_git_branch=3.1.x
bamboo_capability_system_builder_ant_Ant=/usr/share/ant
bamboo_repository_75956235_name=phpBB Ascraeus
bamboo_tmp_directory=/home/bamboo/temp
bamboo_working_directory=/home/bamboo/xml-data/build-dir/PHPBB3-PR-JOB1
bamboo_planKey=PHPBB3-PR
bamboo_capability_local=true
bamboo_planRepository_1_repositoryUrl=https://github.com/phpbb/phpbb.git
bamboo_planRepository_username=bantu
bamboo_capability_system_jdk_JDK_1_6=/usr/lib/jvm/java-6-sun
bamboo_capability_system_jdk_JDK_1_7=/usr/lib/jvm/java-7-openjdk-amd64
bamboo_planRepository_1_branchName=3.1.x
06-Jun-2018 09:47:37 From https://github.com/phpbb/phpbb
06-Jun-2018 09:47:37 * branch            refs/pull/5225/head -> FETCH_HEAD
06-Jun-2018 09:47:37   <testsuite name="" tests="6884" assertions="92298" failures="0" errors="5" time="243.996219">
06-Jun-2018 09:47:37     <testsuite name="phpBB Test Suite" tests="5311" assertions="90725" failures="0" errors="5" time="168.244667">
06-Jun-2018 09:47:37       <testsuite name="phpbb_textformatter_s9e_factory_test" file="/data/tests/text_formatter/s9e/factory_test.php" tests="12" assertions="35" failures="0" errors="2" time="4.680702">
06-Jun-2018 09:47:37       <testsuite name="phpbb_textformatter_s9e_renderer_test" file="/data/tests/text_formatter/s9e/renderer_test.php" tests="29" assertions="32" failures="0" errors="3" time="4.438743">
06-Jun-2018 09:47:37   % Total    % Received % Xferd  Average Speed   Time    Time     Time  Current
06-Jun-2018 09:47:37                                  Dload  Upload   Total   Spent    Left  Speed
06-Jun-2018 09:47:37
06-Jun-2018 09:47:37   0     0    0     0    0     0      0      0 --:--:-- --:--:-- --:--:--     0
06-Jun-2018 09:47:37 100   267  100    93  100   174    161    301 --:--:-- --:--:-- --:--:--   302
06-Jun-2018 09:47:37 Finished task 'Set result build status' with result: Success
06-Jun-2018 09:47:37 Running post build plugin 'NCover Results Collector'
06-Jun-2018 09:47:37 Running post build plugin 'Artifact Copier'
06-Jun-2018 09:47:37 Running post build plugin 'npm Cache Cleanup'
06-Jun-2018 09:47:37 Running post build plugin 'Clover Results Collector'
06-Jun-2018 09:47:37 Running post build plugin 'Docker Container Cleanup'
06-Jun-2018 09:47:38 Successfully removed working directory at '/home/bamboo/xml-data/build-dir/PHPBB3-PR-JOB1'
06-Jun-2018 09:47:38 Finalising the build...
06-Jun-2018 09:47:38 Stopping timer.
06-Jun-2018 09:47:38 Build PHPBB3-PR-JOB1-8182 completed.
06-Jun-2018 09:47:38 Running on server: post build plugin 'NCover Results Collector'
06-Jun-2018 09:47:38 Running on server: post build plugin 'Build Hanging Detection Configuration'
06-Jun-2018 09:47:38 Running on server: post build plugin 'Clover Delta Calculator'
06-Jun-2018 09:47:38 Running on server: post build plugin 'Maven Dependencies Postprocessor'
06-Jun-2018 09:47:38 All post build plugins have finished
06-Jun-2018 09:47:38 Generating build results summary...
06-Jun-2018 09:47:43 Saving build results to disk...
06-Jun-2018 09:47:44 Logging substituted variables...
06-Jun-2018 09:47:44 Indexing build results...
06-Jun-2018 09:47:44 Finished building PHPBB3-PR-JOB1-8182.
06-Jun-2018 09:47:44
Substituting variable: ${bamboo.PRnumber} with 5225