Tests pending pull requests

Build: #8193 failed

Job: Build and Test Job failed

Stages & jobs

  1. Build and Test

Build log

The build generated 647 lines of output. Download or view full build log

07-Jun-2018 21:39:48 Build phpBB3 - Pull Requests - Build and Test Job #8193 (PHPBB3-PR-JOB1-8193) started building on agent Default Agent
07-Jun-2018 21:39:48
07-Jun-2018 21:39:48 Build working directory is /home/bamboo/xml-data/build-dir/PHPBB3-PR-JOB1
07-Jun-2018 21:39:48 Executing build phpBB3 - Pull Requests - Build and Test Job #8193 (PHPBB3-PR-JOB1-8193)
07-Jun-2018 21:39:48 Starting task 'Checkout develop branch' of type 'com.atlassian.bamboo.plugins.vcs:task.vcs.checkout'
07-Jun-2018 21:39:48 Build always requires a clean checkout
07-Jun-2018 21:39:48 Cleaning build directory '/home/bamboo/xml-data/build-dir/PHPBB3-PR-JOB1'
07-Jun-2018 21:39:48 Checking out into /home/bamboo/xml-data/build-dir/PHPBB3-PR-JOB1
07-Jun-2018 21:39:48 Updating source code to revision: dc8ff9da28b8ab4ad11c7ea94cca526f17c87fe5
07-Jun-2018 21:39:48 Fetching 'refs/heads/3.1.x' from 'https://github.com/phpbb/phpbb.git'.
07-Jun-2018 21:39:49 Checking out revision dc8ff9da28b8ab4ad11c7ea94cca526f17c87fe5.
07-Jun-2018 21:39:49 Creating local git repository in '/home/bamboo/xml-data/build-dir/PHPBB3-PR-JOB1/.git'.
07-Jun-2018 21:39:49 Cloning into '/home/bamboo/xml-data/build-dir/PHPBB3-PR-JOB1'...
07-Jun-2018 21:39:49 done.
07-Jun-2018 21:40:00 Branch 3.1.x set up to track remote branch 3.1.x from origin.
07-Jun-2018 21:40:00 Switched to a new branch '3.1.x'
07-Jun-2018 21:40:00 Updated source code to revision: dc8ff9da28b8ab4ad11c7ea94cca526f17c87fe5
07-Jun-2018 21:40:00 Finished task 'Checkout develop branch' with result: Success
07-Jun-2018 21:40:00 Running pre-build action: VCS Version Collector
07-Jun-2018 21:40:00
Substituting variable: ${bamboo.PRnumber} with 4933
07-Jun-2018 21:40:00
Substituting variable: ${bamboo.buildResultsUrl} with https://bamboo.phpbb.com/browse/PHPBB3-PR-JOB1-8193
07-Jun-2018 21:40:00 Starting task 'Set pending build status' of type 'com.atlassian.bamboo.plugins.scripttask:task.builder.script'
07-Jun-2018 21:40:00
Beginning to execute external process for build 'phpBB3 - Pull Requests - Build and Test Job #8193 (PHPBB3-PR-JOB1-8193)'
... running command line:
/bin/sh /home/bamboo/temp/PHPBB3-PR-JOB1-8193-ScriptBuildTask-6376562063448389126.sh
... in: /home/bamboo/xml-data/build-dir/PHPBB3-PR-JOB1
... using extra environment variables:
bamboo_planRepository_1_branch=3.1.x
bamboo_planRepository_1_branchDisplayName=3.1.x
bamboo_repository_revision_number=dc8ff9da28b8ab4ad11c7ea94cca526f17c87fe5
bamboo_PRref=master
bamboo_resultsUrl=https://bamboo.phpbb.com/browse/PHPBB3-PR-JOB1-8193
bamboo_capability_system_builder_command_Git=/usr/bin/git
bamboo_repository_75956235_git_username=bantu
bamboo_build_working_directory=/home/bamboo/xml-data/build-dir/PHPBB3-PR-JOB1
bamboo_planRepository_1_name=phpBB Ascraeus
bamboo_buildKey=PHPBB3-PR-JOB1
bamboo_capability_phpbb_tests=true
bamboo_shortPlanName=Pull Requests
bamboo_capability_system_builder_command_fop=/usr/bin/fop
bamboo_capability_dbms_sqlite_2=true
bamboo_planRepository_name=phpBB Ascraeus
bamboo_PRnumber=4933
bamboo_buildNumber=8193
bamboo_repository_75956235_git_repositoryUrl=https://github.com/phpbb/phpbb.git
bamboo_capability_system_builder_phpunit_PHPUnit=/usr/bin/phpunit
bamboo_shortJobName=Build and Test Job
bamboo_buildResultsUrl=https://bamboo.phpbb.com/browse/PHPBB3-PR-JOB1-8193
bamboo_repository_75956235_branch_name=3.1.x
bamboo_planRepository_repositoryUrl=https://github.com/phpbb/phpbb.git
bamboo_agentId=131073
bamboo_planName=phpBB3 - Pull Requests
bamboo_shortPlanKey=PR
bamboo_shortJobKey=JOB1
bamboo_capability_dbms_mysql_55=true
bamboo_capability_system_jdk_JDK_1_7_0_65=/usr/lib/jvm/java-7-openjdk-amd64
bamboo_planRepository_revision=dc8ff9da28b8ab4ad11c7ea94cca526f17c87fe5
bamboo_buildTimeStamp=2018-06-07T21:39:48.353Z
bamboo_repository_previous_revision_number=dc8ff9da28b8ab4ad11c7ea94cca526f17c87fe5
bamboo_capability_system_jdk_JDK_1_6_0_16=/usr/lib/jvm/java-6-sun-1.6.0.16
bamboo_capability_system_builder_mvn2_Maven_2=/usr/share/maven2
bamboo_planRepository_previousRevision=dc8ff9da28b8ab4ad11c7ea94cca526f17c87fe5
bamboo_repository_git_branch=3.1.x
bamboo_buildResultKey=PHPBB3-PR-JOB1-8193
bamboo_repository_branch_name=3.1.x
bamboo_buildPlanName=phpBB3 - Pull Requests - Build and Test Job
bamboo_planRepository_1_revision=dc8ff9da28b8ab4ad11c7ea94cca526f17c87fe5
bamboo_repository_name=phpBB Ascraeus
bamboo_buildFailed=false
bamboo_capability_system_docker_executable=/usr/bin/docker
bamboo_planRepository_branch=3.1.x
bamboo_agentWorkingDirectory=/home/bamboo/xml-data/build-dir
bamboo_capability_system_git_executable=/usr/bin/git
bamboo_capability_system_builder_phpunit_PHPUnit_3_4=/usr/bin/phpunit
bamboo_repository_git_username=bantu
bamboo_planRepository_1_previousRevision=dc8ff9da28b8ab4ad11c7ea94cca526f17c87fe5
bamboo_repository_75956235_revision_number=dc8ff9da28b8ab4ad11c7ea94cca526f17c87fe5
bamboo_planRepository_branchDisplayName=3.1.x
bamboo_planRepository_1_type=gitv2
bamboo_planRepository_branchName=3.1.x
bamboo_repository_75956235_previous_revision_number=dc8ff9da28b8ab4ad11c7ea94cca526f17c87fe5
bamboo_capability_system_jdk_JDK=/usr/lib/jvm/java-6-sun
bamboo_plan_storageTag=PHPBB3-PR
bamboo_hg_cache_directory=/home/bamboo/xml-data/build-dir/_hg-repositories-cache
bamboo_planRepository_1_username=bantu
bamboo_planRepository_type=gitv2
bamboo_git_cache_directory=/home/bamboo/xml-data/build-dir/_git-repositories-cache
bamboo_ManualBuildTriggerReason_userName=Build Robot
bamboo_repository_git_repositoryUrl=https://github.com/phpbb/phpbb.git
bamboo_repository_75956235_git_branch=3.1.x
bamboo_capability_system_builder_ant_Ant=/usr/share/ant
bamboo_repository_75956235_name=phpBB Ascraeus
bamboo_tmp_directory=/home/bamboo/temp
bamboo_working_directory=/home/bamboo/xml-data/build-dir/PHPBB3-PR-JOB1
bamboo_planKey=PHPBB3-PR
bamboo_capability_local=true
bamboo_planRepository_1_repositoryUrl=https://github.com/phpbb/phpbb.git
bamboo_planRepository_username=bantu
bamboo_capability_system_jdk_JDK_1_6=/usr/lib/jvm/java-6-sun
bamboo_capability_system_jdk_JDK_1_7=/usr/lib/jvm/java-7-openjdk-amd64
bamboo_planRepository_1_branchName=3.1.x
07-Jun-2018 21:40:03 From https://github.com/phpbb/phpbb
07-Jun-2018 21:40:03 * branch            refs/pull/4933/head -> FETCH_HEAD
07-Jun-2018 21:40:03   % Total    % Received % Xferd  Average Speed   Time    Time     Time  Current
07-Jun-2018 21:40:03                                  Dload  Upload   Total   Spent    Left  Speed
07-Jun-2018 21:40:03
07-Jun-2018 21:40:04   0     0    0     0    0     0      0      0 --:--:-- --:--:-- --:--:--     0
07-Jun-2018 21:40:04   0     0    0     0    0     0      0      0 --:--:-- --:--:-- --:--:--     0
07-Jun-2018 21:40:04 100   275  100    93  100   182    177    346 --:--:-- --:--:-- --:--:--   347
07-Jun-2018 21:40:04 Finished task 'Set pending build status' with result: Success
07-Jun-2018 21:40:04
Substituting variable: ${bamboo.PRnumber} with 4933
07-Jun-2018 21:40:04 Starting task 'Fetch PR' of type 'com.atlassian.bamboo.plugins.scripttask:task.builder.script'
07-Jun-2018 21:40:04
Beginning to execute external process for build 'phpBB3 - Pull Requests - Build and Test Job #8193 (PHPBB3-PR-JOB1-8193)'
... running command line:
/bin/sh /home/bamboo/temp/PHPBB3-PR-JOB1-8193-ScriptBuildTask-6194527675238120582.sh
... in: /home/bamboo/xml-data/build-dir/PHPBB3-PR-JOB1
... using extra environment variables:
bamboo_planRepository_1_branch=3.1.x
bamboo_planRepository_1_branchDisplayName=3.1.x
bamboo_repository_revision_number=dc8ff9da28b8ab4ad11c7ea94cca526f17c87fe5
bamboo_PRref=master
bamboo_resultsUrl=https://bamboo.phpbb.com/browse/PHPBB3-PR-JOB1-8193
bamboo_capability_system_builder_command_Git=/usr/bin/git
bamboo_repository_75956235_git_username=bantu
bamboo_build_working_directory=/home/bamboo/xml-data/build-dir/PHPBB3-PR-JOB1
bamboo_planRepository_1_name=phpBB Ascraeus
bamboo_buildKey=PHPBB3-PR-JOB1
bamboo_capability_phpbb_tests=true
bamboo_shortPlanName=Pull Requests
bamboo_capability_system_builder_command_fop=/usr/bin/fop
bamboo_capability_dbms_sqlite_2=true
bamboo_planRepository_name=phpBB Ascraeus
bamboo_PRnumber=4933
bamboo_buildNumber=8193
bamboo_repository_75956235_git_repositoryUrl=https://github.com/phpbb/phpbb.git
bamboo_capability_system_builder_phpunit_PHPUnit=/usr/bin/phpunit
bamboo_shortJobName=Build and Test Job
bamboo_buildResultsUrl=https://bamboo.phpbb.com/browse/PHPBB3-PR-JOB1-8193
bamboo_repository_75956235_branch_name=3.1.x
bamboo_planRepository_repositoryUrl=https://github.com/phpbb/phpbb.git
bamboo_agentId=131073
bamboo_planName=phpBB3 - Pull Requests
bamboo_build_commandline_com_atlassian_bamboo_plugins_scripttask_task_builder_script_7=/bin/sh /home/bamboo/temp/PHPBB3-PR-JOB1-8193-ScriptBuildTask-6376562063448389126.sh
bamboo_shortPlanKey=PR
bamboo_shortJobKey=JOB1
bamboo_capability_dbms_mysql_55=true
bamboo_capability_system_jdk_JDK_1_7_0_65=/usr/lib/jvm/java-7-openjdk-amd64
bamboo_planRepository_revision=dc8ff9da28b8ab4ad11c7ea94cca526f17c87fe5
bamboo_buildTimeStamp=2018-06-07T21:39:48.353Z
bamboo_repository_previous_revision_number=dc8ff9da28b8ab4ad11c7ea94cca526f17c87fe5
bamboo_capability_system_jdk_JDK_1_6_0_16=/usr/lib/jvm/java-6-sun-1.6.0.16
bamboo_capability_system_builder_mvn2_Maven_2=/usr/share/maven2
bamboo_planRepository_previousRevision=dc8ff9da28b8ab4ad11c7ea94cca526f17c87fe5
bamboo_repository_git_branch=3.1.x
bamboo_buildResultKey=PHPBB3-PR-JOB1-8193
bamboo_repository_branch_name=3.1.x
bamboo_buildPlanName=phpBB3 - Pull Requests - Build and Test Job
bamboo_planRepository_1_revision=dc8ff9da28b8ab4ad11c7ea94cca526f17c87fe5
bamboo_repository_name=phpBB Ascraeus
bamboo_buildFailed=false
bamboo_capability_system_docker_executable=/usr/bin/docker
bamboo_planRepository_branch=3.1.x
bamboo_agentWorkingDirectory=/home/bamboo/xml-data/build-dir
bamboo_capability_system_git_executable=/usr/bin/git
bamboo_capability_system_builder_phpunit_PHPUnit_3_4=/usr/bin/phpunit
bamboo_repository_git_username=bantu
bamboo_planRepository_1_previousRevision=dc8ff9da28b8ab4ad11c7ea94cca526f17c87fe5
bamboo_repository_75956235_revision_number=dc8ff9da28b8ab4ad11c7ea94cca526f17c87fe5
bamboo_planRepository_branchDisplayName=3.1.x
bamboo_planRepository_1_type=gitv2
bamboo_planRepository_branchName=3.1.x
bamboo_repository_75956235_previous_revision_number=dc8ff9da28b8ab4ad11c7ea94cca526f17c87fe5
bamboo_capability_system_jdk_JDK=/usr/lib/jvm/java-6-sun
bamboo_plan_storageTag=PHPBB3-PR
bamboo_hg_cache_directory=/home/bamboo/xml-data/build-dir/_hg-repositories-cache
bamboo_planRepository_1_username=bantu
bamboo_planRepository_type=gitv2
bamboo_git_cache_directory=/home/bamboo/xml-data/build-dir/_git-repositories-cache
bamboo_ManualBuildTriggerReason_userName=Build Robot
bamboo_repository_git_repositoryUrl=https://github.com/phpbb/phpbb.git
bamboo_repository_75956235_git_branch=3.1.x
bamboo_capability_system_builder_ant_Ant=/usr/share/ant
bamboo_repository_75956235_name=phpBB Ascraeus
bamboo_tmp_directory=/home/bamboo/temp
bamboo_working_directory=/home/bamboo/xml-data/build-dir/PHPBB3-PR-JOB1
bamboo_planKey=PHPBB3-PR
bamboo_capability_local=true
bamboo_planRepository_1_repositoryUrl=https://github.com/phpbb/phpbb.git
bamboo_planRepository_username=bantu
bamboo_capability_system_jdk_JDK_1_6=/usr/lib/jvm/java-6-sun
bamboo_capability_system_jdk_JDK_1_7=/usr/lib/jvm/java-7-openjdk-amd64
bamboo_planRepository_1_branchName=3.1.x
07-Jun-2018 21:40:07 From https://github.com/phpbb/phpbb
07-Jun-2018 21:40:07 * branch            refs/pull/4933/merge -> FETCH_HEAD
07-Jun-2018 21:40:08 Note: checking out 'FETCH_HEAD'.
07-Jun-2018 21:40:08
07-Jun-2018 21:40:08 You are in 'detached HEAD' state. You can look around, make experimental
07-Jun-2018 21:40:08 changes and commit them, and you can discard any commits you make in this
07-Jun-2018 21:40:08 state without impacting any branches by performing another checkout.
07-Jun-2018 21:40:08
07-Jun-2018 21:40:08 If you want to create a new branch to retain commits you create, you may
07-Jun-2018 21:40:08 do so (now or later) by using -b with the checkout command again. Example:
07-Jun-2018 21:40:08
07-Jun-2018 21:40:08   git checkout -b new_branch_name
07-Jun-2018 21:40:08
07-Jun-2018 21:40:08 HEAD is now at d7bc92d... Merge 0bb0dce82d8f5f22eb7a648965e4dfe3be389806 into d1dd9d383e58e48933a294ae1455fef1d4488fba
07-Jun-2018 21:40:08 Finished task 'Fetch PR' with result: Success
07-Jun-2018 21:40:08 Skipping execution of task 'Prepare directory' as it is disabled
07-Jun-2018 21:40:08
Substituting variable: ${bamboo.working.directory} with /home/bamboo/xml-data/build-dir/PHPBB3-PR-JOB1
07-Jun-2018 21:40:08 Starting task 'Prepare directory' of type 'com.atlassian.bamboo.plugins.bamboo-docker-plugin:task.docker.cli'
07-Jun-2018 21:40:08 Running image name (phpbb:php-5.6)
07-Jun-2018 21:40:08
Beginning to execute external process for build 'phpBB3 - Pull Requests - Build and Test Job #8193 (PHPBB3-PR-JOB1-8193)'
... running command line:
/usr/bin/docker run --volume /home/bamboo/xml-data/build-dir/PHPBB3-PR-JOB1:/data --workdir /data/phpBB --rm -e HOME=/home/bamboo -u=991 phpbb:php-5.6 /bin/bash -c php ../composer.phar install --dev; cd ../build; ../phpBB/vendor/bin/phing clean prepare
... in: /home/bamboo/xml-data/build-dir/PHPBB3-PR-JOB1
... using extra environment variables:
bamboo_planRepository_1_branch=3.1.x
bamboo_planRepository_1_branchDisplayName=3.1.x
bamboo_repository_revision_number=dc8ff9da28b8ab4ad11c7ea94cca526f17c87fe5
bamboo_PRref=master
bamboo_resultsUrl=https://bamboo.phpbb.com/browse/PHPBB3-PR-JOB1-8193
bamboo_capability_system_builder_command_Git=/usr/bin/git
bamboo_repository_75956235_git_username=bantu
bamboo_build_working_directory=/home/bamboo/xml-data/build-dir/PHPBB3-PR-JOB1
bamboo_planRepository_1_name=phpBB Ascraeus
bamboo_buildKey=PHPBB3-PR-JOB1
bamboo_capability_phpbb_tests=true
bamboo_shortPlanName=Pull Requests
bamboo_capability_system_builder_command_fop=/usr/bin/fop
bamboo_capability_dbms_sqlite_2=true
bamboo_planRepository_name=phpBB Ascraeus
bamboo_PRnumber=4933
bamboo_buildNumber=8193
bamboo_repository_75956235_git_repositoryUrl=https://github.com/phpbb/phpbb.git
bamboo_capability_system_builder_phpunit_PHPUnit=/usr/bin/phpunit
bamboo_shortJobName=Build and Test Job
bamboo_buildResultsUrl=https://bamboo.phpbb.com/browse/PHPBB3-PR-JOB1-8193
bamboo_repository_75956235_branch_name=3.1.x
bamboo_planRepository_repositoryUrl=https://github.com/phpbb/phpbb.git
bamboo_agentId=131073
bamboo_planName=phpBB3 - Pull Requests
bamboo_build_commandline_com_atlassian_bamboo_plugins_scripttask_task_builder_script_7=/bin/sh /home/bamboo/temp/PHPBB3-PR-JOB1-8193-ScriptBuildTask-6376562063448389126.sh
bamboo_shortPlanKey=PR
bamboo_shortJobKey=JOB1
bamboo_capability_dbms_mysql_55=true
bamboo_capability_system_jdk_JDK_1_7_0_65=/usr/lib/jvm/java-7-openjdk-amd64
bamboo_planRepository_revision=dc8ff9da28b8ab4ad11c7ea94cca526f17c87fe5
bamboo_buildTimeStamp=2018-06-07T21:39:48.353Z
bamboo_repository_previous_revision_number=dc8ff9da28b8ab4ad11c7ea94cca526f17c87fe5
bamboo_capability_system_jdk_JDK_1_6_0_16=/usr/lib/jvm/java-6-sun-1.6.0.16
bamboo_capability_system_builder_mvn2_Maven_2=/usr/share/maven2
bamboo_planRepository_previousRevision=dc8ff9da28b8ab4ad11c7ea94cca526f17c87fe5
bamboo_build_commandline_com_atlassian_bamboo_plugins_scripttask_task_builder_script_4=/bin/sh /home/bamboo/temp/PHPBB3-PR-JOB1-8193-ScriptBuildTask-6194527675238120582.sh
bamboo_repository_git_branch=3.1.x
bamboo_buildResultKey=PHPBB3-PR-JOB1-8193
bamboo_repository_branch_name=3.1.x
bamboo_buildPlanName=phpBB3 - Pull Requests - Build and Test Job
bamboo_planRepository_1_revision=dc8ff9da28b8ab4ad11c7ea94cca526f17c87fe5
bamboo_repository_name=phpBB Ascraeus
bamboo_buildFailed=false
bamboo_capability_system_docker_executable=/usr/bin/docker
bamboo_planRepository_branch=3.1.x
bamboo_agentWorkingDirectory=/home/bamboo/xml-data/build-dir
bamboo_capability_system_git_executable=/usr/bin/git
bamboo_capability_system_builder_phpunit_PHPUnit_3_4=/usr/bin/phpunit
bamboo_repository_git_username=bantu
bamboo_planRepository_1_previousRevision=dc8ff9da28b8ab4ad11c7ea94cca526f17c87fe5
bamboo_repository_75956235_revision_number=dc8ff9da28b8ab4ad11c7ea94cca526f17c87fe5
bamboo_planRepository_branchDisplayName=3.1.x
bamboo_planRepository_1_type=gitv2
bamboo_planRepository_branchName=3.1.x
bamboo_repository_75956235_previous_revision_number=dc8ff9da28b8ab4ad11c7ea94cca526f17c87fe5
bamboo_capability_system_jdk_JDK=/usr/lib/jvm/java-6-sun
bamboo_plan_storageTag=PHPBB3-PR
bamboo_hg_cache_directory=/home/bamboo/xml-data/build-dir/_hg-repositories-cache
bamboo_planRepository_1_username=bantu
bamboo_planRepository_type=gitv2
bamboo_git_cache_directory=/home/bamboo/xml-data/build-dir/_git-repositories-cache
bamboo_ManualBuildTriggerReason_userName=Build Robot
bamboo_repository_git_repositoryUrl=https://github.com/phpbb/phpbb.git
bamboo_repository_75956235_git_branch=3.1.x
bamboo_capability_system_builder_ant_Ant=/usr/share/ant
bamboo_repository_75956235_name=phpBB Ascraeus
bamboo_tmp_directory=/home/bamboo/temp
bamboo_working_directory=/home/bamboo/xml-data/build-dir/PHPBB3-PR-JOB1
bamboo_planKey=PHPBB3-PR
bamboo_capability_local=true
bamboo_planRepository_1_repositoryUrl=https://github.com/phpbb/phpbb.git
bamboo_planRepository_username=bantu
bamboo_capability_system_jdk_JDK_1_6=/usr/lib/jvm/java-6-sun
bamboo_capability_system_jdk_JDK_1_7=/usr/lib/jvm/java-7-openjdk-amd64
bamboo_planRepository_1_branchName=3.1.x
07-Jun-2018 21:40:09 Cannot create cache directory /home/bamboo/.composer/cache/repo/https---packagist.org/, or directory is not writable. Proceeding without cache
07-Jun-2018 21:40:09 Cannot create cache directory /home/bamboo/.composer/cache/files/, or directory is not writable. Proceeding without cache
07-Jun-2018 21:40:09 You are using the deprecated option "dev". Dev packages are installed by default now.
07-Jun-2018 21:40:09 Loading composer repositories with package information
07-Jun-2018 21:40:09 Installing dependencies (including require-dev) from lock file
07-Jun-2018 21:40:09 Package operations: 75 installs, 0 updates, 0 removals
07-Jun-2018 21:40:10   - Installing composer/installers (v1.5.0): Downloading (connecting...)Downloading (0%)           Downloading (5%)Downloading (20%)Downloading (25%)Downloading (30%)Downloading (45%)Downloading (50%)Downloading (55%)Downloading (75%)Downloading (80%)Downloading (85%)Downloading (100%)
07-Jun-2018 21:40:11   - Installing bantu/ini-get-wrapper (v1.0.1): Downloading (connecting...)Downloading (0%)           Downloading (100%)
07-Jun-2018 21:40:11   - Installing symfony/process (v3.4.3): Downloading (connecting...)Downloading (0%)           Downloading (5%)Downloading (30%)Downloading (35%)Downloading (70%)Downloading (75%)Downloading (80%)Downloading (100%)
07-Jun-2018 21:40:13   - Installing symfony/finder (v3.4.3): Downloading (connecting...)Downloading (0%)           Downloading (5%)Downloading (10%)Downloading (60%)Downloading (65%)Downloading (70%)Downloading (75%)Downloading (100%)
07-Jun-2018 21:40:13   - Installing symfony/filesystem (v3.4.3): Downloading (connecting...)Downloading (0%)           Downloading (5%)Downloading (100%)
07-Jun-2018 21:40:14   - Installing symfony/polyfill-mbstring (v1.7.0): Downloading (connecting...)Downloading (0%)           Downloading (20%)Downloading (40%)Downloading (100%)
07-Jun-2018 21:40:15   - Installing psr/log (1.0.2): Downloading (connecting...)Downloading (0%)           Downloading (15%)Downloading (100%)
07-Jun-2018 21:40:16   - Installing symfony/debug (v3.4.3): Downloading (connecting...)Downloading (0%)           Downloading (5%)Downloading (15%)Downloading (20%)Downloading (30%)Downloading (35%)Downloading (50%)Downloading (55%)Downloading (70%)Downloading (75%)Downloading (90%)Downloading (95%)Downloading (100%)
07-Jun-2018 21:40:16   - Installing symfony/console (v3.4.3): Downloading (connecting...)Downloading (100%)         
07-Jun-2018 21:40:17   - Installing seld/phar-utils (1.0.1): Downloading (connecting...)Downloading (0%)           Downloading (30%)Downloading (60%)Downloading (90%)Downloading (100%)
07-Jun-2018 21:40:18   - Installing seld/jsonlint (1.7.0): Downloading (connecting...)Downloading (0%)           Downloading (15%)Downloading (60%)Downloading (75%)Downloading (90%)Downloading (100%)
07-Jun-2018 21:40:19   - Installing seld/cli-prompt (1.0.3): Downloading (connecting...)Downloading (0%)           Downloading (15%)Downloading (30%)Downloading (100%)
07-Jun-2018 21:40:20   - Installing justinrainbow/json-schema (5.2.6): Downloading (connecting...)Downloading (0%)           Downloading (15%)Downloading (20%)Downloading (35%)Downloading (40%)Downloading (45%)Downloading (50%)Downloading (65%)Downloading (70%)Downloading (85%)Downloading (90%)Downloading (95%)Downloading (100%)
07-Jun-2018 21:40:20   - Installing composer/spdx-licenses (1.2.0): Downloading (connecting...)Downloading (0%)           Downloading (65%)Downloading (100%)
07-Jun-2018 21:40:21   - Installing composer/semver (1.4.2): Downloading (connecting...)Downloading (0%)           Downloading (35%)Downloading (75%)Downloading (100%)
07-Jun-2018 21:40:22   - Installing composer/ca-bundle (1.1.0): Downloading (connecting...)Downloading (0%)           Downloading (5%)Downloading (10%)Downloading (15%)Downloading (20%)Downloading (25%)Downloading (30%)Downloading (35%)Downloading (40%)Downloading (45%)Downloading (50%)Downloading (55%)Downloading (60%)Downloading (65%)Downloading (70%)Downloading (75%)Downloading (80%)Downloading (85%)Downloading (90%)Downloading (95%)Downloading (100%)
07-Jun-2018 21:40:23   - Installing composer/composer (1.6.2): Downloading (connecting...)Downloading (0%)           Downloading (5%)Downloading (10%)Downloading (15%)Downloading (20%)Downloading (25%)Downloading (30%)Downloading (35%)Downloading (40%)Downloading (45%)Downloading (50%)Downloading (55%)Downloading (60%)Downloading (65%)Downloading (70%)Downloading (75%)Downloading (80%)Downloading (85%)Downloading (90%)Downloading (95%)Downloading (100%)
07-Jun-2018 21:40:24   - Installing google/recaptcha (1.1.3): Downloading (connecting...)Downloading (0%)           Downloading (25%)Downloading (30%)Downloading (55%)Downloading (80%)Downloading (95%)Downloading (100%)
07-Jun-2018 21:40:25   - Installing guzzlehttp/promises (v1.3.1): Downloading (connecting...)Downloading (0%)           Downloading (30%)Downloading (60%)Downloading (80%)Downloading (100%)
07-Jun-2018 21:40:26   - Installing psr/http-message (1.0.1): Downloading (connecting...)Downloading (0%)           Downloading (50%)Downloading (75%)Downloading (100%)
07-Jun-2018 21:40:26   - Installing guzzlehttp/psr7 (1.4.2): Downloading (connecting...)Downloading (0%)           Downloading (5%)Downloading (10%)Downloading (15%)Downloading (20%)Downloading (50%)Downloading (55%)Downloading (60%)Downloading (65%)Downloading (85%)Downloading (90%)Downloading (95%)Downloading (100%)
07-Jun-2018 21:40:27   - Installing lusitanian/oauth (v0.8.10): Downloading (connecting...)Downloading (0%)           Downloading (5%)Downloading (10%)Downloading (15%)Downloading (20%)Downloading (25%)Downloading (35%)Downloading (40%)Downloading (50%)Downloading (55%)Downloading (60%)Downloading (65%)Downloading (70%)Downloading (80%)Downloading (85%)Downloading (90%)Downloading (95%)Downloading (100%)
07-Jun-2018 21:40:28   - Installing marc1706/fast-image-size (v1.1.4): Downloading (connecting...)Downloading (0%)           Downloading (45%)Downloading (90%)Downloading (100%)
07-Jun-2018 21:40:29   - Installing patchwork/utf8 (v1.3.1): Downloading (connecting...)Downloading (100%)         
07-Jun-2018 21:40:30   - Installing psr/container (1.0.0): Downloading (connecting...)Downloading (0%)           Downloading (75%)Downloading (100%)
07-Jun-2018 21:40:31   - Installing s9e/text-formatter (0.13.1): Downloading (connecting...)Downloading (0%)           Downloading (5%)Downloading (10%)Downloading (15%)Downloading (20%)Downloading (25%)Downloading (30%)Downloading (35%)Downloading (40%)Downloading (45%)Downloading (50%)Downloading (55%)Downloading (60%)Downloading (65%)Downloading (70%)Downloading (75%)Downloading (80%)Downloading (85%)Downloading (90%)Downloading (95%)Downloading (100%)
07-Jun-2018 21:40:32   - Installing symfony/config (v3.4.3): Downloading (connecting...)Downloading (100%)         
07-Jun-2018 21:40:33   - Installing paragonie/random_compat (v1.4.2): Downloading (connecting...)Downloading (0%)           Downloading (10%)Downloading (35%)Downloading (45%)Downloading (50%)Downloading (60%)Downloading (70%)Downloading (80%)Downloading (100%)
07-Jun-2018 21:40:34   - Installing symfony/polyfill-php70 (v1.6.0): Downloading (connecting...)Downloading (0%)           Downloading (85%)Downloading (100%)
07-Jun-2018 21:40:34   - Installing symfony/http-foundation (v3.4.3): Downloading (connecting...)Downloading (100%)         
07-Jun-2018 21:40:35   - Installing symfony/event-dispatcher (v3.4.3): Downloading (connecting...)Downloading (0%)           Downloading (5%)Downloading (45%)Downloading (50%)Downloading (100%)
07-Jun-2018 21:40:36   - Installing symfony/http-kernel (v3.4.3): Downloading (connecting...)Downloading (0%)           Downloading (5%)Downloading (10%)Downloading (15%)Downloading (20%)Downloading (25%)Downloading (30%)Downloading (35%)Downloading (40%)Downloading (45%)Downloading (50%)Downloading (55%)Downloading (60%)Downloading (65%)Downloading (70%)Downloading (75%)Downloading (80%)Downloading (85%)Downloading (90%)Downloading (95%)Downloading (100%)
07-Jun-2018 21:40:37   - Installing symfony/dependency-injection (v3.4.3): Downloading (connecting...)Downloading (100%)         
07-Jun-2018 21:40:38   - Installing zendframework/zend-eventmanager (3.2.0): Downloading (connecting...)Downloading (0%)           Downloading (25%)Downloading (45%)Downloading (70%)Downloading (80%)Downloading (100%)
07-Jun-2018 21:40:39   - Installing zendframework/zend-code (2.6.3): Downloading (connecting...)Downloading (0%)           Downloading (5%)Downloading (10%)Downloading (15%)Downloading (20%)Downloading (25%)Downloading (30%)Downloading (35%)Downloading (40%)Downloading (45%)Downloading (50%)Downloading (55%)Downloading (65%)Downloading (75%)Downloading (80%)Downloading (85%)Downloading (90%)Downloading (95%)Downloading (100%)
07-Jun-2018 21:40:40   - Installing ocramius/proxy-manager (1.0.2): Downloading (connecting...)Downloading (0%)           Downloading (5%)Downloading (10%)Downloading (15%)Downloading (20%)Downloading (25%)Downloading (30%)Downloading (35%)Downloading (40%)Downloading (45%)Downloading (50%)Downloading (55%)Downloading (60%)Downloading (65%)Downloading (70%)Downloading (75%)Downloading (80%)Downloading (85%)Downloading (90%)Downloading (95%)Downloading (100%)
07-Jun-2018 21:40:41   - Installing symfony/proxy-manager-bridge (v3.4.3): Downloading (connecting...)Downloading (0%)           Downloading (60%)Downloading (95%)Downloading (100%)
07-Jun-2018 21:40:42   - Installing symfony/routing (v3.4.3): Downloading (connecting...)Downloading (0%)           Downloading (5%)Downloading (10%)Downloading (15%)Downloading (20%)Downloading (25%)Downloading (30%)Downloading (35%)Downloading (40%)Downloading (45%)Downloading (50%)Downloading (55%)Downloading (60%)Downloading (65%)Downloading (70%)Downloading (75%)Downloading (80%)Downloading (85%)Downloading (90%)Downloading (95%)Downloading (100%)
07-Jun-2018 21:40:43   - Installing twig/twig (v1.35.0): Downloading (connecting...)Downloading (0%)           Downloading (5%)Downloading (10%)Downloading (15%)Downloading (20%)Downloading (25%)Downloading (30%)Downloading (35%)Downloading (40%)Downloading (45%)Downloading (50%)Downloading (55%)Downloading (60%)Downloading (65%)Downloading (70%)Downloading (75%)Downloading (80%)Downloading (85%)Downloading (90%)Downloading (95%)Downloading (100%)
07-Jun-2018 21:40:45   - Installing symfony/twig-bridge (v3.4.3): Downloading (connecting...)Downloading (0%)           Downloading (5%)Downloading (10%)Downloading (20%)Downloading (25%)Downloading (30%)Downloading (40%)Downloading (45%)Downloading (50%)Downloading (55%)Downloading (65%)Downloading (70%)Downloading (75%)Downloading (80%)Downloading (85%)Downloading (90%)Downloading (95%)Downloading (100%)
07-Jun-2018 21:40:45   - Installing symfony/dom-crawler (v3.4.3): Downloading (connecting...)Downloading (0%)           Downloading (5%)Downloading (25%)Downloading (30%)Downloading (45%)Downloading (50%)Downloading (55%)Downloading (90%)Downloading (95%)Downloading (100%)
07-Jun-2018 21:40:46   - Installing symfony/css-selector (v3.4.3): Downloading (connecting...)Downloading (0%)           Downloading (5%)Downloading (10%)Downloading (15%)Downloading (20%)Downloading (25%)Downloading (30%)Downloading (45%)Downloading (50%)Downloading (55%)Downloading (60%)Downloading (65%)Downloading (70%)Downloading (75%)Downloading (100%)
07-Jun-2018 21:40:47   - Installing symfony/browser-kit (v3.4.3): Downloading (connecting...)Downloading (0%)           Downloading (5%)Downloading (70%)Downloading (100%)
07-Jun-2018 21:40:48   - Installing guzzlehttp/guzzle (6.3.0): Downloading (connecting...)Downloading (0%)           Downloading (5%)Downloading (15%)Downloading (25%)Downloading (30%)Downloading (40%)Downloading (45%)Downloading (55%)Downloading (60%)Downloading (70%)Downloading (75%)Downloading (90%)Downloading (95%)Downloading (100%)
07-Jun-2018 21:40:49   - Installing fabpot/goutte (v3.2.2): Downloading (connecting...)Downloading (0%)           Downloading (55%)Downloading (100%)
07-Jun-2018 21:40:50   - Installing facebook/webdriver (1.5.0): Downloading (connecting...)Downloading (0%)           Downloading (5%)Downloading (10%)Downloading (15%)Downloading (20%)Downloading (25%)Downloading (30%)Downloading (35%)Downloading (40%)Downloading (45%)Downloading (50%)Downloading (55%)Downloading (60%)Downloading (65%)Downloading (70%)Downloading (75%)Downloading (80%)Downloading (85%)Downloading (90%)Downloading (95%)Downloading (100%)
07-Jun-2018 21:40:50   - Installing laravel/homestead (v4.0.5): Downloading (connecting...)Downloading (0%)           Downloading (5%)Downloading (10%)Downloading (70%)Downloading (75%)Downloading (80%)Downloading (85%)Downloading (100%)
07-Jun-2018 21:40:51   - Installing phing/phing (2.4.14): Downloading (connecting...)Downloading (100%)         
07-Jun-2018 21:40:53   - Installing webmozart/assert (1.2.0): Downloading (connecting...)Downloading (0%)           Downloading (55%)Downloading (80%)Downloading (100%)
07-Jun-2018 21:40:53   - Installing phpdocumentor/reflection-common (1.0.1): Downloading (connecting...)Downloading (0%)           Downloading (100%)
07-Jun-2018 21:40:54   - Installing phpdocumentor/type-resolver (0.4.0): Downloading (connecting...)Downloading (0%)           Downloading (5%)Downloading (35%)Downloading (40%)Downloading (45%)Downloading (50%)Downloading (80%)Downloading (85%)Downloading (90%)Downloading (100%)
07-Jun-2018 21:40:55   - Installing phpdocumentor/reflection-docblock (3.3.2): Downloading (connecting...)Downloading (0%)           Downloading (5%)Downloading (10%)Downloading (15%)Downloading (45%)Downloading (50%)Downloading (55%)Downloading (60%)Downloading (65%)Downloading (70%)Downloading (75%)Downloading (100%)
07-Jun-2018 21:40:55   - Installing symfony/yaml (v3.4.3): Downloading (connecting...)Downloading (0%)           Downloading (5%)Downloading (10%)Downloading (15%)Downloading (20%)Downloading (80%)Downloading (85%)Downloading (90%)Downloading (95%)Downloading (100%)
07-Jun-2018 21:40:56   - Installing sebastian/version (2.0.1): Downloading (connecting...)Downloading (0%)           Downloading (100%)
07-Jun-2018 21:40:57   - Installing sebastian/resource-operations (1.0.0): Downloading (connecting...)Downloading (0%)           Downloading (65%)Downloading (100%)
07-Jun-2018 21:40:58   - Installing sebastian/recursion-context (2.0.0): Downloading (connecting...)Downloading (0%)           Downloading (100%)
07-Jun-2018 21:40:58   - Installing sebastian/object-enumerator (2.0.1): Downloading (connecting...)Downloading (0%)           Downloading (95%)Downloading (100%)
07-Jun-2018 21:40:59   - Installing sebastian/global-state (1.1.1): Downloading (connecting...)Downloading (0%)           Downloading (40%)Downloading (70%)Downloading (100%)
07-Jun-2018 21:41:00   - Installing sebastian/exporter (2.0.0): Downloading (connecting...)Downloading (0%)           Downloading (100%)
07-Jun-2018 21:41:00   - Installing sebastian/environment (2.0.0): Downloading (connecting...)Downloading (0%)           Downloading (15%)Downloading (30%)Downloading (45%)Downloading (60%)Downloading (75%)Downloading (90%)Downloading (100%)
07-Jun-2018 21:41:01   - Installing sebastian/diff (1.4.3): Downloading (connecting...)Downloading (0%)           Downloading (35%)Downloading (40%)Downloading (75%)Downloading (100%)
07-Jun-2018 21:41:02   - Installing sebastian/comparator (1.2.4): Downloading (connecting...)Downloading (0%)           Downloading (10%)Downloading (30%)Downloading (40%)Downloading (70%)Downloading (80%)Downloading (90%)Downloading (95%)Downloading (100%)
07-Jun-2018 21:41:03   - Installing phpunit/php-text-template (1.2.1): Downloading (connecting...)Downloading (0%)           Downloading (35%)Downloading (100%)
07-Jun-2018 21:41:03   - Installing doctrine/instantiator (1.0.5): Downloading (connecting...)Downloading (0%)           Downloading (15%)Downloading (30%)Downloading (45%)Downloading (50%)Downloading (65%)Downloading (80%)Downloading (95%)Downloading (100%)
07-Jun-2018 21:41:04   - Installing phpunit/phpunit-mock-objects (3.4.4): Downloading (connecting...)Downloading (0%)           Downloading (5%)Downloading (10%)Downloading (15%)Downloading (20%)Downloading (25%)Downloading (30%)Downloading (40%)Downloading (45%)Downloading (50%)Downloading (55%)Downloading (60%)Downloading (65%)Downloading (70%)Downloading (75%)Downloading (80%)Downloading (90%)Downloading (95%)Downloading (100%)
07-Jun-2018 21:41:05   - Installing phpunit/php-timer (1.0.9): Downloading (connecting...)Downloading (0%)           Downloading (45%)Downloading (90%)Downloading (100%)
07-Jun-2018 21:41:06   - Installing phpunit/php-file-iterator (1.4.5): Downloading (connecting...)Downloading (0%)           Downloading (100%)
07-Jun-2018 21:41:06   - Installing sebastian/code-unit-reverse-lookup (1.0.1): Downloading (connecting...)Downloading (0%)           Downloading (55%)Downloading (100%)
07-Jun-2018 21:41:07   - Installing phpunit/php-token-stream (1.4.12): Downloading (connecting...)Downloading (0%)           Downloading (5%)Downloading (10%)Downloading (15%)Downloading (20%)Downloading (90%)Downloading (95%)Downloading (100%)
07-Jun-2018 21:41:08   - Installing phpunit/php-code-coverage (4.0.8): Downloading (connecting...)Downloading (0%)           Downloading (5%)Downloading (10%)Downloading (15%)Downloading (20%)Downloading (25%)Downloading (30%)Downloading (35%)Downloading (40%)Downloading (45%)Downloading (50%)Downloading (55%)Downloading (60%)Downloading (65%)Downloading (70%)Downloading (75%)Downloading (80%)Downloading (85%)Downloading (90%)Downloading (95%)Downloading (100%)
07-Jun-2018 21:41:09   - Installing phpspec/prophecy (1.7.5): Downloading (connecting...)Downloading (0%)           Downloading (10%)Downloading (15%)Downloading (25%)Downloading (30%)Downloading (35%)Downloading (40%)Downloading (50%)Downloading (60%)Downloading (75%)Downloading (85%)Downloading (90%)Downloading (95%)Downloading (100%)
07-Jun-2018 21:41:09   - Installing myclabs/deep-copy (1.7.0): Downloading (connecting...)Downloading (0%)           Downloading (25%)Downloading (30%)Downloading (45%)Downloading (50%)Downloading (60%)Downloading (75%)Downloading (80%)Downloading (95%)Downloading (100%)
07-Jun-2018 21:41:10   - Installing phpunit/phpunit (5.7.26): Downloading (connecting...)Downloading (0%)           Downloading (5%)Downloading (10%)Downloading (15%)Downloading (20%)Downloading (25%)Downloading (30%)Downloading (35%)Downloading (40%)Downloading (50%)Downloading (55%)Downloading (60%)Downloading (65%)Downloading (70%)Downloading (75%)Downloading (80%)Downloading (85%)Downloading (90%)Downloading (95%)Downloading (100%)
07-Jun-2018 21:41:11   - Installing phpunit/dbunit (2.0.3): Downloading (connecting...)Downloading (0%)           Downloading (5%)Downloading (10%)Downloading (15%)Downloading (20%)Downloading (25%)Downloading (30%)Downloading (35%)Downloading (40%)Downloading (45%)Downloading (50%)Downloading (55%)Downloading (60%)Downloading (65%)Downloading (70%)Downloading (75%)Downloading (80%)Downloading (85%)Downloading (90%)Downloading (95%)Downloading (100%)
07-Jun-2018 21:41:12   - Installing squizlabs/php_codesniffer (2.9.1): Downloading (connecting...)Downloading (0%)           Downloading (5%)Downloading (10%)Downloading (15%)Downloading (20%)Downloading (25%)Downloading (30%)Downloading (35%)Downloading (40%)Downloading (45%)Downloading (50%)Downloading (55%)Downloading (60%)Downloading (65%)Downloading (70%)Downloading (75%)Downloading (80%)Downloading (85%)Downloading (90%)Downloading (95%)Downloading (100%)
07-Jun-2018 21:41:13 symfony/console suggests installing symfony/lock ()
07-Jun-2018 21:41:13 lusitanian/oauth suggests installing predis/predis (Allows using the Redis storage backend.)
07-Jun-2018 21:41:13 patchwork/utf8 suggests installing ext-intl (Use Intl for best performance)
07-Jun-2018 21:41:13 patchwork/utf8 suggests installing ext-wfio (Use WFIO for UTF-8 filesystem access on Windows)
07-Jun-2018 21:41:13 s9e/text-formatter suggests installing ext-intl (Allows international URLs to be accepted by the URL filter)
07-Jun-2018 21:41:13 s9e/text-formatter suggests installing ext-xsl (Enables the XSLT renderer)
07-Jun-2018 21:41:13 paragonie/random_compat suggests installing ext-libsodium (Provides a modern crypto API that can be used to generate random bytes.)
07-Jun-2018 21:41:13 symfony/http-kernel suggests installing symfony/var-dumper ()
07-Jun-2018 21:41:13 symfony/dependency-injection suggests installing symfony/expression-language (For using expressions in service container configuration)
07-Jun-2018 21:41:13 zendframework/zend-eventmanager suggests installing container-interop/container-interop (^1.1.0, to use the lazy listeners feature)
07-Jun-2018 21:41:13 zendframework/zend-eventmanager suggests installing zendframework/zend-stdlib (^2.7.3 || ^3.0, to use the FilterChain feature)
07-Jun-2018 21:41:13 zendframework/zend-code suggests installing doctrine/annotations (Doctrine\Common\Annotations >=1.0 for annotation features)
07-Jun-2018 21:41:13 zendframework/zend-code suggests installing zendframework/zend-stdlib (Zend\Stdlib component)
07-Jun-2018 21:41:13 ocramius/proxy-manager suggests installing ocramius/generated-hydrator (To have very fast object to array to object conversion for ghost objects)
07-Jun-2018 21:41:13 ocramius/proxy-manager suggests installing zendframework/zend-json (To have the JsonRpc adapter (Remote Object feature))
07-Jun-2018 21:41:13 ocramius/proxy-manager suggests installing zendframework/zend-soap (To have the Soap adapter (Remote Object feature))
07-Jun-2018 21:41:13 ocramius/proxy-manager suggests installing zendframework/zend-stdlib (To use the hydrator proxy)
07-Jun-2018 21:41:13 ocramius/proxy-manager suggests installing zendframework/zend-xmlrpc (To have the XmlRpc adapter (Remote Object feature))
07-Jun-2018 21:41:13 symfony/routing suggests installing doctrine/annotations (For using the annotation loader)
07-Jun-2018 21:41:13 symfony/routing suggests installing symfony/expression-language (For using expression matching)
07-Jun-2018 21:41:13 symfony/twig-bridge suggests installing symfony/asset (For using the AssetExtension)
07-Jun-2018 21:41:13 symfony/twig-bridge suggests installing symfony/expression-language (For using the ExpressionExtension)
07-Jun-2018 21:41:13 symfony/twig-bridge suggests installing symfony/form (For using the FormExtension)
07-Jun-2018 21:41:13 symfony/twig-bridge suggests installing symfony/security (For using the SecurityExtension)
07-Jun-2018 21:41:13 symfony/twig-bridge suggests installing symfony/stopwatch (For using the StopwatchExtension)
07-Jun-2018 21:41:13 symfony/twig-bridge suggests installing symfony/templating (For using the TwigEngine)
07-Jun-2018 21:41:13 symfony/twig-bridge suggests installing symfony/translation (For using the TranslationExtension)
07-Jun-2018 21:41:13 symfony/twig-bridge suggests installing symfony/var-dumper (For using the DumpExtension)
07-Jun-2018 21:41:13 symfony/twig-bridge suggests installing symfony/web-link (For using the WebLinkExtension)
07-Jun-2018 21:41:13 sebastian/global-state suggests installing ext-uopz (*)
07-Jun-2018 21:41:13 phpunit/phpunit-mock-objects suggests installing ext-soap (*)
07-Jun-2018 21:41:13 phpunit/phpunit suggests installing phpunit/php-invoker (~1.1)
07-Jun-2018 21:41:13 Generating autoload files
07-Jun-2018 21:41:14 Buildfile: /data/build/build.xml
07-Jun-2018 21:41:14
07-Jun-2018 21:41:14 phpBB > clean:
07-Jun-2018 21:41:14
07-Jun-2018 21:41:14    [delete] Directory /data/build/logs does not exist or is not a directory.
07-Jun-2018 21:41:14    [delete] Directory /data/build/api does not exist or is not a directory.
07-Jun-2018 21:41:14    [delete] Directory /data/build/codebrowser does not exist or is not a directory.
07-Jun-2018 21:41:14    [delete] Directory /data/build/coverage does not exist or is not a directory.
07-Jun-2018 21:41:14    [delete] Directory /data/build/cpd does not exist or is not a directory.
07-Jun-2018 21:41:14    [delete] Directory /data/build/dependencies does not exist or is not a directory.
07-Jun-2018 21:41:14    [delete] Directory /data/build/new_version does not exist or is not a directory.
07-Jun-2018 21:41:14    [delete] Directory /data/build/old_versions does not exist or is not a directory.
07-Jun-2018 21:41:14    [delete] Directory /data/build/save does not exist or is not a directory.
07-Jun-2018 21:41:14
07-Jun-2018 21:41:14 phpBB > prepare:
07-Jun-2018 21:41:14
07-Jun-2018 21:41:14     [mkdir] Created dir: /data/build/logs
07-Jun-2018 21:41:14     [mkdir] Created dir: /data/build/api
07-Jun-2018 21:41:14     [mkdir] Created dir: /data/build/codebrowser
07-Jun-2018 21:41:14     [mkdir] Created dir: /data/build/coverage
07-Jun-2018 21:41:14     [mkdir] Created dir: /data/build/cpd
07-Jun-2018 21:41:14     [mkdir] Created dir: /data/build/dependencies
07-Jun-2018 21:41:14     [mkdir] Created dir: /data/build/new_version
07-Jun-2018 21:41:14     [mkdir] Created dir: /data/build/new_version/files
07-Jun-2018 21:41:14     [mkdir] Created dir: /data/build/new_version/patches
07-Jun-2018 21:41:14     [mkdir] Created dir: /data/build/new_version/release_files
07-Jun-2018 21:41:14     [mkdir] Created dir: /data/build/new_version/update
07-Jun-2018 21:41:14     [mkdir] Created dir: /data/build/old_versions
07-Jun-2018 21:41:14     [mkdir] Created dir: /data/build/save
07-Jun-2018 21:41:14
07-Jun-2018 21:41:14 BUILD FINISHED
07-Jun-2018 21:41:14
07-Jun-2018 21:41:14 Total time: 0.1295 seconds
07-Jun-2018 21:41:14
07-Jun-2018 21:41:14 Finished task 'Prepare directory' with result: Success
07-Jun-2018 21:41:14 Skipping execution of task 'Run sniffs' as it is disabled
07-Jun-2018 21:41:14
Substituting variable: ${bamboo.working.directory} with /home/bamboo/xml-data/build-dir/PHPBB3-PR-JOB1
07-Jun-2018 21:41:14 Starting task 'Run sniffs' of type 'com.atlassian.bamboo.plugins.bamboo-docker-plugin:task.docker.cli'
07-Jun-2018 21:41:14 Running image name (phpbb:php-5.6)
07-Jun-2018 21:41:14
Beginning to execute external process for build 'phpBB3 - Pull Requests - Build and Test Job #8193 (PHPBB3-PR-JOB1-8193)'
... running command line:
/usr/bin/docker run --volume /home/bamboo/xml-data/build-dir/PHPBB3-PR-JOB1:/data --workdir /data/build --rm -u=991 phpbb:php-5.6 ../phpBB/vendor/bin/phing sniff
... in: /home/bamboo/xml-data/build-dir/PHPBB3-PR-JOB1
... using extra environment variables:
bamboo_planRepository_1_branch=3.1.x
bamboo_planRepository_1_branchDisplayName=3.1.x
bamboo_repository_revision_number=dc8ff9da28b8ab4ad11c7ea94cca526f17c87fe5
bamboo_PRref=master
bamboo_resultsUrl=https://bamboo.phpbb.com/browse/PHPBB3-PR-JOB1-8193
bamboo_capability_system_builder_command_Git=/usr/bin/git
bamboo_repository_75956235_git_username=bantu
bamboo_build_working_directory=/home/bamboo/xml-data/build-dir/PHPBB3-PR-JOB1
bamboo_planRepository_1_name=phpBB Ascraeus
bamboo_buildKey=PHPBB3-PR-JOB1
bamboo_capability_phpbb_tests=true
bamboo_shortPlanName=Pull Requests
bamboo_capability_system_builder_command_fop=/usr/bin/fop
bamboo_capability_dbms_sqlite_2=true
bamboo_planRepository_name=phpBB Ascraeus
bamboo_PRnumber=4933
bamboo_buildNumber=8193
bamboo_repository_75956235_git_repositoryUrl=https://github.com/phpbb/phpbb.git
bamboo_capability_system_builder_phpunit_PHPUnit=/usr/bin/phpunit
bamboo_shortJobName=Build and Test Job
bamboo_buildResultsUrl=https://bamboo.phpbb.com/browse/PHPBB3-PR-JOB1-8193
bamboo_repository_75956235_branch_name=3.1.x
bamboo_planRepository_repositoryUrl=https://github.com/phpbb/phpbb.git
bamboo_agentId=131073
bamboo_planName=phpBB3 - Pull Requests
bamboo_build_commandline_com_atlassian_bamboo_plugins_scripttask_task_builder_script_7=/bin/sh /home/bamboo/temp/PHPBB3-PR-JOB1-8193-ScriptBuildTask-6376562063448389126.sh
bamboo_shortPlanKey=PR
bamboo_shortJobKey=JOB1
bamboo_capability_dbms_mysql_55=true
bamboo_capability_system_jdk_JDK_1_7_0_65=/usr/lib/jvm/java-7-openjdk-amd64
bamboo_planRepository_revision=dc8ff9da28b8ab4ad11c7ea94cca526f17c87fe5
bamboo_buildTimeStamp=2018-06-07T21:39:48.353Z
bamboo_repository_previous_revision_number=dc8ff9da28b8ab4ad11c7ea94cca526f17c87fe5
bamboo_capability_system_jdk_JDK_1_6_0_16=/usr/lib/jvm/java-6-sun-1.6.0.16
bamboo_capability_system_builder_mvn2_Maven_2=/usr/share/maven2
bamboo_planRepository_previousRevision=dc8ff9da28b8ab4ad11c7ea94cca526f17c87fe5
bamboo_build_commandline_com_atlassian_bamboo_plugins_scripttask_task_builder_script_4=/bin/sh /home/bamboo/temp/PHPBB3-PR-JOB1-8193-ScriptBuildTask-6194527675238120582.sh
bamboo_repository_git_branch=3.1.x
bamboo_buildResultKey=PHPBB3-PR-JOB1-8193
bamboo_repository_branch_name=3.1.x
bamboo_buildPlanName=phpBB3 - Pull Requests - Build and Test Job
bamboo_planRepository_1_revision=dc8ff9da28b8ab4ad11c7ea94cca526f17c87fe5
bamboo_repository_name=phpBB Ascraeus
bamboo_buildFailed=false
bamboo_capability_system_docker_executable=/usr/bin/docker
bamboo_build_commandline_com_atlassian_bamboo_plugins_bamboo_docker_plugin_task_docker_cli_12=/usr/bin/docker run --volume /home/bamboo/xml-data/build-dir/PHPBB3-PR-JOB1:/data --workdir /data/phpBB --rm -e HOME=/home/bamboo -u=991 phpbb:php-5.6 /bin/bash -c php ../composer.phar install --dev; cd ../build; ../phpBB/vendor/bin/phing clean prepare
bamboo_planRepository_branch=3.1.x
bamboo_agentWorkingDirectory=/home/bamboo/xml-data/build-dir
bamboo_capability_system_git_executable=/usr/bin/git
bamboo_capability_system_builder_phpunit_PHPUnit_3_4=/usr/bin/phpunit
bamboo_repository_git_username=bantu
bamboo_planRepository_1_previousRevision=dc8ff9da28b8ab4ad11c7ea94cca526f17c87fe5
bamboo_repository_75956235_revision_number=dc8ff9da28b8ab4ad11c7ea94cca526f17c87fe5
bamboo_planRepository_branchDisplayName=3.1.x
bamboo_planRepository_1_type=gitv2
bamboo_planRepository_branchName=3.1.x
bamboo_repository_75956235_previous_revision_number=dc8ff9da28b8ab4ad11c7ea94cca526f17c87fe5
bamboo_capability_system_jdk_JDK=/usr/lib/jvm/java-6-sun
bamboo_plan_storageTag=PHPBB3-PR
bamboo_hg_cache_directory=/home/bamboo/xml-data/build-dir/_hg-repositories-cache
bamboo_planRepository_1_username=bantu
bamboo_planRepository_type=gitv2
bamboo_git_cache_directory=/home/bamboo/xml-data/build-dir/_git-repositories-cache
bamboo_ManualBuildTriggerReason_userName=Build Robot
bamboo_repository_git_repositoryUrl=https://github.com/phpbb/phpbb.git
bamboo_repository_75956235_git_branch=3.1.x
bamboo_capability_system_builder_ant_Ant=/usr/share/ant
bamboo_repository_75956235_name=phpBB Ascraeus
bamboo_tmp_directory=/home/bamboo/temp
bamboo_working_directory=/home/bamboo/xml-data/build-dir/PHPBB3-PR-JOB1
bamboo_planKey=PHPBB3-PR
bamboo_capability_local=true
bamboo_planRepository_1_repositoryUrl=https://github.com/phpbb/phpbb.git
bamboo_planRepository_username=bantu
bamboo_capability_system_jdk_JDK_1_6=/usr/lib/jvm/java-6-sun
bamboo_capability_system_jdk_JDK_1_7=/usr/lib/jvm/java-7-openjdk-amd64
bamboo_planRepository_1_branchName=3.1.x
07-Jun-2018 21:41:14 Buildfile: /data/build/build.xml
07-Jun-2018 21:41:14
07-Jun-2018 21:41:14 phpBB > sniff:
07-Jun-2018 21:41:14
07-Jun-2018 21:41:23 ............................................................  60 / 753 (8%)
07-Jun-2018 21:41:25 ............................................................ 120 / 753 (16%)
07-Jun-2018 21:41:26 ............................................................ 180 / 753 (24%)
07-Jun-2018 21:41:27 ............................................................ 240 / 753 (32%)
07-Jun-2018 21:41:30 ............................................................ 300 / 753 (40%)
07-Jun-2018 21:41:36 ............................................................ 360 / 753 (48%)
07-Jun-2018 21:41:43 ............................................................ 420 / 753 (56%)
07-Jun-2018 21:41:47 ............................................................ 480 / 753 (64%)
07-Jun-2018 21:41:51 ............................................................ 540 / 753 (72%)
07-Jun-2018 21:41:55 ............................................................ 600 / 753 (80%)
07-Jun-2018 21:42:01 ............................................................ 660 / 753 (88%)
07-Jun-2018 21:42:04 ............................................................ 720 / 753 (96%)
07-Jun-2018 21:42:05 .................................
07-Jun-2018 21:42:05
07-Jun-2018 21:42:05 Time: 50.69 secs; Memory: 63.75Mb
07-Jun-2018 21:42:05
07-Jun-2018 21:42:14 ............................................................  60 / 209 (29%)
07-Jun-2018 21:42:35 ............................................................ 120 / 209 (57%)
07-Jun-2018 21:42:50 ............................................................ 180 / 209 (86%)
07-Jun-2018 21:42:59 .............................
07-Jun-2018 21:42:59
07-Jun-2018 21:42:59 Time: 53.69 secs; Memory: 60.5Mb
07-Jun-2018 21:42:59
07-Jun-2018 21:42:59
07-Jun-2018 21:42:59
07-Jun-2018 21:42:59 Time: 24ms; Memory: 3.75Mb
07-Jun-2018 21:42:59
07-Jun-2018 21:42:59
07-Jun-2018 21:42:59 BUILD FINISHED
07-Jun-2018 21:42:59
07-Jun-2018 21:42:59 Total time: 2 minutes  44.80 seconds
07-Jun-2018 21:42:59
07-Jun-2018 21:42:59 Finished task 'Run sniffs' with result: Success
07-Jun-2018 21:42:59 Skipping execution of task 'Run tests' as it is disabled
07-Jun-2018 21:42:59
Substituting variable: ${bamboo.working.directory} with /home/bamboo/xml-data/build-dir/PHPBB3-PR-JOB1
07-Jun-2018 21:42:59 Starting task 'Run tests' of type 'com.atlassian.bamboo.plugins.bamboo-docker-plugin:task.docker.cli'
07-Jun-2018 21:42:59 Running image name (phpbb:php-5.6)
07-Jun-2018 21:42:59
Beginning to execute external process for build 'phpBB3 - Pull Requests - Build and Test Job #8193 (PHPBB3-PR-JOB1-8193)'
... running command line:
/usr/bin/docker run --volume /home/bamboo/xml-data/build-dir/PHPBB3-PR-JOB1:/data --workdir /data --rm -u=991 -t phpbb:php-5.6 /bin/bash -c phpBB/vendor/bin/phpunit --log-junit build/logs/phpunit.xml
... in: /home/bamboo/xml-data/build-dir/PHPBB3-PR-JOB1
... using extra environment variables:
bamboo_planRepository_1_branch=3.1.x
bamboo_planRepository_1_branchDisplayName=3.1.x
bamboo_repository_revision_number=dc8ff9da28b8ab4ad11c7ea94cca526f17c87fe5
bamboo_PRref=master
bamboo_resultsUrl=https://bamboo.phpbb.com/browse/PHPBB3-PR-JOB1-8193
bamboo_capability_system_builder_command_Git=/usr/bin/git
bamboo_repository_75956235_git_username=bantu
bamboo_build_working_directory=/home/bamboo/xml-data/build-dir/PHPBB3-PR-JOB1
bamboo_planRepository_1_name=phpBB Ascraeus
bamboo_buildKey=PHPBB3-PR-JOB1
bamboo_capability_phpbb_tests=true
bamboo_shortPlanName=Pull Requests
bamboo_capability_system_builder_command_fop=/usr/bin/fop
bamboo_capability_dbms_sqlite_2=true
bamboo_planRepository_name=phpBB Ascraeus
bamboo_PRnumber=4933
bamboo_buildNumber=8193
bamboo_repository_75956235_git_repositoryUrl=https://github.com/phpbb/phpbb.git
bamboo_capability_system_builder_phpunit_PHPUnit=/usr/bin/phpunit
bamboo_shortJobName=Build and Test Job
bamboo_buildResultsUrl=https://bamboo.phpbb.com/browse/PHPBB3-PR-JOB1-8193
bamboo_repository_75956235_branch_name=3.1.x
bamboo_planRepository_repositoryUrl=https://github.com/phpbb/phpbb.git
bamboo_agentId=131073
bamboo_planName=phpBB3 - Pull Requests
bamboo_build_commandline_com_atlassian_bamboo_plugins_scripttask_task_builder_script_7=/bin/sh /home/bamboo/temp/PHPBB3-PR-JOB1-8193-ScriptBuildTask-6376562063448389126.sh
bamboo_shortPlanKey=PR
bamboo_shortJobKey=JOB1
bamboo_capability_dbms_mysql_55=true
bamboo_capability_system_jdk_JDK_1_7_0_65=/usr/lib/jvm/java-7-openjdk-amd64
bamboo_planRepository_revision=dc8ff9da28b8ab4ad11c7ea94cca526f17c87fe5
bamboo_buildTimeStamp=2018-06-07T21:39:48.353Z
bamboo_repository_previous_revision_number=dc8ff9da28b8ab4ad11c7ea94cca526f17c87fe5
bamboo_capability_system_jdk_JDK_1_6_0_16=/usr/lib/jvm/java-6-sun-1.6.0.16
bamboo_capability_system_builder_mvn2_Maven_2=/usr/share/maven2
bamboo_planRepository_previousRevision=dc8ff9da28b8ab4ad11c7ea94cca526f17c87fe5
bamboo_build_commandline_com_atlassian_bamboo_plugins_scripttask_task_builder_script_4=/bin/sh /home/bamboo/temp/PHPBB3-PR-JOB1-8193-ScriptBuildTask-6194527675238120582.sh
bamboo_repository_git_branch=3.1.x
bamboo_buildResultKey=PHPBB3-PR-JOB1-8193
bamboo_repository_branch_name=3.1.x
bamboo_buildPlanName=phpBB3 - Pull Requests - Build and Test Job
bamboo_planRepository_1_revision=dc8ff9da28b8ab4ad11c7ea94cca526f17c87fe5
bamboo_repository_name=phpBB Ascraeus
bamboo_buildFailed=false
bamboo_capability_system_docker_executable=/usr/bin/docker
bamboo_build_commandline_com_atlassian_bamboo_plugins_bamboo_docker_plugin_task_docker_cli_11=/usr/bin/docker run --volume /home/bamboo/xml-data/build-dir/PHPBB3-PR-JOB1:/data --workdir /data/build --rm -u=991 phpbb:php-5.6 ../phpBB/vendor/bin/phing sniff
bamboo_build_commandline_com_atlassian_bamboo_plugins_bamboo_docker_plugin_task_docker_cli_12=/usr/bin/docker run --volume /home/bamboo/xml-data/build-dir/PHPBB3-PR-JOB1:/data --workdir /data/phpBB --rm -e HOME=/home/bamboo -u=991 phpbb:php-5.6 /bin/bash -c php ../composer.phar install --dev; cd ../build; ../phpBB/vendor/bin/phing clean prepare
bamboo_planRepository_branch=3.1.x
bamboo_agentWorkingDirectory=/home/bamboo/xml-data/build-dir
bamboo_capability_system_git_executable=/usr/bin/git
bamboo_capability_system_builder_phpunit_PHPUnit_3_4=/usr/bin/phpunit
bamboo_repository_git_username=bantu
bamboo_planRepository_1_previousRevision=dc8ff9da28b8ab4ad11c7ea94cca526f17c87fe5
bamboo_repository_75956235_revision_number=dc8ff9da28b8ab4ad11c7ea94cca526f17c87fe5
bamboo_planRepository_branchDisplayName=3.1.x
bamboo_planRepository_1_type=gitv2
bamboo_planRepository_branchName=3.1.x
bamboo_repository_75956235_previous_revision_number=dc8ff9da28b8ab4ad11c7ea94cca526f17c87fe5
bamboo_capability_system_jdk_JDK=/usr/lib/jvm/java-6-sun
bamboo_plan_storageTag=PHPBB3-PR
bamboo_hg_cache_directory=/home/bamboo/xml-data/build-dir/_hg-repositories-cache
bamboo_planRepository_1_username=bantu
bamboo_planRepository_type=gitv2
bamboo_git_cache_directory=/home/bamboo/xml-data/build-dir/_git-repositories-cache
bamboo_ManualBuildTriggerReason_userName=Build Robot
bamboo_repository_git_repositoryUrl=https://github.com/phpbb/phpbb.git
bamboo_repository_75956235_git_branch=3.1.x
bamboo_capability_system_builder_ant_Ant=/usr/share/ant
bamboo_repository_75956235_name=phpBB Ascraeus
bamboo_tmp_directory=/home/bamboo/temp
bamboo_working_directory=/home/bamboo/xml-data/build-dir/PHPBB3-PR-JOB1
bamboo_planKey=PHPBB3-PR
bamboo_capability_local=true
bamboo_planRepository_1_repositoryUrl=https://github.com/phpbb/phpbb.git
bamboo_planRepository_username=bantu
bamboo_capability_system_jdk_JDK_1_6=/usr/lib/jvm/java-6-sun
bamboo_capability_system_jdk_JDK_1_7=/usr/lib/jvm/java-7-openjdk-amd64
bamboo_planRepository_1_branchName=3.1.x
07-Jun-2018 21:43:03 PHPUnit 5.7.26 by Sebastian Bergmann and contributors.
07-Jun-2018 21:43:03
07-Jun-2018 21:43:10 .....EE..E...................EEEEEEEEEE......................   61 / 7174 (  0%)
07-Jun-2018 21:43:11 .............................................................  122 / 7174 (  1%)
07-Jun-2018 21:43:12 .............I.....SSSSSSSS............SSSS.........S...S....  183 / 7174 (  2%)
07-Jun-2018 21:43:13 .............................................................  244 / 7174 (  3%)
07-Jun-2018 21:43:20 .....S............W.....EEEEEEEE.............................  305 / 7174 (  4%)
07-Jun-2018 21:43:21 .............................................................  366 / 7174 (  5%)
07-Jun-2018 21:43:22 .............................................................  427 / 7174 (  5%)
07-Jun-2018 21:43:22 .............................................................  488 / 7174 (  6%)
07-Jun-2018 21:43:23 .............................................................  549 / 7174 (  7%)
07-Jun-2018 21:43:24 .............................................................  610 / 7174 (  8%)
07-Jun-2018 21:43:25 .............................................................  671 / 7174 (  9%)
07-Jun-2018 21:43:25 .............................................................  732 / 7174 ( 10%)
07-Jun-2018 21:43:26 .............................................................  793 / 7174 ( 11%)
07-Jun-2018 21:43:27 .............................................................  854 / 7174 ( 11%)
07-Jun-2018 21:43:28 .............................................................  915 / 7174 ( 12%)
07-Jun-2018 21:43:29 .............................................................  976 / 7174 ( 13%)
07-Jun-2018 21:43:30 ............................................................. 1037 / 7174 ( 14%)
07-Jun-2018 21:43:34 ................................................I............ 1098 / 7174 ( 15%)
07-Jun-2018 21:43:39 ............................................................. 1159 / 7174 ( 16%)
07-Jun-2018 21:43:44 ............................................................. 1220 / 7174 ( 17%)
07-Jun-2018 21:43:47 ........................................S.S.S................ 1281 / 7174 ( 17%)
07-Jun-2018 21:43:47 ............................................................. 1342 / 7174 ( 18%)
07-Jun-2018 21:43:48 ............................................................. 1403 / 7174 ( 19%)
07-Jun-2018 21:43:48 ............................................................. 1464 / 7174 ( 20%)
07-Jun-2018 21:43:48 ............................................................. 1525 / 7174 ( 21%)
07-Jun-2018 21:43:48 ............................................................. 1586 / 7174 ( 22%)
07-Jun-2018 21:43:48 ............................................................. 1647 / 7174 ( 22%)
07-Jun-2018 21:43:48 ............................................................. 1708 / 7174 ( 23%)
07-Jun-2018 21:43:48 ............................................................. 1769 / 7174 ( 24%)
07-Jun-2018 21:43:48 ............................................................. 1830 / 7174 ( 25%)
07-Jun-2018 21:43:49 ............................................................. 1891 / 7174 ( 26%)
07-Jun-2018 21:43:49 ............................................................. 1952 / 7174 ( 27%)
07-Jun-2018 21:43:49 ............................................................. 2013 / 7174 ( 28%)
07-Jun-2018 21:43:49 ............................................................. 2074 / 7174 ( 28%)
07-Jun-2018 21:43:50 ............................................................. 2135 / 7174 ( 29%)
07-Jun-2018 21:43:51 ............................................................. 2196 / 7174 ( 30%)
07-Jun-2018 21:43:52 ............................................................. 2257 / 7174 ( 31%)
07-Jun-2018 21:43:53 ............................................................. 2318 / 7174 ( 32%)
07-Jun-2018 21:43:53 ............................................................. 2379 / 7174 ( 33%)
07-Jun-2018 21:43:55 ................I.II......................................... 2440 / 7174 ( 34%)
07-Jun-2018 21:43:56 ............................................................. 2501 / 7174 ( 34%)
07-Jun-2018 21:43:56 ............................................................. 2562 / 7174 ( 35%)
07-Jun-2018 21:43:56 ............................................................. 2623 / 7174 ( 36%)
07-Jun-2018 21:43:56 ............................................................. 2684 / 7174 ( 37%)
07-Jun-2018 21:43:59 ............................................................. 2745 / 7174 ( 38%)
07-Jun-2018 21:44:00 ............................................................. 2806 / 7174 ( 39%)
07-Jun-2018 21:44:00 ......................................SSSSSSSSS.............. 2867 / 7174 ( 39%)
07-Jun-2018 21:44:00 ............................................................. 2928 / 7174 ( 40%)
07-Jun-2018 21:44:11 ............................................................. 2989 / 7174 ( 41%)
07-Jun-2018 21:44:16 ............................................................. 3050 / 7174 ( 42%)
07-Jun-2018 21:44:20 ..............S.............................................. 3111 / 7174 ( 43%)
07-Jun-2018 21:44:20 ............................................................. 3172 / 7174 ( 44%)
07-Jun-2018 21:44:30 ............................................................. 3233 / 7174 ( 45%)
07-Jun-2018 21:44:39 .......................................SSSS.................. 3294 / 7174 ( 45%)
07-Jun-2018 21:44:45 ............................................................. 3355 / 7174 ( 46%)
07-Jun-2018 21:44:46 ................................................EEE.......... 3416 / 7174 ( 47%)
07-Jun-2018 21:44:46 ............................................................. 3477 / 7174 ( 48%)
07-Jun-2018 21:44:46 ............................................................. 3538 / 7174 ( 49%)
07-Jun-2018 21:44:47 ............................................................. 3599 / 7174 ( 50%)
07-Jun-2018 21:44:47 ............................................................. 3660 / 7174 ( 51%)
07-Jun-2018 21:44:47 ............................................................. 3721 / 7174 ( 51%)
07-Jun-2018 21:44:47 ............................................................. 3782 / 7174 ( 52%)
07-Jun-2018 21:44:47 ............................................................. 3843 / 7174 ( 53%)
07-Jun-2018 21:44:50 ............................................................. 3904 / 7174 ( 54%)
07-Jun-2018 21:44:51 ............................................................. 3965 / 7174 ( 55%)
07-Jun-2018 21:44:53 ............................................................. 4026 / 7174 ( 56%)
07-Jun-2018 21:44:54 ............................................................. 4087 / 7174 ( 56%)
07-Jun-2018 21:44:56 ............................................................. 4148 / 7174 ( 57%)
07-Jun-2018 21:44:59 ............................................................. 4209 / 7174 ( 58%)
07-Jun-2018 21:45:11 ............................................................. 4270 / 7174 ( 59%)
07-Jun-2018 21:45:11 ............................................................. 4331 / 7174 ( 60%)
07-Jun-2018 21:45:13 ............................................................. 4392 / 7174 ( 61%)
07-Jun-2018 21:45:13 ............................................................. 4453 / 7174 ( 62%)
07-Jun-2018 21:45:13 ............................................................. 4514 / 7174 ( 62%)
07-Jun-2018 21:45:13 ............................................................. 4575 / 7174 ( 63%)
07-Jun-2018 21:45:13 ............................................................. 4636 / 7174 ( 64%)
07-Jun-2018 21:45:13 ............................................................. 4697 / 7174 ( 65%)
07-Jun-2018 21:45:14 ............................................................. 4758 / 7174 ( 66%)
07-Jun-2018 21:45:14 ............................................................. 4819 / 7174 ( 67%)
07-Jun-2018 21:45:14 ............................................................. 4880 / 7174 ( 68%)
07-Jun-2018 21:45:29 ............................................................. 4941 / 7174 ( 68%)
07-Jun-2018 21:45:38 ..................S.......................................... 5002 / 7174 ( 69%)
07-Jun-2018 21:45:45 ............................................................. 5063 / 7174 ( 70%)
07-Jun-2018 21:45:52 ............................................................. 5124 / 7174 ( 71%)
07-Jun-2018 21:45:53 ............................................................. 5185 / 7174 ( 72%)
07-Jun-2018 21:45:53 ............................................................. 5246 / 7174 ( 73%)
07-Jun-2018 21:45:54 ............................................................. 5307 / 7174 ( 73%)
07-Jun-2018 21:45:54 ...................................SSSSSSSSSSSSSSSSSSSSSSSSSS 5368 / 7174 ( 74%)
07-Jun-2018 21:45:54 SSSSSSSSSSSSSSSSSSSSSSSSSSSSSSSSSSSSSSSSSSSSSSSSSSSSSSSSSSSSS 5429 / 7174 ( 75%)
07-Jun-2018 21:45:54 SSSSSSSSSSSSSSSSSSSSSSSSSSSSSSSSSSSSSSSSSSSSSSSSSSSSSSSSSSSSS 5490 / 7174 ( 76%)
07-Jun-2018 21:45:54 SSSSSSSSSSSSSSSSSSSSSSSSSSSSSSSSSSSSSSSSSSSSSSSSSSSSSSSSSSSSS 5551 / 7174 ( 77%)
07-Jun-2018 21:45:55 SSSSSSSSSSSSSSSSSSSSSSSSSSSSSSSSSSSSSSSSSSSSSSSSSSSSS........ 5612 / 7174 ( 78%)
07-Jun-2018 21:45:58 ............................................................. 5673 / 7174 ( 79%)
07-Jun-2018 21:46:01 ............................................................. 5734 / 7174 ( 79%)
07-Jun-2018 21:46:04 ............................................................. 5795 / 7174 ( 80%)
07-Jun-2018 21:46:08 ............................................................. 5856 / 7174 ( 81%)
07-Jun-2018 21:46:11 ............................................................. 5917 / 7174 ( 82%)
07-Jun-2018 21:46:14 ............................................................. 5978 / 7174 ( 83%)
07-Jun-2018 21:46:17 ............................................................. 6039 / 7174 ( 84%)
07-Jun-2018 21:46:20 ............................................................. 6100 / 7174 ( 85%)
07-Jun-2018 21:46:24 ............................................................. 6161 / 7174 ( 85%)
07-Jun-2018 21:46:27 ............................................................. 6222 / 7174 ( 86%)
07-Jun-2018 21:46:30 ............................................................. 6283 / 7174 ( 87%)
07-Jun-2018 21:46:33 ............................................................. 6344 / 7174 ( 88%)
07-Jun-2018 21:46:36 ............................................................. 6405 / 7174 ( 89%)
07-Jun-2018 21:46:39 ............................................................. 6466 / 7174 ( 90%)
07-Jun-2018 21:46:42 ............................................................. 6527 / 7174 ( 90%)
07-Jun-2018 21:46:45 ............................................................. 6588 / 7174 ( 91%)
07-Jun-2018 21:46:48 ............................................................. 6649 / 7174 ( 92%)
07-Jun-2018 21:46:51 ............................................................. 6710 / 7174 ( 93%)
07-Jun-2018 21:46:54 ............................................................. 6771 / 7174 ( 94%)
07-Jun-2018 21:46:58 ............................................................. 6832 / 7174 ( 95%)
07-Jun-2018 21:47:01 ............................................................. 6893 / 7174 ( 96%)
07-Jun-2018 21:47:04 ............................................................. 6954 / 7174 ( 96%)
07-Jun-2018 21:47:07 ............................................................. 7015 / 7174 ( 97%)
07-Jun-2018 21:47:10 ............................................................. 7076 / 7174 ( 98%)
07-Jun-2018 21:47:13 ............................................................. 7137 / 7174 ( 99%)
07-Jun-2018 21:47:15 ...................................SS                         7174 / 7174 (100%)
07-Jun-2018 21:47:15
07-Jun-2018 21:47:15 Time: 4.25 minutes, Memory: 519.75MB
07-Jun-2018 21:47:15
07-Jun-2018 21:47:15 There were 24 errors:
07-Jun-2018 21:47:15
07-Jun-2018 21:47:15 1) phpbb_attachment_delete_test::test_attachment_delete with data set #3 ('attach', array(1, 2), false, 2)
07-Jun-2018 21:47:15 SQL ERROR [ sqlite3 ]<br /><br />near "WHERE": syntax error [1]<br /><br />An sql error occurred while fetching this page. Please contact an administrator if this problem persists.
07-Jun-2018 21:47:15
07-Jun-2018 21:47:15 /data/phpBB/phpbb/db/driver/driver.php:997
07-Jun-2018 21:47:15 /data/phpBB/phpbb/db/driver/sqlite3.php:155
07-Jun-2018 21:47:15 /data/phpBB/phpbb/storage/storage.php:297
07-Jun-2018 21:47:15 /data/phpBB/phpbb/storage/storage.php:150
07-Jun-2018 21:47:15 /data/phpBB/phpbb/attachment/delete.php:415
07-Jun-2018 21:47:15 /data/phpBB/phpbb/attachment/delete.php:333
07-Jun-2018 21:47:15 /data/phpBB/phpbb/attachment/delete.php:160
07-Jun-2018 21:47:15 /data/tests/attachment/delete_test.php:96
07-Jun-2018 21:47:15
07-Jun-2018 21:47:15 2) phpbb_attachment_delete_test::test_attachment_delete with data set #4 ('attach', array(1, 2), true, 2)
07-Jun-2018 21:47:15 SQL ERROR [ sqlite3 ]<br /><br />near "WHERE": syntax error [1]<br /><br />An sql error occurred while fetching this page. Please contact an administrator if this problem persists.
07-Jun-2018 21:47:15
07-Jun-2018 21:47:15 /data/phpBB/phpbb/db/driver/driver.php:997
07-Jun-2018 21:47:15 /data/phpBB/phpbb/db/driver/sqlite3.php:155
07-Jun-2018 21:47:15 /data/phpBB/phpbb/storage/storage.php:297
07-Jun-2018 21:47:15 /data/phpBB/phpbb/storage/storage.php:150
07-Jun-2018 21:47:15 /data/phpBB/phpbb/attachment/delete.php:415
07-Jun-2018 21:47:15 /data/phpBB/phpbb/attachment/delete.php:333
07-Jun-2018 21:47:15 /data/phpBB/phpbb/attachment/delete.php:160
07-Jun-2018 21:47:15 /data/tests/attachment/delete_test.php:96
07-Jun-2018 21:47:15
07-Jun-2018 21:47:15 3) phpbb_attachment_delete_test::test_attachment_delete with data set #7 ('topic', 1, true, 3)
07-Jun-2018 21:47:15 SQL ERROR [ sqlite3 ]<br /><br />near "WHERE": syntax error [1]<br /><br />An sql error occurred while fetching this page. Please contact an administrator if this problem persists.
07-Jun-2018 21:47:15
07-Jun-2018 21:47:15 /data/phpBB/phpbb/db/driver/driver.php:997
07-Jun-2018 21:47:15 /data/phpBB/phpbb/db/driver/sqlite3.php:155
07-Jun-2018 21:47:15 /data/phpBB/phpbb/storage/storage.php:297
07-Jun-2018 21:47:15 /data/phpBB/phpbb/storage/storage.php:150
07-Jun-2018 21:47:15 /data/phpBB/phpbb/attachment/delete.php:415
07-Jun-2018 21:47:15 /data/phpBB/phpbb/attachment/delete.php:333
07-Jun-2018 21:47:15 /data/phpBB/phpbb/attachment/delete.php:160
07-Jun-2018 21:47:15 /data/tests/attachment/delete_test.php:96
07-Jun-2018 21:47:15
07-Jun-2018 21:47:15 4) phpbb_attachment_upload_test::test_upload with data set #0 ('foobar', 1, false, array(), array(array('Upload initiated but no valid...found.'), false))
07-Jun-2018 21:47:15 Argument 1 passed to phpbb\storage\storage::__construct() must implement interface phpbb\db\driver\driver_interface, instance of Mock_adapter_factory_2e413172 given, called in /data/tests/attachment/upload_test.php on line 112 and defined
07-Jun-2018 21:47:15
07-Jun-2018 21:47:15 /data/phpBB/phpbb/storage/storage.php:55
07-Jun-2018 21:47:15 /data/tests/attachment/upload_test.php:112
07-Jun-2018 21:47:15
07-Jun-2018 21:47:15 5) phpbb_attachment_upload_test::test_upload with data set #1 ('foobar', 1, true, array('foobar.jpg', 'jpg', 100), array(array('NOT_UPLOADED', 'The image file you tried to a...valid.'), false, 1))
07-Jun-2018 21:47:15 Argument 1 passed to phpbb\storage\storage::__construct() must implement interface phpbb\db\driver\driver_interface, instance of Mock_adapter_factory_2e413172 given, called in /data/tests/attachment/upload_test.php on line 112 and defined
07-Jun-2018 21:47:15
07-Jun-2018 21:47:15 /data/phpBB/phpbb/storage/storage.php:55
07-Jun-2018 21:47:15 /data/tests/attachment/upload_test.php:112
07-Jun-2018 21:47:15
07-Jun-2018 21:47:15 6) phpbb_attachment_upload_test::test_upload with data set #2 ('foobar', 1, true, array(), array(array('NOT_UPLOADED'), false, 0))
07-Jun-2018 21:47:15 Argument 1 passed to phpbb\storage\storage::__construct() must implement interface phpbb\db\driver\driver_interface, instance of Mock_adapter_factory_2e413172 given, called in /data/tests/attachment/upload_test.php on line 112 and defined
07-Jun-2018 21:47:15
07-Jun-2018 21:47:15 /data/phpBB/phpbb/storage/storage.php:55
07-Jun-2018 21:47:15 /data/tests/attachment/upload_test.php:112
07-Jun-2018 21:47:15
07-Jun-2018 21:47:15 7) phpbb_attachment_upload_test::test_init_error
07-Jun-2018 21:47:15 Argument 1 passed to phpbb\storage\storage::__construct() must implement interface phpbb\db\driver\driver_interface, instance of Mock_adapter_factory_2e413172 given, called in /data/tests/attachment/upload_test.php on line 112 and defined
07-Jun-2018 21:47:15
07-Jun-2018 21:47:15 /data/phpBB/phpbb/storage/storage.php:55
07-Jun-2018 21:47:15 /data/tests/attachment/upload_test.php:112
07-Jun-2018 21:47:15
07-Jun-2018 21:47:15 8) phpbb_attachment_upload_test::test_image_upload with data set #0 (false, false, array(), array(array('The image file you tried to a...valid.'), false, 1))
07-Jun-2018 21:47:15 Argument 1 passed to phpbb\storage\storage::__construct() must implement interface phpbb\db\driver\driver_interface, instance of Mock_adapter_factory_2e413172 given, called in /data/tests/attachment/upload_test.php on line 112 and defined
07-Jun-2018 21:47:15
07-Jun-2018 21:47:15 /data/phpBB/phpbb/storage/storage.php:55
07-Jun-2018 21:47:15 /data/tests/attachment/upload_test.php:112
07-Jun-2018 21:47:15
07-Jun-2018 21:47:15 9) phpbb_attachment_upload_test::test_image_upload with data set #1 (false, true, array(), array(array('The image file you tried to a...valid.'), false, 1))
07-Jun-2018 21:47:15 Argument 1 passed to phpbb\storage\storage::__construct() must implement interface phpbb\db\driver\driver_interface, instance of Mock_adapter_factory_2e413172 given, called in /data/tests/attachment/upload_test.php on line 112 and defined
07-Jun-2018 21:47:15
07-Jun-2018 21:47:15 /data/phpBB/phpbb/storage/storage.php:55
07-Jun-2018 21:47:15 /data/tests/attachment/upload_test.php:112
07-Jun-2018 21:47:15
07-Jun-2018 21:47:15 10) phpbb_attachment_upload_test::test_image_upload with data set #2 (true, false, array(), array(array(), true, 0, 100, 'jpg', 'jpg', 'foobar.jpg'))
07-Jun-2018 21:47:15 Argument 1 passed to phpbb\storage\storage::__construct() must implement interface phpbb\db\driver\driver_interface, instance of Mock_adapter_factory_2e413172 given, called in /data/tests/attachment/upload_test.php on line 112 and defined
07-Jun-2018 21:47:15
07-Jun-2018 21:47:15 /data/phpBB/phpbb/storage/storage.php:55
07-Jun-2018 21:47:15 /data/tests/attachment/upload_test.php:112
07-Jun-2018 21:47:15
07-Jun-2018 21:47:15 11) phpbb_attachment_upload_test::test_image_upload with data set #3 (true, false, array(true, ''), array(array(), true, 0, 100, 'jpg', 'jpg', 'foobar.jpg'))
07-Jun-2018 21:47:15 Argument 1 passed to phpbb\storage\storage::__construct() must implement interface phpbb\db\driver\driver_interface, instance of Mock_adapter_factory_2e413172 given, called in /data/tests/attachment/upload_test.php on line 112 and defined
07-Jun-2018 21:47:15
07-Jun-2018 21:47:15 /data/phpBB/phpbb/storage/storage.php:55
07-Jun-2018 21:47:15 /data/tests/attachment/upload_test.php:112
07-Jun-2018 21:47:15
07-Jun-2018 21:47:15 12) phpbb_attachment_upload_test::test_image_upload with data set #4 (true, false, array(150), array(array(), true, 0, 100, 'jpg', 'jpg', 'foobar.jpg'))
07-Jun-2018 21:47:15 Argument 1 passed to phpbb\storage\storage::__construct() must implement interface phpbb\db\driver\driver_interface, instance of Mock_adapter_factory_2e413172 given, called in /data/tests/attachment/upload_test.php on line 112 and defined
07-Jun-2018 21:47:15
07-Jun-2018 21:47:15 /data/phpBB/phpbb/storage/storage.php:55
07-Jun-2018 21:47:15 /data/tests/attachment/upload_test.php:112
07-Jun-2018 21:47:15
07-Jun-2018 21:47:15 13) phpbb_attachment_upload_test::test_image_upload with data set #5 (true, false, array(50), array(array('ATTACH_QUOTA_REACHED'), false, 1, 100, 'jpg', 'jpg', 'foobar.jpg'))
07-Jun-2018 21:47:15 Argument 1 passed to phpbb\storage\storage::__construct() must implement interface phpbb\db\driver\driver_interface, instance of Mock_adapter_factory_2e413172 given, called in /data/tests/attachment/upload_test.php on line 112 and defined
07-Jun-2018 21:47:15
07-Jun-2018 21:47:15 /data/phpBB/phpbb/storage/storage.php:55
07-Jun-2018 21:47:15 /data/tests/attachment/upload_test.php:112
07-Jun-2018 21:47:15
07-Jun-2018 21:47:15 14) phpbb_content_visibility_delete_post_test::test_delete_post with data set #0 (1, 1, 2, array(1, 3, 3, 0, 0, 1, 2, 1, true, 1, false), false, 'harddelete', array(array(1, 1, ''), array(3, 1, '')), array(array(1, 1, 3, 2, 0, 0, '')), array(array(2, 0, 0, 1, 0, 0, 3)), array(array(3)))
07-Jun-2018 21:47:15 Argument 1 passed to phpbb\storage\storage::__construct() must implement interface phpbb\db\driver\driver_interface, instance of Mock_adapter_factory_2e413172 given, called in /data/tests/content_visibility/delete_post_test.php on line 307 and defined
07-Jun-2018 21:47:15
07-Jun-2018 21:47:15 /data/phpBB/phpbb/storage/storage.php:55
07-Jun-2018 21:47:15 /data/tests/content_visibility/delete_post_test.php:307
07-Jun-2018 21:47:15
07-Jun-2018 21:47:15 15) phpbb_content_visibility_delete_post_test::test_delete_post with data set #1 (1, 1, 1, array(1, 3, 3, 0, 0, 1, 1, 1, true, 1, false), false, 'harddelete', array(array(2, 1, ''), array(3, 1, '')), array(array(1, 2, 3, 2, 0, 0, '')), array(array(2, 0, 0, 1, 0, 0, 3)), array(array(3)))
07-Jun-2018 21:47:15 Argument 1 passed to phpbb\storage\storage::__construct() must implement interface phpbb\db\driver\driver_interface, instance of Mock_adapter_factory_2e413172 given, called in /data/tests/content_visibility/delete_post_test.php on line 307 and defined
07-Jun-2018 21:47:15
07-Jun-2018 21:47:15 /data/phpBB/phpbb/storage/storage.php:55
07-Jun-2018 21:47:15 /data/tests/content_visibility/delete_post_test.php:307
07-Jun-2018 21:47:15
07-Jun-2018 21:47:15 16) phpbb_content_visibility_delete_post_test::test_delete_post with data set #2 (1, 1, 3, array(1, 3, 3, 0, 0, 1, 3, 1, true, 1, false), false, 'harddelete', array(array(1, 1, ''), array(2, 1, '')), array(array(1, 1, 2, 2, 0, 0, '')), array(array(2, 0, 0, 1, 0, 0, 2)), array(array(3)))
07-Jun-2018 21:47:15 Argument 1 passed to phpbb\storage\storage::__construct() must implement interface phpbb\db\driver\driver_interface, instance of Mock_adapter_factory_2e413172 given, called in /data/tests/content_visibility/delete_post_test.php on line 307 and defined
07-Jun-2018 21:47:15
07-Jun-2018 21:47:15 /data/phpBB/phpbb/storage/storage.php:55
07-Jun-2018 21:47:15 /data/tests/content_visibility/delete_post_test.php:307
07-Jun-2018 21:47:15
07-Jun-2018 21:47:15 17) phpbb_content_visibility_delete_post_test::test_delete_post with data set #3 (1, 1, 2, array(1, 3, 3, 0, 0, 1, 2, 1, true, 1, false), true, 'soft delete', array(array(1, 1, ''), array(2, 2, 'soft delete'), array(3, 1, '')), array(array(1, 1, 3, 2, 0, 1, '')), array(array(2, 0, 1, 1, 0, 0, 3)), array(array(3)))
07-Jun-2018 21:47:15 Argument 1 passed to phpbb\storage\storage::__construct() must implement interface phpbb\db\driver\driver_interface, instance of Mock_adapter_factory_2e413172 given, called in /data/tests/content_visibility/delete_post_test.php on line 307 and defined
07-Jun-2018 21:47:15
07-Jun-2018 21:47:15 /data/phpBB/phpbb/storage/storage.php:55
07-Jun-2018 21:47:15 /data/tests/content_visibility/delete_post_test.php:307
07-Jun-2018 21:47:15
07-Jun-2018 21:47:15 18) phpbb_content_visibility_delete_post_test::test_delete_post with data set #4 (1, 1, 1, array(1, 3, 3, 0, 0, 1, 1, 1, true, 1, false), true, 'soft delete', array(array(1, 2, 'soft delete'), array(2, 1, ''), array(3, 1, '')), array(array(1, 2, 3, 2, 0, 1, '')), array(array(2, 0, 1, 1, 0, 0, 3)), array(array(3)))
07-Jun-2018 21:47:15 Argument 1 passed to phpbb\storage\storage::__construct() must implement interface phpbb\db\driver\driver_interface, instance of Mock_adapter_factory_2e413172 given, called in /data/tests/content_visibility/delete_post_test.php on line 307 and defined
07-Jun-2018 21:47:15
07-Jun-2018 21:47:15 /data/phpBB/phpbb/storage/storage.php:55
07-Jun-2018 21:47:15 /data/tests/content_visibility/delete_post_test.php:307
07-Jun-2018 21:47:15
07-Jun-2018 21:47:15 19) phpbb_content_visibility_delete_post_test::test_delete_post with data set #5 (1, 1, 3, array(1, 3, 3, 0, 0, 1, 3, 1, true, 1, false), true, 'soft delete', array(array(1, 1, ''), array(2, 1, ''), array(3, 2, 'soft delete')), array(array(1, 1, 2, 2, 0, 1, '')), array(array(2, 0, 1, 1, 0, 0, 2)), array(array(3)))
07-Jun-2018 21:47:15 Argument 1 passed to phpbb\storage\storage::__construct() must implement interface phpbb\db\driver\driver_interface, instance of Mock_adapter_factory_2e413172 given, called in /data/tests/content_visibility/delete_post_test.php on line 307 and defined
07-Jun-2018 21:47:15
07-Jun-2018 21:47:15 /data/phpBB/phpbb/storage/storage.php:55
07-Jun-2018 21:47:15 /data/tests/content_visibility/delete_post_test.php:307
07-Jun-2018 21:47:15
07-Jun-2018 21:47:15 20) phpbb_content_visibility_delete_post_test::test_delete_post with data set #6 (2, 2, 4, array(4, 4, 1, 0, 0, 1, 4, 1, true, 1, false), false, 'harddelete', array(), array(), array(array(0, 0, 0, 0, 0, 0, 0)), array(array(3)))
07-Jun-2018 21:47:15 Argument 1 passed to phpbb\storage\storage::__construct() must implement interface phpbb\db\driver\driver_interface, instance of Mock_adapter_factory_2e413172 given, called in /data/tests/content_visibility/delete_post_test.php on line 307 and defined
07-Jun-2018 21:47:15
07-Jun-2018 21:47:15 /data/phpBB/phpbb/storage/storage.php:55
07-Jun-2018 21:47:15 /data/tests/content_visibility/delete_post_test.php:307
07-Jun-2018 21:47:15
07-Jun-2018 21:47:15 21) phpbb_content_visibility_delete_post_test::test_delete_post with data set #7 (2, 2, 4, array(4, 4, 1, 0, 0, 1, 4, 1, true, 1, false), true, 'soft delete', array(array(4, 2, '')), array(array(2, 4, 4, 0, 0, 1, 'soft delete')), array(array(0, 0, 1, 0, 0, 1, 0)), array(array(3)))
07-Jun-2018 21:47:15 Argument 1 passed to phpbb\storage\storage::__construct() must implement interface phpbb\db\driver\driver_interface, instance of Mock_adapter_factory_2e413172 given, called in /data/tests/content_visibility/delete_post_test.php on line 307 and defined
07-Jun-2018 21:47:15
07-Jun-2018 21:47:15 /data/phpBB/phpbb/storage/storage.php:55
07-Jun-2018 21:47:15 /data/tests/content_visibility/delete_post_test.php:307
07-Jun-2018 21:47:15
07-Jun-2018 21:47:15 22) phpbb_privmsgs_delete_user_pms_test::test_delete_user_pms with data set #0 (2, array(array(1)), array(array(1, 3)))
07-Jun-2018 21:47:15 Argument 1 passed to phpbb\storage\storage::__construct() must implement interface phpbb\db\driver\driver_interface, instance of Mock_adapter_factory_2e413172 given, called in /data/tests/privmsgs/delete_user_pms_test.php on line 101 and defined
07-Jun-2018 21:47:15
07-Jun-2018 21:47:15 /data/phpBB/phpbb/storage/storage.php:55
07-Jun-2018 21:47:15 /data/tests/privmsgs/delete_user_pms_test.php:101
07-Jun-2018 21:47:15
07-Jun-2018 21:47:15 23) phpbb_privmsgs_delete_user_pms_test::test_delete_user_pms with data set #1 (3, array(array(1), array(2), array(3), array(5)), array(array(1, 2), array(1, 4), array(2, 2), array(2, 4), array(3, 2), array(5, 2), array(5, 4)))
07-Jun-2018 21:47:15 Argument 1 passed to phpbb\storage\storage::__construct() must implement interface phpbb\db\driver\driver_interface, instance of Mock_adapter_factory_2e413172 given, called in /data/tests/privmsgs/delete_user_pms_test.php on line 101 and defined
07-Jun-2018 21:47:15
07-Jun-2018 21:47:15 /data/phpBB/phpbb/storage/storage.php:55
07-Jun-2018 21:47:15 /data/tests/privmsgs/delete_user_pms_test.php:101
07-Jun-2018 21:47:15
07-Jun-2018 21:47:15 24) phpbb_privmsgs_delete_user_pms_test::test_delete_user_pms with data set #2 (5, array(array(1), array(2), array(3), array(4), array(5)), array(array(1, 2), array(1, 3), array(1, 4), array(2, 2), array(2, 4), array(3, 2), array(4, 3), array(5, 2), array(5, 3), array(5, 4)))
07-Jun-2018 21:47:15 Argument 1 passed to phpbb\storage\storage::__construct() must implement interface phpbb\db\driver\driver_interface, instance of Mock_adapter_factory_2e413172 given, called in /data/tests/privmsgs/delete_user_pms_test.php on line 101 and defined
07-Jun-2018 21:47:15
07-Jun-2018 21:47:15 /data/phpBB/phpbb/storage/storage.php:55
07-Jun-2018 21:47:15 /data/tests/privmsgs/delete_user_pms_test.php:101
07-Jun-2018 21:47:15
07-Jun-2018 21:47:15 --
07-Jun-2018 21:47:15
07-Jun-2018 21:47:15 There was 1 warning:
07-Jun-2018 21:47:15
07-Jun-2018 21:47:15 1) phpbb_console_user_add_test::test_add_dialog
07-Jun-2018 21:47:15 PHPUnit_Framework_TestCase::getMock() is deprecated, use PHPUnit_Framework_TestCase::createMock() or PHPUnit_Framework_TestCase::getMockBuilder() instead
07-Jun-2018 21:47:15
07-Jun-2018 21:47:15 ERRORS!
07-Jun-2018 21:47:15 Tests: 9484, Assertions: 89372, Errors: 24, Warnings: 1, Skipped: 297, Incomplete: 5.
07-Jun-2018 21:47:17 Error occurred while running Task 'Run tests(10)' of type com.atlassian.bamboo.plugins.bamboo-docker-plugin:task.docker.cli.
07-Jun-2018 21:47:17 com.atlassian.bamboo.task.TaskException: Failed to execute task
07-Jun-2018 21:47:17         at com.atlassian.bamboo.plugins.docker.service.RunService.execute(RunService.java:75)
07-Jun-2018 21:47:17         at com.atlassian.bamboo.plugins.docker.tasks.cli.DockerCliTask.execute(DockerCliTask.java:70)
07-Jun-2018 21:47:17         at com.atlassian.bamboo.task.TaskExecutorImpl.lambda$executeTasks$3(TaskExecutorImpl.java:285)
07-Jun-2018 21:47:17         at com.atlassian.bamboo.task.TaskExecutorImpl.executeTaskWithPrePostActions(TaskExecutorImpl.java:224)
07-Jun-2018 21:47:17         at com.atlassian.bamboo.task.TaskExecutorImpl.executeTasks(TaskExecutorImpl.java:285)
07-Jun-2018 21:47:17         at com.atlassian.bamboo.task.TaskExecutorImpl.execute(TaskExecutorImpl.java:112)
07-Jun-2018 21:47:17         at com.atlassian.bamboo.build.pipeline.tasks.ExecuteBuildTask.call(ExecuteBuildTask.java:71)
07-Jun-2018 21:47:17         at com.atlassian.bamboo.v2.build.agent.DefaultBuildAgent.executeBuildPhase(DefaultBuildAgent.java:203)
07-Jun-2018 21:47:17         at com.atlassian.bamboo.v2.build.agent.DefaultBuildAgent.build(DefaultBuildAgent.java:175)
07-Jun-2018 21:47:17         at com.atlassian.bamboo.v2.build.agent.BuildAgentControllerImpl.lambda$waitAndPerformBuild$0(BuildAgentControllerImpl.java:122)
07-Jun-2018 21:47:17         at com.atlassian.bamboo.variable.CustomVariableContextImpl.withVariableSubstitutor(CustomVariableContextImpl.java:185)
07-Jun-2018 21:47:17         at com.atlassian.bamboo.v2.build.agent.BuildAgentControllerImpl.waitAndPerformBuild(BuildAgentControllerImpl.java:117)
07-Jun-2018 21:47:17         at com.atlassian.bamboo.v2.build.agent.DefaultBuildAgent$1.run(DefaultBuildAgent.java:126)
07-Jun-2018 21:47:17         at com.atlassian.bamboo.utils.BambooRunnables$1.run(BambooRunnables.java:48)
07-Jun-2018 21:47:17         at com.atlassian.bamboo.security.ImpersonationHelper.runWith(ImpersonationHelper.java:26)
07-Jun-2018 21:47:17         at com.atlassian.bamboo.security.ImpersonationHelper.runWithSystemAuthority(ImpersonationHelper.java:17)
07-Jun-2018 21:47:17         at com.atlassian.bamboo.security.ImpersonationHelper$1.run(ImpersonationHelper.java:41)
07-Jun-2018 21:47:17         at java.lang.Thread.run(Thread.java:748)
07-Jun-2018 21:47:17 Caused by: com.atlassian.bamboo.docker.DockerException: Error running Docker run command
07-Jun-2018 21:47:17         at com.atlassian.bamboo.docker.DockerContainerServiceImpl.run(DockerContainerServiceImpl.java:118)
07-Jun-2018 21:47:17         at sun.reflect.GeneratedMethodAccessor2553.invoke(Unknown Source)
07-Jun-2018 21:47:17         at sun.reflect.DelegatingMethodAccessorImpl.invoke(DelegatingMethodAccessorImpl.java:43)
07-Jun-2018 21:47:17         at java.lang.reflect.Method.invoke(Method.java:498)
07-Jun-2018 21:47:17         at com.atlassian.plugin.util.ContextClassLoaderSettingInvocationHandler.invoke(ContextClassLoaderSettingInvocationHandler.java:26)
07-Jun-2018 21:47:17         at com.sun.proxy.$Proxy401.run(Unknown Source)
07-Jun-2018 21:47:17         at sun.reflect.GeneratedMethodAccessor2553.invoke(Unknown Source)
07-Jun-2018 21:47:17         at sun.reflect.DelegatingMethodAccessorImpl.invoke(DelegatingMethodAccessorImpl.java:43)
07-Jun-2018 21:47:17         at java.lang.reflect.Method.invoke(Method.java:498)
07-Jun-2018 21:47:17         at org.springframework.aop.support.AopUtils.invokeJoinpointUsingReflection(AopUtils.java:302)
07-Jun-2018 21:47:17         at org.eclipse.gemini.blueprint.service.importer.support.internal.aop.ServiceInvoker.doInvoke(ServiceInvoker.java:56)
07-Jun-2018 21:47:17         at org.eclipse.gemini.blueprint.service.importer.support.internal.aop.ServiceInvoker.invoke(ServiceInvoker.java:60)
07-Jun-2018 21:47:17         at org.springframework.aop.framework.ReflectiveMethodInvocation.proceed(ReflectiveMethodInvocation.java:179)
07-Jun-2018 21:47:17         at org.springframework.aop.support.DelegatingIntroductionInterceptor.doProceed(DelegatingIntroductionInterceptor.java:133)
07-Jun-2018 21:47:17         at org.springframework.aop.support.DelegatingIntroductionInterceptor.invoke(DelegatingIntroductionInterceptor.java:121)
07-Jun-2018 21:47:17         at org.springframework.aop.framework.ReflectiveMethodInvocation.proceed(ReflectiveMethodInvocation.java:179)
07-Jun-2018 21:47:17         at org.eclipse.gemini.blueprint.service.util.internal.aop.ServiceTCCLInterceptor.invokeUnprivileged(ServiceTCCLInterceptor.java:70)
07-Jun-2018 21:47:17         at org.eclipse.gemini.blueprint.service.util.internal.aop.ServiceTCCLInterceptor.invoke(ServiceTCCLInterceptor.java:53)
07-Jun-2018 21:47:17         at org.springframework.aop.framework.ReflectiveMethodInvocation.proceed(ReflectiveMethodInvocation.java:179)
07-Jun-2018 21:47:17         at org.eclipse.gemini.blueprint.service.importer.support.LocalBundleContextAdvice.invoke(LocalBundleContextAdvice.java:57)
07-Jun-2018 21:47:17         at org.springframework.aop.framework.ReflectiveMethodInvocation.proceed(ReflectiveMethodInvocation.java:179)
07-Jun-2018 21:47:17         at org.springframework.aop.support.DelegatingIntroductionInterceptor.doProceed(DelegatingIntroductionInterceptor.java:133)
07-Jun-2018 21:47:17         at org.springframework.aop.support.DelegatingIntroductionInterceptor.invoke(DelegatingIntroductionInterceptor.java:121)
07-Jun-2018 21:47:17         at org.springframework.aop.framework.ReflectiveMethodInvocation.proceed(ReflectiveMethodInvocation.java:179)
07-Jun-2018 21:47:17         at org.springframework.aop.framework.JdkDynamicAopProxy.invoke(JdkDynamicAopProxy.java:207)
07-Jun-2018 21:47:17         at com.sun.proxy.$Proxy679.run(Unknown Source)
07-Jun-2018 21:47:17         at com.atlassian.bamboo.plugins.docker.client.DockerCmd.run(DockerCmd.java:51)
07-Jun-2018 21:47:17         at com.atlassian.bamboo.plugins.docker.service.RunService.execute(RunService.java:64)
07-Jun-2018 21:47:17         ... 17 more
07-Jun-2018 21:47:17 Caused by: com.atlassian.utils.process.ProcessException: Error executing /usr/bin/docker run --volume /home/bamboo/xml-data/build-dir/PHPBB3-PR-JOB1:/data --workdir /data --rm -u=991 -t phpbb:php-5.6 /bin/bash -c "phpBB/vendor/bin/phpunit --log-junit build/logs/phpunit.xml"
07-Jun-2018 21:47:17         at com.atlassian.bamboo.docker.DockerContainerServiceImpl.execute(DockerContainerServiceImpl.java:252)
07-Jun-2018 21:47:17         at com.atlassian.bamboo.docker.DockerContainerServiceImpl.run(DockerContainerServiceImpl.java:106)
07-Jun-2018 21:47:17         ... 44 more
07-Jun-2018 21:47:17 Starting task 'Parsing test results produced by script' of type 'com.atlassian.bamboo.plugins.testresultparser:task.testresultparser.junit'
07-Jun-2018 21:47:17 Parsing test results under /home/bamboo/xml-data/build-dir/PHPBB3-PR-JOB1...
07-Jun-2018 21:47:17 Failing task since 24 failing test cases were found.
07-Jun-2018 21:47:17 Finished task 'Parsing test results produced by script' with result: Failed
07-Jun-2018 21:47:17
Substituting variable: ${bamboo.PRnumber} with 4933
07-Jun-2018 21:47:17
Substituting variable: ${bamboo.buildResultsUrl} with https://bamboo.phpbb.com/browse/PHPBB3-PR-JOB1-8193
07-Jun-2018 21:47:17
Substituting variable: ${bamboo.buildResultsUrl} with https://bamboo.phpbb.com/browse/PHPBB3-PR-JOB1-8193
07-Jun-2018 21:47:17 Starting task 'Set result build status' of type 'com.atlassian.bamboo.plugins.scripttask:task.builder.script'
07-Jun-2018 21:47:17
Beginning to execute external process for build 'phpBB3 - Pull Requests - Build and Test Job #8193 (PHPBB3-PR-JOB1-8193)'
... running command line:
/bin/sh /home/bamboo/temp/PHPBB3-PR-JOB1-8193-ScriptBuildTask-5047041678496149957.sh
... in: /home/bamboo/xml-data/build-dir/PHPBB3-PR-JOB1
... using extra environment variables:
bamboo_planRepository_1_branch=3.1.x
bamboo_planRepository_1_branchDisplayName=3.1.x
bamboo_repository_revision_number=dc8ff9da28b8ab4ad11c7ea94cca526f17c87fe5
bamboo_PRref=master
bamboo_resultsUrl=https://bamboo.phpbb.com/browse/PHPBB3-PR-JOB1-8193
bamboo_capability_system_builder_command_Git=/usr/bin/git
bamboo_repository_75956235_git_username=bantu
bamboo_build_working_directory=/home/bamboo/xml-data/build-dir/PHPBB3-PR-JOB1
bamboo_planRepository_1_name=phpBB Ascraeus
bamboo_buildKey=PHPBB3-PR-JOB1
bamboo_capability_phpbb_tests=true
bamboo_shortPlanName=Pull Requests
bamboo_capability_system_builder_command_fop=/usr/bin/fop
bamboo_capability_dbms_sqlite_2=true
bamboo_planRepository_name=phpBB Ascraeus
bamboo_PRnumber=4933
bamboo_buildNumber=8193
bamboo_repository_75956235_git_repositoryUrl=https://github.com/phpbb/phpbb.git
bamboo_capability_system_builder_phpunit_PHPUnit=/usr/bin/phpunit
bamboo_shortJobName=Build and Test Job
bamboo_buildResultsUrl=https://bamboo.phpbb.com/browse/PHPBB3-PR-JOB1-8193
bamboo_repository_75956235_branch_name=3.1.x
bamboo_planRepository_repositoryUrl=https://github.com/phpbb/phpbb.git
bamboo_agentId=131073
bamboo_planName=phpBB3 - Pull Requests
bamboo_build_commandline_com_atlassian_bamboo_plugins_scripttask_task_builder_script_7=/bin/sh /home/bamboo/temp/PHPBB3-PR-JOB1-8193-ScriptBuildTask-6376562063448389126.sh
bamboo_shortPlanKey=PR
bamboo_shortJobKey=JOB1
bamboo_capability_dbms_mysql_55=true
bamboo_capability_system_jdk_JDK_1_7_0_65=/usr/lib/jvm/java-7-openjdk-amd64
bamboo_planRepository_revision=dc8ff9da28b8ab4ad11c7ea94cca526f17c87fe5
bamboo_buildTimeStamp=2018-06-07T21:39:48.353Z
bamboo_repository_previous_revision_number=dc8ff9da28b8ab4ad11c7ea94cca526f17c87fe5
bamboo_capability_system_jdk_JDK_1_6_0_16=/usr/lib/jvm/java-6-sun-1.6.0.16
bamboo_capability_system_builder_mvn2_Maven_2=/usr/share/maven2
bamboo_planRepository_previousRevision=dc8ff9da28b8ab4ad11c7ea94cca526f17c87fe5
bamboo_build_commandline_com_atlassian_bamboo_plugins_scripttask_task_builder_script_4=/bin/sh /home/bamboo/temp/PHPBB3-PR-JOB1-8193-ScriptBuildTask-6194527675238120582.sh
bamboo_repository_git_branch=3.1.x
bamboo_buildResultKey=PHPBB3-PR-JOB1-8193
bamboo_repository_branch_name=3.1.x
bamboo_buildPlanName=phpBB3 - Pull Requests - Build and Test Job
bamboo_planRepository_1_revision=dc8ff9da28b8ab4ad11c7ea94cca526f17c87fe5
bamboo_repository_name=phpBB Ascraeus
bamboo_buildFailed=true
bamboo_build_commandline_com_atlassian_bamboo_plugins_bamboo_docker_plugin_task_docker_cli_10=/usr/bin/docker run --volume /home/bamboo/xml-data/build-dir/PHPBB3-PR-JOB1:/data --workdir /data --rm -u=991 -t phpbb:php-5.6 /bin/bash -c phpBB/vendor/bin/phpunit --log-junit build/logs/phpunit.xml
bamboo_capability_system_docker_executable=/usr/bin/docker
bamboo_build_commandline_com_atlassian_bamboo_plugins_bamboo_docker_plugin_task_docker_cli_11=/usr/bin/docker run --volume /home/bamboo/xml-data/build-dir/PHPBB3-PR-JOB1:/data --workdir /data/build --rm -u=991 phpbb:php-5.6 ../phpBB/vendor/bin/phing sniff
bamboo_build_commandline_com_atlassian_bamboo_plugins_bamboo_docker_plugin_task_docker_cli_12=/usr/bin/docker run --volume /home/bamboo/xml-data/build-dir/PHPBB3-PR-JOB1:/data --workdir /data/phpBB --rm -e HOME=/home/bamboo -u=991 phpbb:php-5.6 /bin/bash -c php ../composer.phar install --dev; cd ../build; ../phpBB/vendor/bin/phing clean prepare
bamboo_planRepository_branch=3.1.x
bamboo_agentWorkingDirectory=/home/bamboo/xml-data/build-dir
bamboo_jobFailed=true
bamboo_capability_system_git_executable=/usr/bin/git
bamboo_capability_system_builder_phpunit_PHPUnit_3_4=/usr/bin/phpunit
bamboo_repository_git_username=bantu
bamboo_planRepository_1_previousRevision=dc8ff9da28b8ab4ad11c7ea94cca526f17c87fe5
bamboo_repository_75956235_revision_number=dc8ff9da28b8ab4ad11c7ea94cca526f17c87fe5
bamboo_planRepository_branchDisplayName=3.1.x
bamboo_planRepository_1_type=gitv2
bamboo_planRepository_branchName=3.1.x
bamboo_repository_75956235_previous_revision_number=dc8ff9da28b8ab4ad11c7ea94cca526f17c87fe5
bamboo_capability_system_jdk_JDK=/usr/lib/jvm/java-6-sun
bamboo_plan_storageTag=PHPBB3-PR
bamboo_hg_cache_directory=/home/bamboo/xml-data/build-dir/_hg-repositories-cache
bamboo_planRepository_1_username=bantu
bamboo_planRepository_type=gitv2
bamboo_git_cache_directory=/home/bamboo/xml-data/build-dir/_git-repositories-cache
bamboo_ManualBuildTriggerReason_userName=Build Robot
bamboo_repository_git_repositoryUrl=https://github.com/phpbb/phpbb.git
bamboo_repository_75956235_git_branch=3.1.x
bamboo_capability_system_builder_ant_Ant=/usr/share/ant
bamboo_repository_75956235_name=phpBB Ascraeus
bamboo_tmp_directory=/home/bamboo/temp
bamboo_working_directory=/home/bamboo/xml-data/build-dir/PHPBB3-PR-JOB1
bamboo_planKey=PHPBB3-PR
bamboo_capability_local=true
bamboo_planRepository_1_repositoryUrl=https://github.com/phpbb/phpbb.git
bamboo_planRepository_username=bantu
bamboo_capability_system_jdk_JDK_1_6=/usr/lib/jvm/java-6-sun
bamboo_capability_system_jdk_JDK_1_7=/usr/lib/jvm/java-7-openjdk-amd64
bamboo_planRepository_1_branchName=3.1.x
07-Jun-2018 21:47:18 From https://github.com/phpbb/phpbb
07-Jun-2018 21:47:18 * branch            refs/pull/4933/head -> FETCH_HEAD
07-Jun-2018 21:47:18       <testsuite name="phpbb_attachment_delete_test" file="/data/tests/attachment/delete_test.php" tests="12" assertions="9" failures="0" errors="3" time="2.182867">
07-Jun-2018 21:47:18         <testsuite name="phpbb_attachment_delete_test::test_attachment_delete" tests="9" assertions="6" failures="0" errors="3" time="1.778500">
07-Jun-2018 21:47:18         <testsuite name="phpbb_attachment_upload_test::test_upload" tests="3" assertions="0" failures="0" errors="3" time="0.408538">
07-Jun-2018 21:47:18         <testsuite name="phpbb_attachment_upload_test::test_image_upload" tests="6" assertions="0" failures="0" errors="6" time="0.845658">
07-Jun-2018 21:47:18       <testsuite name="phpbb_content_visibility_delete_post_test" file="/data/tests/content_visibility/delete_post_test.php" tests="8" assertions="0" failures="0" errors="8" time="0.854552">
07-Jun-2018 21:47:18         <testsuite name="phpbb_content_visibility_delete_post_test::test_delete_post" tests="8" assertions="0" failures="0" errors="8" time="0.854552">
07-Jun-2018 21:47:18       <testsuite name="phpbb_privmsgs_delete_user_pms_test" file="/data/tests/privmsgs/delete_user_pms_test.php" tests="3" assertions="0" failures="0" errors="3" time="0.480535">
07-Jun-2018 21:47:18         <testsuite name="phpbb_privmsgs_delete_user_pms_test::test_delete_user_pms" tests="3" assertions="0" failures="0" errors="3" time="0.480535">
07-Jun-2018 21:47:18   % Total    % Received % Xferd  Average Speed   Time    Time     Time  Current
07-Jun-2018 21:47:18                                  Dload  Upload   Total   Spent    Left  Speed
07-Jun-2018 21:47:18
07-Jun-2018 21:47:19   0     0    0     0    0     0      0      0 --:--:-- --:--:-- --:--:--     0
07-Jun-2018 21:47:19   0     0    0     0    0     0      0      0 --:--:-- --:--:-- --:--:--     0
07-Jun-2018 21:47:19 100   267  100    93  100   174    180    336 --:--:-- --:--:-- --:--:--   336
07-Jun-2018 21:47:19 Finished task 'Set result build status' with result: Success
07-Jun-2018 21:47:19 Running post build plugin 'NCover Results Collector'
07-Jun-2018 21:47:19 Running post build plugin 'Artifact Copier'
07-Jun-2018 21:47:19 Running post build plugin 'npm Cache Cleanup'
07-Jun-2018 21:47:19 Running post build plugin 'Clover Results Collector'
07-Jun-2018 21:47:19 Running post build plugin 'Docker Container Cleanup'
07-Jun-2018 21:47:19 Successfully removed working directory at '/home/bamboo/xml-data/build-dir/PHPBB3-PR-JOB1'
07-Jun-2018 21:47:19 Finalising the build...
07-Jun-2018 21:47:19 Stopping timer.
07-Jun-2018 21:47:19 Build PHPBB3-PR-JOB1-8193 completed.
07-Jun-2018 21:47:19 Running on server: post build plugin 'NCover Results Collector'
07-Jun-2018 21:47:19 Running on server: post build plugin 'Build Hanging Detection Configuration'
07-Jun-2018 21:47:19 Running on server: post build plugin 'Clover Delta Calculator'
07-Jun-2018 21:47:20 Running on server: post build plugin 'Maven Dependencies Postprocessor'
07-Jun-2018 21:47:20 All post build plugins have finished
07-Jun-2018 21:47:20 Generating build results summary...
07-Jun-2018 21:47:25 Saving build results to disk...
07-Jun-2018 21:47:25 Logging substituted variables...
07-Jun-2018 21:47:25 Indexing build results...
07-Jun-2018 21:47:25 Finished building PHPBB3-PR-JOB1-8193.
07-Jun-2018 21:47:25
Substituting variable: ${bamboo.PRnumber} with 4933