Tests pending pull requests

Build: #8238 failed

Job: Build and Test Job failed

Stages & jobs

  1. Build and Test

Build log

The build generated 351 lines of output. Download or view full build log

17-Jun-2018 11:41:16 Build phpBB3 - Pull Requests - Build and Test Job #8238 (PHPBB3-PR-JOB1-8238) started building on agent Default Agent
17-Jun-2018 11:41:16
17-Jun-2018 11:41:16 Build working directory is /home/bamboo/xml-data/build-dir/PHPBB3-PR-JOB1
17-Jun-2018 11:41:16 Executing build phpBB3 - Pull Requests - Build and Test Job #8238 (PHPBB3-PR-JOB1-8238)
17-Jun-2018 11:41:16 Starting task 'Checkout develop branch' of type 'com.atlassian.bamboo.plugins.vcs:task.vcs.checkout'
17-Jun-2018 11:41:16 Build always requires a clean checkout
17-Jun-2018 11:41:16 Cleaning build directory '/home/bamboo/xml-data/build-dir/PHPBB3-PR-JOB1'
17-Jun-2018 11:41:16 Checking out into /home/bamboo/xml-data/build-dir/PHPBB3-PR-JOB1
17-Jun-2018 11:41:16 Updating source code to revision: dc8ff9da28b8ab4ad11c7ea94cca526f17c87fe5
17-Jun-2018 11:41:16 Fetching 'refs/heads/3.1.x' from 'https://github.com/phpbb/phpbb.git'.
17-Jun-2018 11:41:17 Checking out revision dc8ff9da28b8ab4ad11c7ea94cca526f17c87fe5.
17-Jun-2018 11:41:17 Creating local git repository in '/home/bamboo/xml-data/build-dir/PHPBB3-PR-JOB1/.git'.
17-Jun-2018 11:41:17 Cloning into '/home/bamboo/xml-data/build-dir/PHPBB3-PR-JOB1'...
17-Jun-2018 11:41:17 done.
17-Jun-2018 11:41:19 Switched to a new branch '3.1.x'
17-Jun-2018 11:41:19 Branch 3.1.x set up to track remote branch 3.1.x from origin.
17-Jun-2018 11:41:19 Updated source code to revision: dc8ff9da28b8ab4ad11c7ea94cca526f17c87fe5
17-Jun-2018 11:41:19 Finished task 'Checkout develop branch' with result: Success
17-Jun-2018 11:41:19 Running pre-build action: VCS Version Collector
17-Jun-2018 11:41:19
Substituting variable: ${bamboo.PRnumber} with 5243
17-Jun-2018 11:41:19
Substituting variable: ${bamboo.buildResultsUrl} with https://bamboo.phpbb.com/browse/PHPBB3-PR-JOB1-8238
17-Jun-2018 11:41:19 Starting task 'Set pending build status' of type 'com.atlassian.bamboo.plugins.scripttask:task.builder.script'
17-Jun-2018 11:41:19
Beginning to execute external process for build 'phpBB3 - Pull Requests - Build and Test Job #8238 (PHPBB3-PR-JOB1-8238)'
... running command line:
/bin/sh /home/bamboo/temp/PHPBB3-PR-JOB1-8238-ScriptBuildTask-8069134794913188158.sh
... in: /home/bamboo/xml-data/build-dir/PHPBB3-PR-JOB1
... using extra environment variables:
bamboo_planRepository_1_branch=3.1.x
bamboo_planRepository_1_branchDisplayName=3.1.x
bamboo_repository_revision_number=dc8ff9da28b8ab4ad11c7ea94cca526f17c87fe5
bamboo_PRref=master
bamboo_resultsUrl=https://bamboo.phpbb.com/browse/PHPBB3-PR-JOB1-8238
bamboo_capability_system_builder_command_Git=/usr/bin/git
bamboo_repository_75956235_git_username=bantu
bamboo_build_working_directory=/home/bamboo/xml-data/build-dir/PHPBB3-PR-JOB1
bamboo_planRepository_1_name=phpBB Ascraeus
bamboo_buildKey=PHPBB3-PR-JOB1
bamboo_capability_phpbb_tests=true
bamboo_shortPlanName=Pull Requests
bamboo_capability_system_builder_command_fop=/usr/bin/fop
bamboo_capability_dbms_sqlite_2=true
bamboo_planRepository_name=phpBB Ascraeus
bamboo_PRnumber=5243
bamboo_buildNumber=8238
bamboo_repository_75956235_git_repositoryUrl=https://github.com/phpbb/phpbb.git
bamboo_capability_system_builder_phpunit_PHPUnit=/usr/bin/phpunit
bamboo_shortJobName=Build and Test Job
bamboo_buildResultsUrl=https://bamboo.phpbb.com/browse/PHPBB3-PR-JOB1-8238
bamboo_repository_75956235_branch_name=3.1.x
bamboo_planRepository_repositoryUrl=https://github.com/phpbb/phpbb.git
bamboo_agentId=131073
bamboo_planName=phpBB3 - Pull Requests
bamboo_shortPlanKey=PR
bamboo_shortJobKey=JOB1
bamboo_capability_dbms_mysql_55=true
bamboo_capability_system_jdk_JDK_1_7_0_65=/usr/lib/jvm/java-7-openjdk-amd64
bamboo_planRepository_revision=dc8ff9da28b8ab4ad11c7ea94cca526f17c87fe5
bamboo_buildTimeStamp=2018-06-17T11:41:16.563Z
bamboo_repository_previous_revision_number=dc8ff9da28b8ab4ad11c7ea94cca526f17c87fe5
bamboo_capability_system_jdk_JDK_1_6_0_16=/usr/lib/jvm/java-6-sun-1.6.0.16
bamboo_capability_system_builder_mvn2_Maven_2=/usr/share/maven2
bamboo_planRepository_previousRevision=dc8ff9da28b8ab4ad11c7ea94cca526f17c87fe5
bamboo_repository_git_branch=3.1.x
bamboo_buildResultKey=PHPBB3-PR-JOB1-8238
bamboo_repository_branch_name=3.1.x
bamboo_buildPlanName=phpBB3 - Pull Requests - Build and Test Job
bamboo_planRepository_1_revision=dc8ff9da28b8ab4ad11c7ea94cca526f17c87fe5
bamboo_repository_name=phpBB Ascraeus
bamboo_buildFailed=false
bamboo_capability_system_docker_executable=/usr/bin/docker
bamboo_planRepository_branch=3.1.x
bamboo_agentWorkingDirectory=/home/bamboo/xml-data/build-dir
bamboo_capability_system_git_executable=/usr/bin/git
bamboo_capability_system_builder_phpunit_PHPUnit_3_4=/usr/bin/phpunit
bamboo_repository_git_username=bantu
bamboo_planRepository_1_previousRevision=dc8ff9da28b8ab4ad11c7ea94cca526f17c87fe5
bamboo_repository_75956235_revision_number=dc8ff9da28b8ab4ad11c7ea94cca526f17c87fe5
bamboo_planRepository_branchDisplayName=3.1.x
bamboo_planRepository_1_type=gitv2
bamboo_planRepository_branchName=3.1.x
bamboo_repository_75956235_previous_revision_number=dc8ff9da28b8ab4ad11c7ea94cca526f17c87fe5
bamboo_capability_system_jdk_JDK=/usr/lib/jvm/java-6-sun
bamboo_plan_storageTag=PHPBB3-PR
bamboo_hg_cache_directory=/home/bamboo/xml-data/build-dir/_hg-repositories-cache
bamboo_planRepository_1_username=bantu
bamboo_planRepository_type=gitv2
bamboo_git_cache_directory=/home/bamboo/xml-data/build-dir/_git-repositories-cache
bamboo_ManualBuildTriggerReason_userName=Build Robot
bamboo_repository_git_repositoryUrl=https://github.com/phpbb/phpbb.git
bamboo_repository_75956235_git_branch=3.1.x
bamboo_capability_system_builder_ant_Ant=/usr/share/ant
bamboo_repository_75956235_name=phpBB Ascraeus
bamboo_tmp_directory=/home/bamboo/temp
bamboo_working_directory=/home/bamboo/xml-data/build-dir/PHPBB3-PR-JOB1
bamboo_planKey=PHPBB3-PR
bamboo_capability_local=true
bamboo_planRepository_1_repositoryUrl=https://github.com/phpbb/phpbb.git
bamboo_planRepository_username=bantu
bamboo_capability_system_jdk_JDK_1_6=/usr/lib/jvm/java-6-sun
bamboo_capability_system_jdk_JDK_1_7=/usr/lib/jvm/java-7-openjdk-amd64
bamboo_planRepository_1_branchName=3.1.x
17-Jun-2018 11:41:21 From https://github.com/phpbb/phpbb
17-Jun-2018 11:41:21 * branch            refs/pull/5243/head -> FETCH_HEAD
17-Jun-2018 11:41:21   % Total    % Received % Xferd  Average Speed   Time    Time     Time  Current
17-Jun-2018 11:41:21                                  Dload  Upload   Total   Spent    Left  Speed
17-Jun-2018 11:41:21
17-Jun-2018 11:41:22   0     0    0     0    0     0      0      0 --:--:-- --:--:-- --:--:--     0
17-Jun-2018 11:41:22   0     0    0     0    0     0      0      0 --:--:-- --:--:-- --:--:--     0
17-Jun-2018 11:41:22 100   275  100    93  100   182    167    328 --:--:-- --:--:-- --:--:--   328
17-Jun-2018 11:41:22 Finished task 'Set pending build status' with result: Success
17-Jun-2018 11:41:22
Substituting variable: ${bamboo.PRnumber} with 5243
17-Jun-2018 11:41:22 Starting task 'Fetch PR' of type 'com.atlassian.bamboo.plugins.scripttask:task.builder.script'
17-Jun-2018 11:41:22
Beginning to execute external process for build 'phpBB3 - Pull Requests - Build and Test Job #8238 (PHPBB3-PR-JOB1-8238)'
... running command line:
/bin/sh /home/bamboo/temp/PHPBB3-PR-JOB1-8238-ScriptBuildTask-3238172609609011871.sh
... in: /home/bamboo/xml-data/build-dir/PHPBB3-PR-JOB1
... using extra environment variables:
bamboo_planRepository_1_branch=3.1.x
bamboo_planRepository_1_branchDisplayName=3.1.x
bamboo_repository_revision_number=dc8ff9da28b8ab4ad11c7ea94cca526f17c87fe5
bamboo_PRref=master
bamboo_resultsUrl=https://bamboo.phpbb.com/browse/PHPBB3-PR-JOB1-8238
bamboo_capability_system_builder_command_Git=/usr/bin/git
bamboo_repository_75956235_git_username=bantu
bamboo_build_working_directory=/home/bamboo/xml-data/build-dir/PHPBB3-PR-JOB1
bamboo_planRepository_1_name=phpBB Ascraeus
bamboo_buildKey=PHPBB3-PR-JOB1
bamboo_capability_phpbb_tests=true
bamboo_shortPlanName=Pull Requests
bamboo_capability_system_builder_command_fop=/usr/bin/fop
bamboo_capability_dbms_sqlite_2=true
bamboo_planRepository_name=phpBB Ascraeus
bamboo_PRnumber=5243
bamboo_buildNumber=8238
bamboo_repository_75956235_git_repositoryUrl=https://github.com/phpbb/phpbb.git
bamboo_capability_system_builder_phpunit_PHPUnit=/usr/bin/phpunit
bamboo_shortJobName=Build and Test Job
bamboo_buildResultsUrl=https://bamboo.phpbb.com/browse/PHPBB3-PR-JOB1-8238
bamboo_repository_75956235_branch_name=3.1.x
bamboo_planRepository_repositoryUrl=https://github.com/phpbb/phpbb.git
bamboo_agentId=131073
bamboo_planName=phpBB3 - Pull Requests
bamboo_build_commandline_com_atlassian_bamboo_plugins_scripttask_task_builder_script_7=/bin/sh /home/bamboo/temp/PHPBB3-PR-JOB1-8238-ScriptBuildTask-8069134794913188158.sh
bamboo_shortPlanKey=PR
bamboo_shortJobKey=JOB1
bamboo_capability_dbms_mysql_55=true
bamboo_capability_system_jdk_JDK_1_7_0_65=/usr/lib/jvm/java-7-openjdk-amd64
bamboo_planRepository_revision=dc8ff9da28b8ab4ad11c7ea94cca526f17c87fe5
bamboo_buildTimeStamp=2018-06-17T11:41:16.563Z
bamboo_repository_previous_revision_number=dc8ff9da28b8ab4ad11c7ea94cca526f17c87fe5
bamboo_capability_system_jdk_JDK_1_6_0_16=/usr/lib/jvm/java-6-sun-1.6.0.16
bamboo_capability_system_builder_mvn2_Maven_2=/usr/share/maven2
bamboo_planRepository_previousRevision=dc8ff9da28b8ab4ad11c7ea94cca526f17c87fe5
bamboo_repository_git_branch=3.1.x
bamboo_buildResultKey=PHPBB3-PR-JOB1-8238
bamboo_repository_branch_name=3.1.x
bamboo_buildPlanName=phpBB3 - Pull Requests - Build and Test Job
bamboo_planRepository_1_revision=dc8ff9da28b8ab4ad11c7ea94cca526f17c87fe5
bamboo_repository_name=phpBB Ascraeus
bamboo_buildFailed=false
bamboo_capability_system_docker_executable=/usr/bin/docker
bamboo_planRepository_branch=3.1.x
bamboo_agentWorkingDirectory=/home/bamboo/xml-data/build-dir
bamboo_capability_system_git_executable=/usr/bin/git
bamboo_capability_system_builder_phpunit_PHPUnit_3_4=/usr/bin/phpunit
bamboo_repository_git_username=bantu
bamboo_planRepository_1_previousRevision=dc8ff9da28b8ab4ad11c7ea94cca526f17c87fe5
bamboo_repository_75956235_revision_number=dc8ff9da28b8ab4ad11c7ea94cca526f17c87fe5
bamboo_planRepository_branchDisplayName=3.1.x
bamboo_planRepository_1_type=gitv2
bamboo_planRepository_branchName=3.1.x
bamboo_repository_75956235_previous_revision_number=dc8ff9da28b8ab4ad11c7ea94cca526f17c87fe5
bamboo_capability_system_jdk_JDK=/usr/lib/jvm/java-6-sun
bamboo_plan_storageTag=PHPBB3-PR
bamboo_hg_cache_directory=/home/bamboo/xml-data/build-dir/_hg-repositories-cache
bamboo_planRepository_1_username=bantu
bamboo_planRepository_type=gitv2
bamboo_git_cache_directory=/home/bamboo/xml-data/build-dir/_git-repositories-cache
bamboo_ManualBuildTriggerReason_userName=Build Robot
bamboo_repository_git_repositoryUrl=https://github.com/phpbb/phpbb.git
bamboo_repository_75956235_git_branch=3.1.x
bamboo_capability_system_builder_ant_Ant=/usr/share/ant
bamboo_repository_75956235_name=phpBB Ascraeus
bamboo_tmp_directory=/home/bamboo/temp
bamboo_working_directory=/home/bamboo/xml-data/build-dir/PHPBB3-PR-JOB1
bamboo_planKey=PHPBB3-PR
bamboo_capability_local=true
bamboo_planRepository_1_repositoryUrl=https://github.com/phpbb/phpbb.git
bamboo_planRepository_username=bantu
bamboo_capability_system_jdk_JDK_1_6=/usr/lib/jvm/java-6-sun
bamboo_capability_system_jdk_JDK_1_7=/usr/lib/jvm/java-7-openjdk-amd64
bamboo_planRepository_1_branchName=3.1.x
17-Jun-2018 11:41:24 From https://github.com/phpbb/phpbb
17-Jun-2018 11:41:24 * branch            refs/pull/5243/merge -> FETCH_HEAD
17-Jun-2018 11:41:25 Note: checking out 'FETCH_HEAD'.
17-Jun-2018 11:41:25
17-Jun-2018 11:41:25 You are in 'detached HEAD' state. You can look around, make experimental
17-Jun-2018 11:41:25 changes and commit them, and you can discard any commits you make in this
17-Jun-2018 11:41:25 state without impacting any branches by performing another checkout.
17-Jun-2018 11:41:25
17-Jun-2018 11:41:25 If you want to create a new branch to retain commits you create, you may
17-Jun-2018 11:41:25 do so (now or later) by using -b with the checkout command again. Example:
17-Jun-2018 11:41:25
17-Jun-2018 11:41:25   git checkout -b new_branch_name
17-Jun-2018 11:41:25
17-Jun-2018 11:41:25 HEAD is now at 3b075db... Merge e98e53936ce3004f0370ff31b89b0d815c151168 into 2e938b229763fe57d405acab2e3d2c04fe1d204f
17-Jun-2018 11:41:25 Finished task 'Fetch PR' with result: Success
17-Jun-2018 11:41:25 Skipping execution of task 'Prepare directory' as it is disabled
17-Jun-2018 11:41:25
Substituting variable: ${bamboo.working.directory} with /home/bamboo/xml-data/build-dir/PHPBB3-PR-JOB1
17-Jun-2018 11:41:25 Starting task 'Prepare directory' of type 'com.atlassian.bamboo.plugins.bamboo-docker-plugin:task.docker.cli'
17-Jun-2018 11:41:25 Running image name (phpbb:php-5.6)
17-Jun-2018 11:41:25
Beginning to execute external process for build 'phpBB3 - Pull Requests - Build and Test Job #8238 (PHPBB3-PR-JOB1-8238)'
... running command line:
/usr/bin/docker run --volume /home/bamboo/xml-data/build-dir/PHPBB3-PR-JOB1:/data --workdir /data/phpBB --rm -e HOME=/home/bamboo -u=991 phpbb:php-5.6 /bin/bash -c php ../composer.phar install --dev; cd ../build; ../phpBB/vendor/bin/phing clean prepare
... in: /home/bamboo/xml-data/build-dir/PHPBB3-PR-JOB1
... using extra environment variables:
bamboo_planRepository_1_branch=3.1.x
bamboo_planRepository_1_branchDisplayName=3.1.x
bamboo_repository_revision_number=dc8ff9da28b8ab4ad11c7ea94cca526f17c87fe5
bamboo_PRref=master
bamboo_resultsUrl=https://bamboo.phpbb.com/browse/PHPBB3-PR-JOB1-8238
bamboo_capability_system_builder_command_Git=/usr/bin/git
bamboo_repository_75956235_git_username=bantu
bamboo_build_working_directory=/home/bamboo/xml-data/build-dir/PHPBB3-PR-JOB1
bamboo_planRepository_1_name=phpBB Ascraeus
bamboo_buildKey=PHPBB3-PR-JOB1
bamboo_capability_phpbb_tests=true
bamboo_shortPlanName=Pull Requests
bamboo_capability_system_builder_command_fop=/usr/bin/fop
bamboo_capability_dbms_sqlite_2=true
bamboo_planRepository_name=phpBB Ascraeus
bamboo_PRnumber=5243
bamboo_buildNumber=8238
bamboo_repository_75956235_git_repositoryUrl=https://github.com/phpbb/phpbb.git
bamboo_capability_system_builder_phpunit_PHPUnit=/usr/bin/phpunit
bamboo_shortJobName=Build and Test Job
bamboo_buildResultsUrl=https://bamboo.phpbb.com/browse/PHPBB3-PR-JOB1-8238
bamboo_repository_75956235_branch_name=3.1.x
bamboo_planRepository_repositoryUrl=https://github.com/phpbb/phpbb.git
bamboo_agentId=131073
bamboo_planName=phpBB3 - Pull Requests
bamboo_build_commandline_com_atlassian_bamboo_plugins_scripttask_task_builder_script_7=/bin/sh /home/bamboo/temp/PHPBB3-PR-JOB1-8238-ScriptBuildTask-8069134794913188158.sh
bamboo_shortPlanKey=PR
bamboo_shortJobKey=JOB1
bamboo_capability_dbms_mysql_55=true
bamboo_capability_system_jdk_JDK_1_7_0_65=/usr/lib/jvm/java-7-openjdk-amd64
bamboo_planRepository_revision=dc8ff9da28b8ab4ad11c7ea94cca526f17c87fe5
bamboo_buildTimeStamp=2018-06-17T11:41:16.563Z
bamboo_repository_previous_revision_number=dc8ff9da28b8ab4ad11c7ea94cca526f17c87fe5
bamboo_capability_system_jdk_JDK_1_6_0_16=/usr/lib/jvm/java-6-sun-1.6.0.16
bamboo_capability_system_builder_mvn2_Maven_2=/usr/share/maven2
bamboo_planRepository_previousRevision=dc8ff9da28b8ab4ad11c7ea94cca526f17c87fe5
bamboo_build_commandline_com_atlassian_bamboo_plugins_scripttask_task_builder_script_4=/bin/sh /home/bamboo/temp/PHPBB3-PR-JOB1-8238-ScriptBuildTask-3238172609609011871.sh
bamboo_repository_git_branch=3.1.x
bamboo_buildResultKey=PHPBB3-PR-JOB1-8238
bamboo_repository_branch_name=3.1.x
bamboo_buildPlanName=phpBB3 - Pull Requests - Build and Test Job
bamboo_planRepository_1_revision=dc8ff9da28b8ab4ad11c7ea94cca526f17c87fe5
bamboo_repository_name=phpBB Ascraeus
bamboo_buildFailed=false
bamboo_capability_system_docker_executable=/usr/bin/docker
bamboo_planRepository_branch=3.1.x
bamboo_agentWorkingDirectory=/home/bamboo/xml-data/build-dir
bamboo_capability_system_git_executable=/usr/bin/git
bamboo_capability_system_builder_phpunit_PHPUnit_3_4=/usr/bin/phpunit
bamboo_repository_git_username=bantu
bamboo_planRepository_1_previousRevision=dc8ff9da28b8ab4ad11c7ea94cca526f17c87fe5
bamboo_repository_75956235_revision_number=dc8ff9da28b8ab4ad11c7ea94cca526f17c87fe5
bamboo_planRepository_branchDisplayName=3.1.x
bamboo_planRepository_1_type=gitv2
bamboo_planRepository_branchName=3.1.x
bamboo_repository_75956235_previous_revision_number=dc8ff9da28b8ab4ad11c7ea94cca526f17c87fe5
bamboo_capability_system_jdk_JDK=/usr/lib/jvm/java-6-sun
bamboo_plan_storageTag=PHPBB3-PR
bamboo_hg_cache_directory=/home/bamboo/xml-data/build-dir/_hg-repositories-cache
bamboo_planRepository_1_username=bantu
bamboo_planRepository_type=gitv2
bamboo_git_cache_directory=/home/bamboo/xml-data/build-dir/_git-repositories-cache
bamboo_ManualBuildTriggerReason_userName=Build Robot
bamboo_repository_git_repositoryUrl=https://github.com/phpbb/phpbb.git
bamboo_repository_75956235_git_branch=3.1.x
bamboo_capability_system_builder_ant_Ant=/usr/share/ant
bamboo_repository_75956235_name=phpBB Ascraeus
bamboo_tmp_directory=/home/bamboo/temp
bamboo_working_directory=/home/bamboo/xml-data/build-dir/PHPBB3-PR-JOB1
bamboo_planKey=PHPBB3-PR
bamboo_capability_local=true
bamboo_planRepository_1_repositoryUrl=https://github.com/phpbb/phpbb.git
bamboo_planRepository_username=bantu
bamboo_capability_system_jdk_JDK_1_6=/usr/lib/jvm/java-6-sun
bamboo_capability_system_jdk_JDK_1_7=/usr/lib/jvm/java-7-openjdk-amd64
bamboo_planRepository_1_branchName=3.1.x
17-Jun-2018 11:41:25 Cannot create cache directory /home/bamboo/.composer/cache/repo/https---packagist.org/, or directory is not writable. Proceeding without cache
17-Jun-2018 11:41:25 Cannot create cache directory /home/bamboo/.composer/cache/files/, or directory is not writable. Proceeding without cache
17-Jun-2018 11:41:25 You are using the deprecated option "dev". Dev packages are installed by default now.
17-Jun-2018 11:41:25 Loading composer repositories with package information
17-Jun-2018 11:41:25 Installing dependencies (including require-dev) from lock file
17-Jun-2018 11:41:25 Package operations: 75 installs, 0 updates, 0 removals
17-Jun-2018 11:41:26   - Installing composer/installers (v1.5.0): Downloading (connecting...)Downloading (0%)           Downloading (5%)Downloading (15%)Downloading (45%)Downloading (50%)Downloading (55%)Downloading (75%)Downloading (80%)Downloading (85%)Downloading (100%)
17-Jun-2018 11:41:26   - Installing bantu/ini-get-wrapper (v1.0.1): Downloading (connecting...)Downloading (0%)           Downloading (100%)
17-Jun-2018 11:41:27   - Installing symfony/process (v3.4.3): Downloading (connecting...)Downloading (100%)         
17-Jun-2018 11:41:28   - Installing symfony/finder (v3.4.3): Downloading (connecting...)Downloading (0%)           Downloading (5%)Downloading (10%)Downloading (25%)Downloading (30%)Downloading (35%)Downloading (40%)Downloading (50%)Downloading (55%)Downloading (60%)Downloading (80%)Downloading (85%)Downloading (90%)Downloading (95%)Downloading (100%)
17-Jun-2018 11:41:28   - Installing symfony/filesystem (v3.4.3): Downloading (connecting...)Downloading (0%)           Downloading (5%)Downloading (100%)
17-Jun-2018 11:41:29   - Installing symfony/polyfill-mbstring (v1.7.0): Downloading (connecting...)Downloading (0%)           Downloading (20%)Downloading (40%)Downloading (60%)Downloading (80%)Downloading (100%)
17-Jun-2018 11:41:29   - Installing psr/log (1.0.2): Downloading (connecting...)Downloading (0%)           Downloading (15%)Downloading (100%)
17-Jun-2018 11:41:30   - Installing symfony/debug (v3.4.3): Downloading (connecting...)Downloading (0%)           Downloading (5%)Downloading (25%)Downloading (30%)Downloading (45%)Downloading (55%)Downloading (60%)Downloading (75%)Downloading (80%)Downloading (95%)Downloading (100%)
17-Jun-2018 11:41:30   - Installing symfony/console (v3.4.3): Downloading (connecting...)Downloading (0%)           Downloading (5%)Downloading (10%)Downloading (15%)Downloading (20%)Downloading (25%)Downloading (30%)Downloading (35%)Downloading (40%)Downloading (45%)Downloading (50%)Downloading (55%)Downloading (60%)Downloading (65%)Downloading (70%)Downloading (75%)Downloading (80%)Downloading (85%)Downloading (90%)Downloading (95%)Downloading (100%)
17-Jun-2018 11:41:31   - Installing seld/phar-utils (1.0.1): Downloading (connecting...)Downloading (0%)           Downloading (30%)Downloading (60%)Downloading (90%)Downloading (100%)
17-Jun-2018 11:41:31   - Installing seld/jsonlint (1.7.0): Downloading (connecting...)Downloading (100%)         
17-Jun-2018 11:41:32   - Installing seld/cli-prompt (1.0.3): Downloading (connecting...)Downloading (0%)           Downloading (15%)Downloading (30%)Downloading (100%)
17-Jun-2018 11:41:33   - Installing justinrainbow/json-schema (5.2.6): Downloading (connecting...)Downloading (0%)           Downloading (20%)Downloading (25%)Downloading (30%)Downloading (35%)Downloading (50%)Downloading (55%)Downloading (70%)Downloading (75%)Downloading (95%)Downloading (100%)
17-Jun-2018 11:41:33   - Installing composer/spdx-licenses (1.2.0): Downloading (connecting...)Downloading (100%)         
17-Jun-2018 11:41:34   - Installing composer/semver (1.4.2): Downloading (connecting...)Downloading (0%)           Downloading (35%)Downloading (75%)Downloading (100%)
17-Jun-2018 11:41:35   - Installing composer/ca-bundle (1.1.0): Downloading (connecting...)Downloading (0%)           Downloading (5%)Downloading (10%)Downloading (15%)Downloading (20%)Downloading (25%)Downloading (30%)Downloading (35%)Downloading (40%)Downloading (45%)Downloading (50%)Downloading (55%)Downloading (60%)Downloading (65%)Downloading (70%)Downloading (75%)Downloading (80%)Downloading (85%)Downloading (90%)Downloading (95%)Downloading (100%)
17-Jun-2018 11:41:35   - Installing composer/composer (1.6.2): Downloading (connecting...)Downloading (0%)           Downloading (5%)Downloading (10%)Downloading (15%)Downloading (20%)Downloading (25%)Downloading (30%)Downloading (35%)Downloading (40%)Downloading (45%)Downloading (50%)Downloading (55%)Downloading (65%)Downloading (75%)Downloading (80%)Downloading (85%)Downloading (90%)Downloading (95%)Downloading (100%)
17-Jun-2018 11:41:36   - Installing google/recaptcha (1.1.3): Downloading (connecting...)Downloading (0%)           Downloading (25%)Downloading (30%)Downloading (55%)Downloading (80%)Downloading (95%)Downloading (100%)
17-Jun-2018 11:41:36   - Installing guzzlehttp/promises (v1.3.1): Downloading (connecting...)Downloading (0%)           Downloading (30%)Downloading (60%)Downloading (80%)Downloading (100%)
17-Jun-2018 11:41:37   - Installing psr/http-message (1.0.1): Downloading (connecting...)Downloading (0%)           Downloading (100%)
17-Jun-2018 11:41:37   - Installing guzzlehttp/psr7 (1.4.2): Downloading (connecting...)Downloading (0%)           Downloading (5%)Downloading (10%)Downloading (15%)Downloading (20%)Downloading (50%)Downloading (55%)Downloading (60%)Downloading (65%)Downloading (100%)
17-Jun-2018 11:41:38   - Installing lusitanian/oauth (v0.8.10): Downloading (connecting...)Downloading (0%)           Downloading (5%)Downloading (10%)Downloading (15%)Downloading (20%)Downloading (30%)Downloading (35%)Downloading (45%)Downloading (50%)Downloading (55%)Downloading (60%)Downloading (65%)Downloading (70%)Downloading (80%)Downloading (85%)Downloading (95%)Downloading (100%)
17-Jun-2018 11:41:39   - Installing marc1706/fast-image-size (v1.1.4): Downloading (connecting...)Downloading (0%)           Downloading (45%)Downloading (90%)Downloading (100%)
17-Jun-2018 11:41:40   - Installing patchwork/utf8 (v1.3.1): Downloading (connecting...)Downloading (0%)           Downloading (5%)Downloading (10%)Downloading (15%)Downloading (20%)Downloading (25%)Downloading (30%)Downloading (35%)Downloading (40%)Downloading (45%)Downloading (50%)Downloading (55%)Downloading (60%)Downloading (65%)Downloading (70%)Downloading (75%)Downloading (80%)Downloading (85%)Downloading (90%)Downloading (95%)Downloading (100%)
17-Jun-2018 11:41:41   - Installing psr/container (1.0.0): Downloading (connecting...)Downloading (0%)           Downloading (75%)Downloading (100%)
17-Jun-2018 11:41:41   - Installing s9e/text-formatter (0.13.1): Downloading (connecting...)Downloading (100%)         
17-Jun-2018 11:41:42   - Installing symfony/config (v3.4.3): Downloading (connecting...)Downloading (100%)         
17-Jun-2018 11:41:43   - Installing paragonie/random_compat (v1.4.2): Downloading (connecting...)Downloading (0%)           Downloading (10%)Downloading (35%)Downloading (45%)Downloading (70%)Downloading (80%)Downloading (100%)
17-Jun-2018 11:41:43   - Installing symfony/polyfill-php70 (v1.6.0): Downloading (connecting...)Downloading (0%)           Downloading (85%)Downloading (100%)
17-Jun-2018 11:41:44   - Installing symfony/http-foundation (v3.4.3): Downloading (connecting...)Downloading (100%)         
17-Jun-2018 11:41:45   - Installing symfony/event-dispatcher (v3.4.3): Downloading (connecting...)Downloading (0%)           Downloading (5%)Downloading (90%)Downloading (95%)Downloading (100%)
17-Jun-2018 11:41:45   - Installing symfony/http-kernel (v3.4.3): Downloading (connecting...)Downloading (100%)         
17-Jun-2018 11:41:46   - Installing symfony/dependency-injection (v3.4.3): Downloading (connecting...)Downloading (100%)         
17-Jun-2018 11:41:47   - Installing zendframework/zend-eventmanager (3.2.0): Downloading (connecting...)Downloading (0%)           Downloading (30%)Downloading (45%)Downloading (50%)Downloading (70%)Downloading (100%)
17-Jun-2018 11:41:47   - Installing zendframework/zend-code (2.6.3): Downloading (connecting...)Downloading (0%)           Downloading (5%)Downloading (10%)Downloading (15%)Downloading (20%)Downloading (25%)Downloading (30%)Downloading (35%)Downloading (40%)Downloading (45%)Downloading (50%)Downloading (55%)Downloading (60%)Downloading (65%)Downloading (70%)Downloading (75%)Downloading (80%)Downloading (85%)Downloading (90%)Downloading (95%)Downloading (100%)
17-Jun-2018 11:41:48   - Installing ocramius/proxy-manager (1.0.2): Downloading (connecting...)Downloading (0%)           Downloading (5%)Downloading (10%)Downloading (15%)Downloading (20%)Downloading (25%)Downloading (30%)Downloading (35%)Downloading (40%)Downloading (45%)Downloading (50%)Downloading (55%)Downloading (60%)Downloading (65%)Downloading (75%)Downloading (80%)Downloading (85%)Downloading (90%)Downloading (95%)Downloading (100%)
17-Jun-2018 11:41:49   - Installing symfony/proxy-manager-bridge (v3.4.3): Downloading (connecting...)Downloading (0%)           Downloading (75%)Downloading (100%)
17-Jun-2018 11:41:49   - Installing symfony/routing (v3.4.3): Downloading (connecting...)Downloading (0%)           Downloading (5%)Downloading (10%)Downloading (15%)Downloading (20%)Downloading (25%)Downloading (30%)Downloading (35%)Downloading (40%)Downloading (45%)Downloading (50%)Downloading (55%)Downloading (60%)Downloading (65%)Downloading (70%)Downloading (75%)Downloading (80%)Downloading (85%)Downloading (90%)Downloading (95%)Downloading (100%)
17-Jun-2018 11:41:50   - Installing twig/twig (v1.35.0): Downloading (connecting...)Downloading (0%)           Downloading (5%)Downloading (10%)Downloading (15%)Downloading (20%)Downloading (25%)Downloading (30%)Downloading (35%)Downloading (40%)Downloading (45%)Downloading (50%)Downloading (55%)Downloading (60%)Downloading (65%)Downloading (70%)Downloading (75%)Downloading (80%)Downloading (85%)Downloading (90%)Downloading (95%)Downloading (100%)
17-Jun-2018 11:41:51   - Installing symfony/twig-bridge (v3.4.3): Downloading (connecting...)Downloading (0%)           Downloading (5%)Downloading (10%)Downloading (20%)Downloading (25%)Downloading (30%)Downloading (35%)Downloading (45%)Downloading (50%)Downloading (55%)Downloading (60%)Downloading (65%)Downloading (75%)Downloading (80%)Downloading (85%)Downloading (95%)Downloading (100%)
17-Jun-2018 11:41:51   - Installing symfony/dom-crawler (v3.4.3): Downloading (connecting...)Downloading (100%)         
17-Jun-2018 11:41:52   - Installing symfony/css-selector (v3.4.3): Downloading (connecting...)Downloading (100%)         
17-Jun-2018 11:41:53   - Installing symfony/browser-kit (v3.4.3): Downloading (connecting...)Downloading (0%)           Downloading (5%)Downloading (70%)Downloading (100%)
17-Jun-2018 11:41:53   - Installing guzzlehttp/guzzle (6.3.0): Downloading (connecting...)Downloading (0%)           Downloading (5%)Downloading (10%)Downloading (20%)Downloading (25%)Downloading (35%)Downloading (40%)Downloading (50%)Downloading (55%)Downloading (65%)Downloading (70%)Downloading (75%)Downloading (80%)Downloading (90%)Downloading (95%)Downloading (100%)
17-Jun-2018 11:41:54   - Installing fabpot/goutte (v3.2.2): Downloading (connecting...)Downloading (100%)         
17-Jun-2018 11:41:55   - Installing facebook/webdriver (1.5.0): Downloading (connecting...)Downloading (0%)           Downloading (5%)Downloading (10%)Downloading (15%)Downloading (20%)Downloading (25%)Downloading (30%)Downloading (35%)Downloading (40%)Downloading (45%)Downloading (50%)Downloading (55%)Downloading (60%)Downloading (65%)Downloading (70%)Downloading (75%)Downloading (80%)Downloading (85%)Downloading (90%)Downloading (95%)Downloading (100%)
17-Jun-2018 11:41:55   - Installing laravel/homestead (v4.0.5): Downloading (connecting...)Downloading (0%)           Downloading (5%)Downloading (10%)Downloading (50%)Downloading (55%)Downloading (60%)Downloading (65%)Downloading (100%)
17-Jun-2018 11:41:56   - Installing phing/phing (2.4.14): Downloading (connecting...)Downloading (100%)         
17-Jun-2018 11:41:57   - Installing webmozart/assert (1.2.0): Downloading (connecting...)Downloading (0%)           Downloading (55%)Downloading (80%)Downloading (100%)
17-Jun-2018 11:41:58   - Installing phpdocumentor/reflection-common (1.0.1): Downloading (connecting...)Downloading (0%)           Downloading (100%)
17-Jun-2018 11:41:58   - Installing phpdocumentor/type-resolver (0.4.0): Downloading (connecting...)Downloading (0%)           Downloading (5%)Downloading (80%)Downloading (85%)Downloading (90%)Downloading (100%)
17-Jun-2018 11:41:59   - Installing phpdocumentor/reflection-docblock (3.3.2): Downloading (connecting...)Downloading (0%)           Downloading (5%)Downloading (10%)Downloading (15%)Downloading (20%)Downloading (25%)Downloading (30%)Downloading (45%)Downloading (50%)Downloading (70%)Downloading (75%)Downloading (80%)Downloading (85%)Downloading (100%)
17-Jun-2018 11:41:59   - Installing symfony/yaml (v3.4.3): Downloading (connecting...)Downloading (100%)         
17-Jun-2018 11:42:00   - Installing sebastian/version (2.0.1): Downloading (connecting...)Downloading (0%)           Downloading (100%)
17-Jun-2018 11:42:01   - Installing sebastian/resource-operations (1.0.0): Downloading (connecting...)Downloading (0%)           Downloading (65%)Downloading (100%)
17-Jun-2018 11:42:01   - Installing sebastian/recursion-context (2.0.0): Downloading (connecting...)Downloading (0%)           Downloading (100%)
17-Jun-2018 11:42:01   - Installing sebastian/object-enumerator (2.0.1): Downloading (connecting...)Downloading (0%)           Downloading (100%)
17-Jun-2018 11:42:02   - Installing sebastian/global-state (1.1.1): Downloading (connecting...)Downloading (0%)           Downloading (40%)Downloading (50%)Downloading (90%)Downloading (100%)
17-Jun-2018 11:42:02   - Installing sebastian/exporter (2.0.0): Downloading (connecting...)Downloading (0%)           Downloading (100%)
17-Jun-2018 11:42:03   - Installing sebastian/environment (2.0.0): Downloading (connecting...)Downloading (0%)           Downloading (15%)Downloading (30%)Downloading (45%)Downloading (60%)Downloading (75%)Downloading (90%)Downloading (100%)
17-Jun-2018 11:42:04   - Installing sebastian/diff (1.4.3): Downloading (connecting...)Downloading (0%)           Downloading (35%)Downloading (50%)Downloading (100%)
17-Jun-2018 11:42:04   - Installing sebastian/comparator (1.2.4): Downloading (connecting...)Downloading (0%)           Downloading (10%)Downloading (55%)Downloading (65%)Downloading (70%)Downloading (100%)
17-Jun-2018 11:42:04   - Installing phpunit/php-text-template (1.2.1): Downloading (connecting...)Downloading (0%)           Downloading (35%)Downloading (100%)
17-Jun-2018 11:42:05   - Installing doctrine/instantiator (1.0.5): Downloading (connecting...)Downloading (0%)           Downloading (15%)Downloading (30%)Downloading (45%)Downloading (100%)
17-Jun-2018 11:42:05   - Installing phpunit/phpunit-mock-objects (3.4.4): Downloading (connecting...)Downloading (0%)           Downloading (5%)Downloading (10%)Downloading (15%)Downloading (20%)Downloading (30%)Downloading (35%)Downloading (40%)Downloading (45%)Downloading (50%)Downloading (55%)Downloading (60%)Downloading (65%)Downloading (70%)Downloading (80%)Downloading (85%)Downloading (90%)Downloading (95%)Downloading (100%)
17-Jun-2018 11:42:06   - Installing phpunit/php-timer (1.0.9): Downloading (connecting...)Downloading (0%)           Downloading (45%)Downloading (90%)Downloading (100%)
17-Jun-2018 11:42:07   - Installing phpunit/php-file-iterator (1.4.5): Downloading (connecting...)Downloading (0%)           Downloading (100%)
17-Jun-2018 11:42:07   - Installing sebastian/code-unit-reverse-lookup (1.0.1): Downloading (connecting...)Downloading (0%)           Downloading (55%)Downloading (100%)
17-Jun-2018 11:42:08   - Installing phpunit/php-token-stream (1.4.12): Downloading (connecting...)Downloading (0%)           Downloading (5%)Downloading (10%)Downloading (15%)Downloading (20%)Downloading (90%)Downloading (95%)Downloading (100%)
17-Jun-2018 11:42:10   - Installing phpunit/php-code-coverage (4.0.8): Downloading (connecting...)Downloading (0%)           Downloading (5%)Downloading (10%)Downloading (15%)Downloading (20%)Downloading (25%)Downloading (30%)Downloading (35%)Downloading (40%)Downloading (45%)Downloading (50%)Downloading (55%)Downloading (60%)Downloading (65%)Downloading (70%)Downloading (75%)Downloading (80%)Downloading (85%)Downloading (90%)Downloading (95%)Downloading (100%)
17-Jun-2018 11:42:10   - Installing phpspec/prophecy (1.7.5): Downloading (connecting...)Downloading (100%)         
17-Jun-2018 11:42:11   - Installing myclabs/deep-copy (1.7.0): Downloading (connecting...)Downloading (0%)           Downloading (15%)Downloading (20%)Downloading (35%)Downloading (40%)Downloading (45%)Downloading (50%)Downloading (65%)Downloading (70%)Downloading (85%)Downloading (90%)Downloading (100%)
17-Jun-2018 11:42:14   - Installing phpunit/phpunit (5.7.26): Downloading (connecting...)Downloading (0%)           Downloading (5%)Downloading (10%)Downloading (15%)Downloading (20%)Downloading (25%)Downloading (30%)Downloading (35%)Downloading (40%)Downloading (45%)Downloading (50%)Downloading (55%)Downloading (60%)Downloading (65%)Downloading (70%)Downloading (75%)Downloading (80%)Downloading (85%)Downloading (90%)Downloading (95%)Downloading (100%)
17-Jun-2018 11:42:14   - Installing phpunit/dbunit (2.0.3): Downloading (connecting...)Downloading (100%)         
17-Jun-2018 11:42:15   - Installing squizlabs/php_codesniffer (2.9.1): Downloading (connecting...)Downloading (0%)           Downloading (5%)Downloading (10%)Downloading (15%)Downloading (20%)Downloading (25%)Downloading (30%)Downloading (35%)Downloading (40%)Downloading (45%)Downloading (50%)Downloading (55%)Downloading (60%)Downloading (65%)Downloading (70%)Downloading (75%)Downloading (80%)Downloading (85%)Downloading (90%)Downloading (95%)Downloading (100%)
17-Jun-2018 11:42:16 symfony/console suggests installing symfony/lock ()
17-Jun-2018 11:42:16 lusitanian/oauth suggests installing predis/predis (Allows using the Redis storage backend.)
17-Jun-2018 11:42:16 patchwork/utf8 suggests installing ext-intl (Use Intl for best performance)
17-Jun-2018 11:42:16 patchwork/utf8 suggests installing ext-wfio (Use WFIO for UTF-8 filesystem access on Windows)
17-Jun-2018 11:42:16 s9e/text-formatter suggests installing ext-intl (Allows international URLs to be accepted by the URL filter)
17-Jun-2018 11:42:16 s9e/text-formatter suggests installing ext-xsl (Enables the XSLT renderer)
17-Jun-2018 11:42:16 paragonie/random_compat suggests installing ext-libsodium (Provides a modern crypto API that can be used to generate random bytes.)
17-Jun-2018 11:42:16 symfony/http-kernel suggests installing symfony/var-dumper ()
17-Jun-2018 11:42:16 symfony/dependency-injection suggests installing symfony/expression-language (For using expressions in service container configuration)
17-Jun-2018 11:42:16 zendframework/zend-eventmanager suggests installing container-interop/container-interop (^1.1.0, to use the lazy listeners feature)
17-Jun-2018 11:42:16 zendframework/zend-eventmanager suggests installing zendframework/zend-stdlib (^2.7.3 || ^3.0, to use the FilterChain feature)
17-Jun-2018 11:42:16 zendframework/zend-code suggests installing doctrine/annotations (Doctrine\Common\Annotations >=1.0 for annotation features)
17-Jun-2018 11:42:16 zendframework/zend-code suggests installing zendframework/zend-stdlib (Zend\Stdlib component)
17-Jun-2018 11:42:16 ocramius/proxy-manager suggests installing ocramius/generated-hydrator (To have very fast object to array to object conversion for ghost objects)
17-Jun-2018 11:42:16 ocramius/proxy-manager suggests installing zendframework/zend-json (To have the JsonRpc adapter (Remote Object feature))
17-Jun-2018 11:42:16 ocramius/proxy-manager suggests installing zendframework/zend-soap (To have the Soap adapter (Remote Object feature))
17-Jun-2018 11:42:16 ocramius/proxy-manager suggests installing zendframework/zend-stdlib (To use the hydrator proxy)
17-Jun-2018 11:42:16 ocramius/proxy-manager suggests installing zendframework/zend-xmlrpc (To have the XmlRpc adapter (Remote Object feature))
17-Jun-2018 11:42:16 symfony/routing suggests installing doctrine/annotations (For using the annotation loader)
17-Jun-2018 11:42:16 symfony/routing suggests installing symfony/expression-language (For using expression matching)
17-Jun-2018 11:42:16 symfony/twig-bridge suggests installing symfony/asset (For using the AssetExtension)
17-Jun-2018 11:42:16 symfony/twig-bridge suggests installing symfony/expression-language (For using the ExpressionExtension)
17-Jun-2018 11:42:16 symfony/twig-bridge suggests installing symfony/form (For using the FormExtension)
17-Jun-2018 11:42:16 symfony/twig-bridge suggests installing symfony/security (For using the SecurityExtension)
17-Jun-2018 11:42:16 symfony/twig-bridge suggests installing symfony/stopwatch (For using the StopwatchExtension)
17-Jun-2018 11:42:16 symfony/twig-bridge suggests installing symfony/templating (For using the TwigEngine)
17-Jun-2018 11:42:16 symfony/twig-bridge suggests installing symfony/translation (For using the TranslationExtension)
17-Jun-2018 11:42:16 symfony/twig-bridge suggests installing symfony/var-dumper (For using the DumpExtension)
17-Jun-2018 11:42:16 symfony/twig-bridge suggests installing symfony/web-link (For using the WebLinkExtension)
17-Jun-2018 11:42:16 sebastian/global-state suggests installing ext-uopz (*)
17-Jun-2018 11:42:16 phpunit/phpunit-mock-objects suggests installing ext-soap (*)
17-Jun-2018 11:42:16 phpunit/phpunit suggests installing phpunit/php-invoker (~1.1)
17-Jun-2018 11:42:16 Generating autoload files
17-Jun-2018 11:42:17 Buildfile: /data/build/build.xml
17-Jun-2018 11:42:17
17-Jun-2018 11:42:17 phpBB > clean:
17-Jun-2018 11:42:17
17-Jun-2018 11:42:17    [delete] Directory /data/build/logs does not exist or is not a directory.
17-Jun-2018 11:42:17    [delete] Directory /data/build/api does not exist or is not a directory.
17-Jun-2018 11:42:17    [delete] Directory /data/build/codebrowser does not exist or is not a directory.
17-Jun-2018 11:42:17    [delete] Directory /data/build/coverage does not exist or is not a directory.
17-Jun-2018 11:42:17    [delete] Directory /data/build/cpd does not exist or is not a directory.
17-Jun-2018 11:42:17    [delete] Directory /data/build/dependencies does not exist or is not a directory.
17-Jun-2018 11:42:17    [delete] Directory /data/build/new_version does not exist or is not a directory.
17-Jun-2018 11:42:17    [delete] Directory /data/build/old_versions does not exist or is not a directory.
17-Jun-2018 11:42:17    [delete] Directory /data/build/save does not exist or is not a directory.
17-Jun-2018 11:42:17
17-Jun-2018 11:42:17 phpBB > prepare:
17-Jun-2018 11:42:17
17-Jun-2018 11:42:17     [mkdir] Created dir: /data/build/logs
17-Jun-2018 11:42:17     [mkdir] Created dir: /data/build/api
17-Jun-2018 11:42:17     [mkdir] Created dir: /data/build/codebrowser
17-Jun-2018 11:42:17     [mkdir] Created dir: /data/build/coverage
17-Jun-2018 11:42:17     [mkdir] Created dir: /data/build/cpd
17-Jun-2018 11:42:17     [mkdir] Created dir: /data/build/dependencies
17-Jun-2018 11:42:17     [mkdir] Created dir: /data/build/new_version
17-Jun-2018 11:42:17     [mkdir] Created dir: /data/build/new_version/files
17-Jun-2018 11:42:17     [mkdir] Created dir: /data/build/new_version/patches
17-Jun-2018 11:42:17     [mkdir] Created dir: /data/build/new_version/release_files
17-Jun-2018 11:42:17     [mkdir] Created dir: /data/build/new_version/update
17-Jun-2018 11:42:17     [mkdir] Created dir: /data/build/old_versions
17-Jun-2018 11:42:17     [mkdir] Created dir: /data/build/save
17-Jun-2018 11:42:17
17-Jun-2018 11:42:17 BUILD FINISHED
17-Jun-2018 11:42:17
17-Jun-2018 11:42:17 Total time: 0.0989 seconds
17-Jun-2018 11:42:17
17-Jun-2018 11:42:17 Finished task 'Prepare directory' with result: Success
17-Jun-2018 11:42:17 Skipping execution of task 'Run sniffs' as it is disabled
17-Jun-2018 11:42:17
Substituting variable: ${bamboo.working.directory} with /home/bamboo/xml-data/build-dir/PHPBB3-PR-JOB1
17-Jun-2018 11:42:17 Starting task 'Run sniffs' of type 'com.atlassian.bamboo.plugins.bamboo-docker-plugin:task.docker.cli'
17-Jun-2018 11:42:17 Running image name (phpbb:php-5.6)
17-Jun-2018 11:42:17
Beginning to execute external process for build 'phpBB3 - Pull Requests - Build and Test Job #8238 (PHPBB3-PR-JOB1-8238)'
... running command line:
/usr/bin/docker run --volume /home/bamboo/xml-data/build-dir/PHPBB3-PR-JOB1:/data --workdir /data/build --rm -u=991 phpbb:php-5.6 ../phpBB/vendor/bin/phing sniff
... in: /home/bamboo/xml-data/build-dir/PHPBB3-PR-JOB1
... using extra environment variables:
bamboo_planRepository_1_branch=3.1.x
bamboo_planRepository_1_branchDisplayName=3.1.x
bamboo_repository_revision_number=dc8ff9da28b8ab4ad11c7ea94cca526f17c87fe5
bamboo_PRref=master
bamboo_resultsUrl=https://bamboo.phpbb.com/browse/PHPBB3-PR-JOB1-8238
bamboo_capability_system_builder_command_Git=/usr/bin/git
bamboo_repository_75956235_git_username=bantu
bamboo_build_working_directory=/home/bamboo/xml-data/build-dir/PHPBB3-PR-JOB1
bamboo_planRepository_1_name=phpBB Ascraeus
bamboo_buildKey=PHPBB3-PR-JOB1
bamboo_capability_phpbb_tests=true
bamboo_shortPlanName=Pull Requests
bamboo_capability_system_builder_command_fop=/usr/bin/fop
bamboo_capability_dbms_sqlite_2=true
bamboo_planRepository_name=phpBB Ascraeus
bamboo_PRnumber=5243
bamboo_buildNumber=8238
bamboo_repository_75956235_git_repositoryUrl=https://github.com/phpbb/phpbb.git
bamboo_capability_system_builder_phpunit_PHPUnit=/usr/bin/phpunit
bamboo_shortJobName=Build and Test Job
bamboo_buildResultsUrl=https://bamboo.phpbb.com/browse/PHPBB3-PR-JOB1-8238
bamboo_repository_75956235_branch_name=3.1.x
bamboo_planRepository_repositoryUrl=https://github.com/phpbb/phpbb.git
bamboo_agentId=131073
bamboo_planName=phpBB3 - Pull Requests
bamboo_build_commandline_com_atlassian_bamboo_plugins_scripttask_task_builder_script_7=/bin/sh /home/bamboo/temp/PHPBB3-PR-JOB1-8238-ScriptBuildTask-8069134794913188158.sh
bamboo_shortPlanKey=PR
bamboo_shortJobKey=JOB1
bamboo_capability_dbms_mysql_55=true
bamboo_capability_system_jdk_JDK_1_7_0_65=/usr/lib/jvm/java-7-openjdk-amd64
bamboo_planRepository_revision=dc8ff9da28b8ab4ad11c7ea94cca526f17c87fe5
bamboo_buildTimeStamp=2018-06-17T11:41:16.563Z
bamboo_repository_previous_revision_number=dc8ff9da28b8ab4ad11c7ea94cca526f17c87fe5
bamboo_capability_system_jdk_JDK_1_6_0_16=/usr/lib/jvm/java-6-sun-1.6.0.16
bamboo_capability_system_builder_mvn2_Maven_2=/usr/share/maven2
bamboo_planRepository_previousRevision=dc8ff9da28b8ab4ad11c7ea94cca526f17c87fe5
bamboo_build_commandline_com_atlassian_bamboo_plugins_scripttask_task_builder_script_4=/bin/sh /home/bamboo/temp/PHPBB3-PR-JOB1-8238-ScriptBuildTask-3238172609609011871.sh
bamboo_repository_git_branch=3.1.x
bamboo_buildResultKey=PHPBB3-PR-JOB1-8238
bamboo_repository_branch_name=3.1.x
bamboo_buildPlanName=phpBB3 - Pull Requests - Build and Test Job
bamboo_planRepository_1_revision=dc8ff9da28b8ab4ad11c7ea94cca526f17c87fe5
bamboo_repository_name=phpBB Ascraeus
bamboo_buildFailed=false
bamboo_capability_system_docker_executable=/usr/bin/docker
bamboo_build_commandline_com_atlassian_bamboo_plugins_bamboo_docker_plugin_task_docker_cli_12=/usr/bin/docker run --volume /home/bamboo/xml-data/build-dir/PHPBB3-PR-JOB1:/data --workdir /data/phpBB --rm -e HOME=/home/bamboo -u=991 phpbb:php-5.6 /bin/bash -c php ../composer.phar install --dev; cd ../build; ../phpBB/vendor/bin/phing clean prepare
bamboo_planRepository_branch=3.1.x
bamboo_agentWorkingDirectory=/home/bamboo/xml-data/build-dir
bamboo_capability_system_git_executable=/usr/bin/git
bamboo_capability_system_builder_phpunit_PHPUnit_3_4=/usr/bin/phpunit
bamboo_repository_git_username=bantu
bamboo_planRepository_1_previousRevision=dc8ff9da28b8ab4ad11c7ea94cca526f17c87fe5
bamboo_repository_75956235_revision_number=dc8ff9da28b8ab4ad11c7ea94cca526f17c87fe5
bamboo_planRepository_branchDisplayName=3.1.x
bamboo_planRepository_1_type=gitv2
bamboo_planRepository_branchName=3.1.x
bamboo_repository_75956235_previous_revision_number=dc8ff9da28b8ab4ad11c7ea94cca526f17c87fe5
bamboo_capability_system_jdk_JDK=/usr/lib/jvm/java-6-sun
bamboo_plan_storageTag=PHPBB3-PR
bamboo_hg_cache_directory=/home/bamboo/xml-data/build-dir/_hg-repositories-cache
bamboo_planRepository_1_username=bantu
bamboo_planRepository_type=gitv2
bamboo_git_cache_directory=/home/bamboo/xml-data/build-dir/_git-repositories-cache
bamboo_ManualBuildTriggerReason_userName=Build Robot
bamboo_repository_git_repositoryUrl=https://github.com/phpbb/phpbb.git
bamboo_repository_75956235_git_branch=3.1.x
bamboo_capability_system_builder_ant_Ant=/usr/share/ant
bamboo_repository_75956235_name=phpBB Ascraeus
bamboo_tmp_directory=/home/bamboo/temp
bamboo_working_directory=/home/bamboo/xml-data/build-dir/PHPBB3-PR-JOB1
bamboo_planKey=PHPBB3-PR
bamboo_capability_local=true
bamboo_planRepository_1_repositoryUrl=https://github.com/phpbb/phpbb.git
bamboo_planRepository_username=bantu
bamboo_capability_system_jdk_JDK_1_6=/usr/lib/jvm/java-6-sun
bamboo_capability_system_jdk_JDK_1_7=/usr/lib/jvm/java-7-openjdk-amd64
bamboo_planRepository_1_branchName=3.1.x
17-Jun-2018 11:42:17 Buildfile: /data/build/build.xml
17-Jun-2018 11:42:18
17-Jun-2018 11:42:18 phpBB > sniff:
17-Jun-2018 11:42:18
17-Jun-2018 11:42:25 ............................................................  60 / 754 (8%)
17-Jun-2018 11:42:26 ...........E................................................ 120 / 754 (16%)
17-Jun-2018 11:42:27 ............................................................ 180 / 754 (24%)
17-Jun-2018 11:42:28 ............................................................ 240 / 754 (32%)
17-Jun-2018 11:42:31 ............................................................ 300 / 754 (40%)
17-Jun-2018 11:42:37 ............................................................ 360 / 754 (48%)
17-Jun-2018 11:42:42 ............................................................ 420 / 754 (56%)
17-Jun-2018 11:42:46 ............................................................ 480 / 754 (64%)
17-Jun-2018 11:42:49 ............................................................ 540 / 754 (72%)
17-Jun-2018 11:42:53 ............................................................ 600 / 754 (80%)
17-Jun-2018 11:42:57 ............................................................ 660 / 754 (88%)
17-Jun-2018 11:43:00 ............................................................ 720 / 754 (95%)
17-Jun-2018 11:43:01 ..................................
17-Jun-2018 11:43:01
17-Jun-2018 11:43:01
17-Jun-2018 11:43:01 FILE: /data/phpBB/phpbb/db/migration/data/v330/storage_track.php
17-Jun-2018 11:43:01 ----------------------------------------------------------------------
17-Jun-2018 11:43:01 FOUND 1 ERROR AFFECTING 1 LINE
17-Jun-2018 11:43:01 ----------------------------------------------------------------------
17-Jun-2018 11:43:01 96 | ERROR | There should be exactly one space between the keyword and
17-Jun-2018 11:43:01     |       | opening parenthesis
17-Jun-2018 11:43:01     |       | (phpbb.ControlStructures.OpeningParenthesis.NoSpaceBeforeOpeningParenthesis)
17-Jun-2018 11:43:01 ----------------------------------------------------------------------
17-Jun-2018 11:43:01
17-Jun-2018 11:43:01 Time: 43.76 secs; Memory: 64.25Mb
17-Jun-2018 11:43:01
17-Jun-2018 11:43:09 ............................................................  60 / 209 (29%)
17-Jun-2018 11:43:28 ............................................................ 120 / 209 (57%)
17-Jun-2018 11:43:41 ............................................................ 180 / 209 (86%)
17-Jun-2018 11:43:49 .............................
17-Jun-2018 11:43:49
17-Jun-2018 11:43:49 Time: 47.4 secs; Memory: 60.5Mb
17-Jun-2018 11:43:49
17-Jun-2018 11:43:49
17-Jun-2018 11:43:49
17-Jun-2018 11:43:49 Time: 18ms; Memory: 3.75Mb
17-Jun-2018 11:43:49
17-Jun-2018 11:43:49        [if] Error in IfTask
17-Jun-2018 11:43:49 Execution of target "sniff" failed for the following reason: /data/build/build.xml:109:6: /data/build/build.xml:115:9: PHP Code Sniffer failed.
17-Jun-2018 11:43:49
17-Jun-2018 11:43:49 BUILD FAILED
17-Jun-2018 11:43:49 /data/build/build.xml:109:6: /data/build/build.xml:115:9: PHP Code Sniffer failed.
17-Jun-2018 11:43:49 Total time: 2 minutes  31.48 seconds
17-Jun-2018 11:43:49
17-Jun-2018 11:43:49 Error occurred while running Task 'Run sniffs(11)' of type com.atlassian.bamboo.plugins.bamboo-docker-plugin:task.docker.cli.
17-Jun-2018 11:43:49 com.atlassian.bamboo.task.TaskException: Failed to execute task
17-Jun-2018 11:43:49         at com.atlassian.bamboo.plugins.docker.service.RunService.execute(RunService.java:75)
17-Jun-2018 11:43:49         at com.atlassian.bamboo.plugins.docker.tasks.cli.DockerCliTask.execute(DockerCliTask.java:70)
17-Jun-2018 11:43:49         at com.atlassian.bamboo.task.TaskExecutorImpl.lambda$executeTasks$3(TaskExecutorImpl.java:285)
17-Jun-2018 11:43:49         at com.atlassian.bamboo.task.TaskExecutorImpl.executeTaskWithPrePostActions(TaskExecutorImpl.java:224)
17-Jun-2018 11:43:49         at com.atlassian.bamboo.task.TaskExecutorImpl.executeTasks(TaskExecutorImpl.java:285)
17-Jun-2018 11:43:49         at com.atlassian.bamboo.task.TaskExecutorImpl.execute(TaskExecutorImpl.java:112)
17-Jun-2018 11:43:49         at com.atlassian.bamboo.build.pipeline.tasks.ExecuteBuildTask.call(ExecuteBuildTask.java:71)
17-Jun-2018 11:43:49         at com.atlassian.bamboo.v2.build.agent.DefaultBuildAgent.executeBuildPhase(DefaultBuildAgent.java:203)
17-Jun-2018 11:43:49         at com.atlassian.bamboo.v2.build.agent.DefaultBuildAgent.build(DefaultBuildAgent.java:175)
17-Jun-2018 11:43:49         at com.atlassian.bamboo.v2.build.agent.BuildAgentControllerImpl.lambda$waitAndPerformBuild$0(BuildAgentControllerImpl.java:122)
17-Jun-2018 11:43:49         at com.atlassian.bamboo.variable.CustomVariableContextImpl.withVariableSubstitutor(CustomVariableContextImpl.java:185)
17-Jun-2018 11:43:49         at com.atlassian.bamboo.v2.build.agent.BuildAgentControllerImpl.waitAndPerformBuild(BuildAgentControllerImpl.java:117)
17-Jun-2018 11:43:49         at com.atlassian.bamboo.v2.build.agent.DefaultBuildAgent$1.run(DefaultBuildAgent.java:126)
17-Jun-2018 11:43:49         at com.atlassian.bamboo.utils.BambooRunnables$1.run(BambooRunnables.java:48)
17-Jun-2018 11:43:49         at com.atlassian.bamboo.security.ImpersonationHelper.runWith(ImpersonationHelper.java:26)
17-Jun-2018 11:43:49         at com.atlassian.bamboo.security.ImpersonationHelper.runWithSystemAuthority(ImpersonationHelper.java:17)
17-Jun-2018 11:43:49         at com.atlassian.bamboo.security.ImpersonationHelper$1.run(ImpersonationHelper.java:41)
17-Jun-2018 11:43:49         at java.lang.Thread.run(Thread.java:748)
17-Jun-2018 11:43:49 Caused by: com.atlassian.bamboo.docker.DockerException: Error running Docker run command
17-Jun-2018 11:43:49         at com.atlassian.bamboo.docker.DockerContainerServiceImpl.run(DockerContainerServiceImpl.java:118)
17-Jun-2018 11:43:49         at sun.reflect.GeneratedMethodAccessor2553.invoke(Unknown Source)
17-Jun-2018 11:43:49         at sun.reflect.DelegatingMethodAccessorImpl.invoke(DelegatingMethodAccessorImpl.java:43)
17-Jun-2018 11:43:49         at java.lang.reflect.Method.invoke(Method.java:498)
17-Jun-2018 11:43:49         at com.atlassian.plugin.util.ContextClassLoaderSettingInvocationHandler.invoke(ContextClassLoaderSettingInvocationHandler.java:26)
17-Jun-2018 11:43:49         at com.sun.proxy.$Proxy401.run(Unknown Source)
17-Jun-2018 11:43:49         at sun.reflect.GeneratedMethodAccessor2553.invoke(Unknown Source)
17-Jun-2018 11:43:49         at sun.reflect.DelegatingMethodAccessorImpl.invoke(DelegatingMethodAccessorImpl.java:43)
17-Jun-2018 11:43:49         at java.lang.reflect.Method.invoke(Method.java:498)
17-Jun-2018 11:43:49         at org.springframework.aop.support.AopUtils.invokeJoinpointUsingReflection(AopUtils.java:302)
17-Jun-2018 11:43:49         at org.eclipse.gemini.blueprint.service.importer.support.internal.aop.ServiceInvoker.doInvoke(ServiceInvoker.java:56)
17-Jun-2018 11:43:49         at org.eclipse.gemini.blueprint.service.importer.support.internal.aop.ServiceInvoker.invoke(ServiceInvoker.java:60)
17-Jun-2018 11:43:49         at org.springframework.aop.framework.ReflectiveMethodInvocation.proceed(ReflectiveMethodInvocation.java:179)
17-Jun-2018 11:43:49         at org.springframework.aop.support.DelegatingIntroductionInterceptor.doProceed(DelegatingIntroductionInterceptor.java:133)
17-Jun-2018 11:43:49         at org.springframework.aop.support.DelegatingIntroductionInterceptor.invoke(DelegatingIntroductionInterceptor.java:121)
17-Jun-2018 11:43:49         at org.springframework.aop.framework.ReflectiveMethodInvocation.proceed(ReflectiveMethodInvocation.java:179)
17-Jun-2018 11:43:49         at org.eclipse.gemini.blueprint.service.util.internal.aop.ServiceTCCLInterceptor.invokeUnprivileged(ServiceTCCLInterceptor.java:70)
17-Jun-2018 11:43:49         at org.eclipse.gemini.blueprint.service.util.internal.aop.ServiceTCCLInterceptor.invoke(ServiceTCCLInterceptor.java:53)
17-Jun-2018 11:43:49         at org.springframework.aop.framework.ReflectiveMethodInvocation.proceed(ReflectiveMethodInvocation.java:179)
17-Jun-2018 11:43:49         at org.eclipse.gemini.blueprint.service.importer.support.LocalBundleContextAdvice.invoke(LocalBundleContextAdvice.java:57)
17-Jun-2018 11:43:49         at org.springframework.aop.framework.ReflectiveMethodInvocation.proceed(ReflectiveMethodInvocation.java:179)
17-Jun-2018 11:43:49         at org.springframework.aop.support.DelegatingIntroductionInterceptor.doProceed(DelegatingIntroductionInterceptor.java:133)
17-Jun-2018 11:43:49         at org.springframework.aop.support.DelegatingIntroductionInterceptor.invoke(DelegatingIntroductionInterceptor.java:121)
17-Jun-2018 11:43:49         at org.springframework.aop.framework.ReflectiveMethodInvocation.proceed(ReflectiveMethodInvocation.java:179)
17-Jun-2018 11:43:49         at org.springframework.aop.framework.JdkDynamicAopProxy.invoke(JdkDynamicAopProxy.java:207)
17-Jun-2018 11:43:49         at com.sun.proxy.$Proxy679.run(Unknown Source)
17-Jun-2018 11:43:49         at com.atlassian.bamboo.plugins.docker.client.DockerCmd.run(DockerCmd.java:51)
17-Jun-2018 11:43:49         at com.atlassian.bamboo.plugins.docker.service.RunService.execute(RunService.java:64)
17-Jun-2018 11:43:49         ... 17 more
17-Jun-2018 11:43:49 Caused by: com.atlassian.utils.process.ProcessException: Error executing /usr/bin/docker run --volume /home/bamboo/xml-data/build-dir/PHPBB3-PR-JOB1:/data --workdir /data/build --rm -u=991 phpbb:php-5.6 ../phpBB/vendor/bin/phing sniff
17-Jun-2018 11:43:49         at com.atlassian.bamboo.docker.DockerContainerServiceImpl.execute(DockerContainerServiceImpl.java:252)
17-Jun-2018 11:43:49         at com.atlassian.bamboo.docker.DockerContainerServiceImpl.run(DockerContainerServiceImpl.java:106)
17-Jun-2018 11:43:49         ... 44 more
17-Jun-2018 11:43:49 Starting task 'Parsing test results produced by script' of type 'com.atlassian.bamboo.plugins.testresultparser:task.testresultparser.junit'
17-Jun-2018 11:43:49 Parsing test results under /home/bamboo/xml-data/build-dir/PHPBB3-PR-JOB1...
17-Jun-2018 11:43:49 Failing task since test cases were expected but none were found.
17-Jun-2018 11:43:49 Finished task 'Parsing test results produced by script' with result: Failed
17-Jun-2018 11:43:49
Substituting variable: ${bamboo.PRnumber} with 5243
17-Jun-2018 11:43:49
Substituting variable: ${bamboo.buildResultsUrl} with https://bamboo.phpbb.com/browse/PHPBB3-PR-JOB1-8238
17-Jun-2018 11:43:49
Substituting variable: ${bamboo.buildResultsUrl} with https://bamboo.phpbb.com/browse/PHPBB3-PR-JOB1-8238
17-Jun-2018 11:43:49 Starting task 'Set result build status' of type 'com.atlassian.bamboo.plugins.scripttask:task.builder.script'
17-Jun-2018 11:43:49
Beginning to execute external process for build 'phpBB3 - Pull Requests - Build and Test Job #8238 (PHPBB3-PR-JOB1-8238)'
... running command line:
/bin/sh /home/bamboo/temp/PHPBB3-PR-JOB1-8238-ScriptBuildTask-6487535712212476112.sh
... in: /home/bamboo/xml-data/build-dir/PHPBB3-PR-JOB1
... using extra environment variables:
bamboo_planRepository_1_branch=3.1.x
bamboo_planRepository_1_branchDisplayName=3.1.x
bamboo_repository_revision_number=dc8ff9da28b8ab4ad11c7ea94cca526f17c87fe5
bamboo_PRref=master
bamboo_resultsUrl=https://bamboo.phpbb.com/browse/PHPBB3-PR-JOB1-8238
bamboo_capability_system_builder_command_Git=/usr/bin/git
bamboo_repository_75956235_git_username=bantu
bamboo_build_working_directory=/home/bamboo/xml-data/build-dir/PHPBB3-PR-JOB1
bamboo_planRepository_1_name=phpBB Ascraeus
bamboo_buildKey=PHPBB3-PR-JOB1
bamboo_capability_phpbb_tests=true
bamboo_shortPlanName=Pull Requests
bamboo_capability_system_builder_command_fop=/usr/bin/fop
bamboo_capability_dbms_sqlite_2=true
bamboo_planRepository_name=phpBB Ascraeus
bamboo_PRnumber=5243
bamboo_buildNumber=8238
bamboo_repository_75956235_git_repositoryUrl=https://github.com/phpbb/phpbb.git
bamboo_capability_system_builder_phpunit_PHPUnit=/usr/bin/phpunit
bamboo_shortJobName=Build and Test Job
bamboo_buildResultsUrl=https://bamboo.phpbb.com/browse/PHPBB3-PR-JOB1-8238
bamboo_repository_75956235_branch_name=3.1.x
bamboo_planRepository_repositoryUrl=https://github.com/phpbb/phpbb.git
bamboo_agentId=131073
bamboo_planName=phpBB3 - Pull Requests
bamboo_build_commandline_com_atlassian_bamboo_plugins_scripttask_task_builder_script_7=/bin/sh /home/bamboo/temp/PHPBB3-PR-JOB1-8238-ScriptBuildTask-8069134794913188158.sh
bamboo_shortPlanKey=PR
bamboo_shortJobKey=JOB1
bamboo_capability_dbms_mysql_55=true
bamboo_capability_system_jdk_JDK_1_7_0_65=/usr/lib/jvm/java-7-openjdk-amd64
bamboo_planRepository_revision=dc8ff9da28b8ab4ad11c7ea94cca526f17c87fe5
bamboo_buildTimeStamp=2018-06-17T11:41:16.563Z
bamboo_repository_previous_revision_number=dc8ff9da28b8ab4ad11c7ea94cca526f17c87fe5
bamboo_capability_system_jdk_JDK_1_6_0_16=/usr/lib/jvm/java-6-sun-1.6.0.16
bamboo_capability_system_builder_mvn2_Maven_2=/usr/share/maven2
bamboo_planRepository_previousRevision=dc8ff9da28b8ab4ad11c7ea94cca526f17c87fe5
bamboo_build_commandline_com_atlassian_bamboo_plugins_scripttask_task_builder_script_4=/bin/sh /home/bamboo/temp/PHPBB3-PR-JOB1-8238-ScriptBuildTask-3238172609609011871.sh
bamboo_repository_git_branch=3.1.x
bamboo_buildResultKey=PHPBB3-PR-JOB1-8238
bamboo_repository_branch_name=3.1.x
bamboo_buildPlanName=phpBB3 - Pull Requests - Build and Test Job
bamboo_planRepository_1_revision=dc8ff9da28b8ab4ad11c7ea94cca526f17c87fe5
bamboo_repository_name=phpBB Ascraeus
bamboo_buildFailed=true
bamboo_capability_system_docker_executable=/usr/bin/docker
bamboo_build_commandline_com_atlassian_bamboo_plugins_bamboo_docker_plugin_task_docker_cli_11=/usr/bin/docker run --volume /home/bamboo/xml-data/build-dir/PHPBB3-PR-JOB1:/data --workdir /data/build --rm -u=991 phpbb:php-5.6 ../phpBB/vendor/bin/phing sniff
bamboo_build_commandline_com_atlassian_bamboo_plugins_bamboo_docker_plugin_task_docker_cli_12=/usr/bin/docker run --volume /home/bamboo/xml-data/build-dir/PHPBB3-PR-JOB1:/data --workdir /data/phpBB --rm -e HOME=/home/bamboo -u=991 phpbb:php-5.6 /bin/bash -c php ../composer.phar install --dev; cd ../build; ../phpBB/vendor/bin/phing clean prepare
bamboo_planRepository_branch=3.1.x
bamboo_agentWorkingDirectory=/home/bamboo/xml-data/build-dir
bamboo_jobFailed=true
bamboo_capability_system_git_executable=/usr/bin/git
bamboo_capability_system_builder_phpunit_PHPUnit_3_4=/usr/bin/phpunit
bamboo_repository_git_username=bantu
bamboo_planRepository_1_previousRevision=dc8ff9da28b8ab4ad11c7ea94cca526f17c87fe5
bamboo_repository_75956235_revision_number=dc8ff9da28b8ab4ad11c7ea94cca526f17c87fe5
bamboo_planRepository_branchDisplayName=3.1.x
bamboo_planRepository_1_type=gitv2
bamboo_planRepository_branchName=3.1.x
bamboo_repository_75956235_previous_revision_number=dc8ff9da28b8ab4ad11c7ea94cca526f17c87fe5
bamboo_capability_system_jdk_JDK=/usr/lib/jvm/java-6-sun
bamboo_plan_storageTag=PHPBB3-PR
bamboo_hg_cache_directory=/home/bamboo/xml-data/build-dir/_hg-repositories-cache
bamboo_planRepository_1_username=bantu
bamboo_planRepository_type=gitv2
bamboo_git_cache_directory=/home/bamboo/xml-data/build-dir/_git-repositories-cache
bamboo_ManualBuildTriggerReason_userName=Build Robot
bamboo_repository_git_repositoryUrl=https://github.com/phpbb/phpbb.git
bamboo_repository_75956235_git_branch=3.1.x
bamboo_capability_system_builder_ant_Ant=/usr/share/ant
bamboo_repository_75956235_name=phpBB Ascraeus
bamboo_tmp_directory=/home/bamboo/temp
bamboo_working_directory=/home/bamboo/xml-data/build-dir/PHPBB3-PR-JOB1
bamboo_planKey=PHPBB3-PR
bamboo_capability_local=true
bamboo_planRepository_1_repositoryUrl=https://github.com/phpbb/phpbb.git
bamboo_planRepository_username=bantu
bamboo_capability_system_jdk_JDK_1_6=/usr/lib/jvm/java-6-sun
bamboo_capability_system_jdk_JDK_1_7=/usr/lib/jvm/java-7-openjdk-amd64
bamboo_planRepository_1_branchName=3.1.x
17-Jun-2018 11:43:49 From https://github.com/phpbb/phpbb
17-Jun-2018 11:43:49 * branch            refs/pull/5243/head -> FETCH_HEAD
17-Jun-2018 11:43:49 grep: build/logs/phpunit.xml: No such file or directory
17-Jun-2018 11:43:49 grep: build/logs/phpunit.xml: No such file or directory
17-Jun-2018 11:43:49   % Total    % Received % Xferd  Average Speed   Time    Time     Time  Current
17-Jun-2018 11:43:49                                  Dload  Upload   Total   Spent    Left  Speed
17-Jun-2018 11:43:49
17-Jun-2018 11:43:50   0     0    0     0    0     0      0      0 --:--:-- --:--:-- --:--:--     0
17-Jun-2018 11:43:50 100   273  100    93  100   180    226    438 --:--:-- --:--:-- --:--:--   437
17-Jun-2018 11:43:50 100   273  100    93  100   180    226    438 --:--:-- --:--:-- --:--:--   437
17-Jun-2018 11:43:50 Finished task 'Set result build status' with result: Success
17-Jun-2018 11:43:50 Running post build plugin 'NCover Results Collector'
17-Jun-2018 11:43:50 Running post build plugin 'Artifact Copier'
17-Jun-2018 11:43:50 Running post build plugin 'npm Cache Cleanup'
17-Jun-2018 11:43:50 Running post build plugin 'Clover Results Collector'
17-Jun-2018 11:43:50 Running post build plugin 'Docker Container Cleanup'
17-Jun-2018 11:43:50 Successfully removed working directory at '/home/bamboo/xml-data/build-dir/PHPBB3-PR-JOB1'
17-Jun-2018 11:43:50 Finalising the build...
17-Jun-2018 11:43:50 Stopping timer.
17-Jun-2018 11:43:50 Build PHPBB3-PR-JOB1-8238 completed.
17-Jun-2018 11:43:50 Running on server: post build plugin 'NCover Results Collector'
17-Jun-2018 11:43:50 Running on server: post build plugin 'Build Hanging Detection Configuration'
17-Jun-2018 11:43:50 Running on server: post build plugin 'Clover Delta Calculator'
17-Jun-2018 11:43:50 Running on server: post build plugin 'Maven Dependencies Postprocessor'
17-Jun-2018 11:43:50 All post build plugins have finished
17-Jun-2018 11:43:50 Generating build results summary...
17-Jun-2018 11:43:50 Saving build results to disk...
17-Jun-2018 11:43:50 Logging substituted variables...
17-Jun-2018 11:43:50 Indexing build results...
17-Jun-2018 11:43:50 Finished building PHPBB3-PR-JOB1-8238.
17-Jun-2018 11:43:51
Substituting variable: ${bamboo.PRnumber} with 5243