Tests pending pull requests

Build: #8256 failed

Job: Build and Test Job failed

Stages & jobs

  1. Build and Test

Job result summary

Completed
Duration
5 minutes
Flags
Custom build
Agent
Default Agent
Revision
dc8ff9da28b8ab4ad11c7ea94cca526f17c87fe5 dc8ff9da28b8ab4ad11c7ea94cca526f17c87fe5
Total tests
6879
Failing since
#8254 (Manual run by Build Robot – )
Fixed in
#8257 (Manual run by Build Robot)

Tests

  • 6,879 tests in total
  • 909 tests failed
  • 2 minutes taken in total.
Existing test failures 909
Status Test Failing since Duration
phpbb_attachment_delete_test::test_attachment_delete with data set #0 ('attach', '', false, false)
Exception: Could not find parameter: debug.load_time

/data/tests/mock/container_builder.php:101
/data/phpBB/phpbb/db/driver/sqlite3.php:128
/data/phpBB/phpbb/db/driver/sqlite3.php:215
/data/phpBB/phpbb/db/driver/driver.php:270
/data/phpBB/phpbb/db/tools/tools.php:281
(6 more lines...)
phpbb_attachment_delete_test::test_attachment_delete with data set #1 ('meh', 5, false, 0)
Exception: Could not find parameter: debug.load_time

/data/tests/mock/container_builder.php:101
/data/phpBB/phpbb/db/driver/sqlite3.php:128
/data/phpBB/phpbb/db/driver/sqlite3.php:215
/data/phpBB/phpbb/db/driver/driver.php:270
/data/phpBB/phpbb/db/tools/tools.php:281
(6 more lines...)
phpbb_attachment_delete_test::test_attachment_delete with data set #2 ('attach', array(5), false, 0)
Exception: Could not find parameter: debug.load_time

/data/tests/mock/container_builder.php:101
/data/phpBB/phpbb/db/driver/sqlite3.php:128
/data/phpBB/phpbb/db/driver/sqlite3.php:215
/data/phpBB/phpbb/db/driver/driver.php:270
/data/phpBB/phpbb/db/tools/tools.php:281
(6 more lines...)
phpbb_attachment_delete_test::test_attachment_delete with data set #3 ('attach', array(1, 2), false, 2)
Exception: Could not find parameter: debug.load_time

/data/tests/mock/container_builder.php:101
/data/phpBB/phpbb/db/driver/sqlite3.php:128
/data/phpBB/phpbb/db/driver/sqlite3.php:215
/data/phpBB/phpbb/db/driver/driver.php:270
/data/phpBB/phpbb/db/tools/tools.php:281
(6 more lines...)
phpbb_attachment_delete_test::test_attachment_delete with data set #4 ('attach', array(1, 2), true, 2)
Exception: Could not find parameter: debug.load_time

/data/tests/mock/container_builder.php:101
/data/phpBB/phpbb/db/driver/sqlite3.php:128
/data/phpBB/phpbb/db/driver/sqlite3.php:215
/data/phpBB/phpbb/db/driver/driver.php:270
/data/phpBB/phpbb/db/tools/tools.php:281
(6 more lines...)
phpbb_attachment_delete_test::test_attachment_delete with data set #5 ('post', 5, false, 0)
Exception: Could not find parameter: debug.load_time

/data/tests/mock/container_builder.php:101
/data/phpBB/phpbb/db/driver/sqlite3.php:128
/data/phpBB/phpbb/db/driver/sqlite3.php:215
/data/phpBB/phpbb/db/driver/driver.php:270
/data/phpBB/phpbb/db/tools/tools.php:281
(6 more lines...)
phpbb_attachment_delete_test::test_attachment_delete with data set #6 ('topic', 5, false, 0)
Exception: Could not find parameter: debug.load_time

/data/tests/mock/container_builder.php:101
/data/phpBB/phpbb/db/driver/sqlite3.php:128
/data/phpBB/phpbb/db/driver/sqlite3.php:215
/data/phpBB/phpbb/db/driver/driver.php:270
/data/phpBB/phpbb/db/tools/tools.php:281
(6 more lines...)
phpbb_attachment_delete_test::test_attachment_delete with data set #7 ('topic', 1, true, 3)
Exception: Could not find parameter: debug.load_time

/data/tests/mock/container_builder.php:101
/data/phpBB/phpbb/db/driver/sqlite3.php:128
/data/phpBB/phpbb/db/driver/sqlite3.php:215
/data/phpBB/phpbb/db/driver/driver.php:270
/data/phpBB/phpbb/db/tools/tools.php:281
(6 more lines...)
phpbb_attachment_delete_test::test_attachment_delete with data set #8 ('user', 1, false, 0)
Exception: Could not find parameter: debug.load_time

/data/tests/mock/container_builder.php:101
/data/phpBB/phpbb/db/driver/sqlite3.php:128
/data/phpBB/phpbb/db/driver/sqlite3.php:215
/data/phpBB/phpbb/db/driver/driver.php:270
/data/phpBB/phpbb/db/tools/tools.php:281
(6 more lines...)
phpbb_attachment_delete_test::test_attachment_delete_success with data set #0 (true, true, true)
Exception: Could not find parameter: debug.load_time

/data/tests/mock/container_builder.php:101
/data/phpBB/phpbb/db/driver/sqlite3.php:128
/data/phpBB/phpbb/db/driver/sqlite3.php:215
/data/phpBB/phpbb/db/driver/driver.php:270
/data/phpBB/phpbb/db/tools/tools.php:281
(6 more lines...)
phpbb_attachment_delete_test::test_attachment_delete_success with data set #1 (true, false, false)
Exception: Could not find parameter: debug.load_time

/data/tests/mock/container_builder.php:101
/data/phpBB/phpbb/db/driver/sqlite3.php:128
/data/phpBB/phpbb/db/driver/sqlite3.php:215
/data/phpBB/phpbb/db/driver/driver.php:270
/data/phpBB/phpbb/db/tools/tools.php:281
(6 more lines...)
phpbb_attachment_delete_test::test_attachment_delete_success with data set #2 (true, true, false, true)
Exception: Could not find parameter: debug.load_time

/data/tests/mock/container_builder.php:101
/data/phpBB/phpbb/db/driver/sqlite3.php:128
/data/phpBB/phpbb/db/driver/sqlite3.php:215
/data/phpBB/phpbb/db/driver/driver.php:270
/data/phpBB/phpbb/db/tools/tools.php:281
(6 more lines...)
phpbb_attachment_resync_test::test_resync with data set #0 ('', array(1), 'post_id', 'phpbb_posts', array('1'), array('1'))
Exception: Could not find parameter: debug.load_time

/data/tests/mock/container_builder.php:101
/data/phpBB/phpbb/db/driver/sqlite3.php:128
/data/phpBB/phpbb/db/driver/sqlite3.php:215
/data/phpBB/phpbb/db/driver/driver.php:270
/data/phpBB/phpbb/db/tools/tools.php:281
(6 more lines...)
phpbb_attachment_resync_test::test_resync with data set #1 ('post', array(1), 'post_id', 'phpbb_posts', array('1'), array('1'))
Exception: Could not find parameter: debug.load_time

/data/tests/mock/container_builder.php:101
/data/phpBB/phpbb/db/driver/sqlite3.php:128
/data/phpBB/phpbb/db/driver/sqlite3.php:215
/data/phpBB/phpbb/db/driver/driver.php:270
/data/phpBB/phpbb/db/tools/tools.php:281
(6 more lines...)
phpbb_attachment_resync_test::test_resync with data set #2 ('post', array(2), 'post_id', 'phpbb_posts', array('1'), array('0'))
Exception: Could not find parameter: debug.load_time

/data/tests/mock/container_builder.php:101
/data/phpBB/phpbb/db/driver/sqlite3.php:128
/data/phpBB/phpbb/db/driver/sqlite3.php:215
/data/phpBB/phpbb/db/driver/driver.php:270
/data/phpBB/phpbb/db/tools/tools.php:281
(6 more lines...)
phpbb_attachment_resync_test::test_resync with data set #3 ('topic', array(1), 'topic_id', 'phpbb_topics', array('1'), array('1'))
Exception: Could not find parameter: debug.load_time

/data/tests/mock/container_builder.php:101
/data/phpBB/phpbb/db/driver/sqlite3.php:128
/data/phpBB/phpbb/db/driver/sqlite3.php:215
/data/phpBB/phpbb/db/driver/driver.php:270
/data/phpBB/phpbb/db/tools/tools.php:281
(6 more lines...)
phpbb_attachment_resync_test::test_resync with data set #4 ('topic', array(2), 'topic_id', 'phpbb_topics', array('1'), array('0'))
Exception: Could not find parameter: debug.load_time

/data/tests/mock/container_builder.php:101
/data/phpBB/phpbb/db/driver/sqlite3.php:128
/data/phpBB/phpbb/db/driver/sqlite3.php:215
/data/phpBB/phpbb/db/driver/driver.php:270
/data/phpBB/phpbb/db/tools/tools.php:281
(6 more lines...)
phpbb_attachment_resync_test::test_resync with data set #5 ('message', array(1), 'msg_id', 'phpbb_privmsgs', array('1'), array('1'))
Exception: Could not find parameter: debug.load_time

/data/tests/mock/container_builder.php:101
/data/phpBB/phpbb/db/driver/sqlite3.php:128
/data/phpBB/phpbb/db/driver/sqlite3.php:215
/data/phpBB/phpbb/db/driver/driver.php:270
/data/phpBB/phpbb/db/tools/tools.php:281
(6 more lines...)
phpbb_attachment_resync_test::test_resync with data set #6 ('message', array(2), 'msg_id', 'phpbb_privmsgs', array('1'), array('0'))
Exception: Could not find parameter: debug.load_time

/data/tests/mock/container_builder.php:101
/data/phpBB/phpbb/db/driver/sqlite3.php:128
/data/phpBB/phpbb/db/driver/sqlite3.php:215
/data/phpBB/phpbb/db/driver/driver.php:270
/data/phpBB/phpbb/db/tools/tools.php:281
(6 more lines...)
phpbb_attachment_upload_test::test_image_upload with data set #0 (false, false, array(), array(array('The image file you tried to a...valid.'), false, 1))
Exception: Could not find parameter: debug.load_time

/data/tests/mock/container_builder.php:101
/data/phpBB/phpbb/db/driver/sqlite3.php:128
/data/phpBB/phpbb/db/driver/sqlite3.php:215
/data/phpBB/phpbb/db/driver/driver.php:270
/data/phpBB/phpbb/db/tools/tools.php:281
(6 more lines...)
phpbb_attachment_upload_test::test_image_upload with data set #1 (false, true, array(), array(array('The image file you tried to a...valid.'), false, 1))
Exception: Could not find parameter: debug.load_time

/data/tests/mock/container_builder.php:101
/data/phpBB/phpbb/db/driver/sqlite3.php:128
/data/phpBB/phpbb/db/driver/sqlite3.php:215
/data/phpBB/phpbb/db/driver/driver.php:270
/data/phpBB/phpbb/db/tools/tools.php:281
(6 more lines...)
phpbb_attachment_upload_test::test_image_upload with data set #2 (true, false, array(), array(array(), true, 0, 100, 'jpg', 'jpg', 'foobar.jpg'))
Exception: Could not find parameter: debug.load_time

/data/tests/mock/container_builder.php:101
/data/phpBB/phpbb/db/driver/sqlite3.php:128
/data/phpBB/phpbb/db/driver/sqlite3.php:215
/data/phpBB/phpbb/db/driver/driver.php:270
/data/phpBB/phpbb/db/tools/tools.php:281
(6 more lines...)
phpbb_attachment_upload_test::test_image_upload with data set #3 (true, false, array(true, ''), array(array(), true, 0, 100, 'jpg', 'jpg', 'foobar.jpg'))
Exception: Could not find parameter: debug.load_time

/data/tests/mock/container_builder.php:101
/data/phpBB/phpbb/db/driver/sqlite3.php:128
/data/phpBB/phpbb/db/driver/sqlite3.php:215
/data/phpBB/phpbb/db/driver/driver.php:270
/data/phpBB/phpbb/db/tools/tools.php:281
(6 more lines...)
phpbb_attachment_upload_test::test_image_upload with data set #4 (true, false, array(150), array(array(), true, 0, 100, 'jpg', 'jpg', 'foobar.jpg'))
Exception: Could not find parameter: debug.load_time

/data/tests/mock/container_builder.php:101
/data/phpBB/phpbb/db/driver/sqlite3.php:128
/data/phpBB/phpbb/db/driver/sqlite3.php:215
/data/phpBB/phpbb/db/driver/driver.php:270
/data/phpBB/phpbb/db/tools/tools.php:281
(6 more lines...)
phpbb_attachment_upload_test::test_image_upload with data set #5 (true, false, array(50), array(array('ATTACH_QUOTA_REACHED'), false, 1, 100, 'jpg', 'jpg', 'foobar.jpg'))
Exception: Could not find parameter: debug.load_time

/data/tests/mock/container_builder.php:101
/data/phpBB/phpbb/db/driver/sqlite3.php:128
/data/phpBB/phpbb/db/driver/sqlite3.php:215
/data/phpBB/phpbb/db/driver/driver.php:270
/data/phpBB/phpbb/db/tools/tools.php:281
(6 more lines...)
phpbb_attachment_upload_test::test_init_error
Exception: Could not find parameter: debug.load_time

/data/tests/mock/container_builder.php:101
/data/phpBB/phpbb/db/driver/sqlite3.php:128
/data/phpBB/phpbb/db/driver/sqlite3.php:215
/data/phpBB/phpbb/db/driver/driver.php:270
/data/phpBB/phpbb/db/tools/tools.php:281
(6 more lines...)
phpbb_attachment_upload_test::test_upload with data set #0 ('foobar', 1, false, array(), array(array('Upload initiated but no valid...found.'), false))
Exception: Could not find parameter: debug.load_time

/data/tests/mock/container_builder.php:101
/data/phpBB/phpbb/db/driver/sqlite3.php:128
/data/phpBB/phpbb/db/driver/sqlite3.php:215
/data/phpBB/phpbb/db/driver/driver.php:270
/data/phpBB/phpbb/db/tools/tools.php:281
(6 more lines...)
phpbb_attachment_upload_test::test_upload with data set #1 ('foobar', 1, true, array('foobar.jpg', 'jpg', 100), array(array('NOT_UPLOADED', 'The image file you tried to a...valid.'), false, 1))
Exception: Could not find parameter: debug.load_time

/data/tests/mock/container_builder.php:101
/data/phpBB/phpbb/db/driver/sqlite3.php:128
/data/phpBB/phpbb/db/driver/sqlite3.php:215
/data/phpBB/phpbb/db/driver/driver.php:270
/data/phpBB/phpbb/db/tools/tools.php:281
(6 more lines...)
phpbb_attachment_upload_test::test_upload with data set #2 ('foobar', 1, true, array(), array(array('NOT_UPLOADED'), false, 0))
Exception: Could not find parameter: debug.load_time

/data/tests/mock/container_builder.php:101
/data/phpBB/phpbb/db/driver/sqlite3.php:128
/data/phpBB/phpbb/db/driver/sqlite3.php:215
/data/phpBB/phpbb/db/driver/driver.php:270
/data/phpBB/phpbb/db/tools/tools.php:281
(6 more lines...)
phpbb_auth_provider_apache_test::test_autologin
Exception: Could not find parameter: debug.load_time

/data/tests/mock/container_builder.php:101
/data/phpBB/phpbb/db/driver/sqlite3.php:128
/data/phpBB/phpbb/db/driver/sqlite3.php:215
/data/phpBB/phpbb/db/driver/driver.php:270
/data/phpBB/phpbb/db/tools/tools.php:281
(6 more lines...)
phpbb_auth_provider_apache_test::test_init
Exception: Could not find parameter: debug.load_time

/data/tests/mock/container_builder.php:101
/data/phpBB/phpbb/db/driver/sqlite3.php:128
/data/phpBB/phpbb/db/driver/sqlite3.php:215
/data/phpBB/phpbb/db/driver/driver.php:270
/data/phpBB/phpbb/db/tools/tools.php:281
(6 more lines...)
phpbb_auth_provider_apache_test::test_login
Exception: Could not find parameter: debug.load_time

/data/tests/mock/container_builder.php:101
/data/phpBB/phpbb/db/driver/sqlite3.php:128
/data/phpBB/phpbb/db/driver/sqlite3.php:215
/data/phpBB/phpbb/db/driver/driver.php:270
/data/phpBB/phpbb/db/tools/tools.php:281
(6 more lines...)
phpbb_auth_provider_apache_test::test_validate_session
Exception: Could not find parameter: debug.load_time

/data/tests/mock/container_builder.php:101
/data/phpBB/phpbb/db/driver/sqlite3.php:128
/data/phpBB/phpbb/db/driver/sqlite3.php:215
/data/phpBB/phpbb/db/driver/driver.php:270
/data/phpBB/phpbb/db/tools/tools.php:281
(6 more lines...)
phpbb_auth_provider_db_test::test_login
Exception: Could not find parameter: debug.load_time

/data/tests/mock/container_builder.php:101
/data/phpBB/phpbb/db/driver/sqlite3.php:128
/data/phpBB/phpbb/db/driver/sqlite3.php:215
/data/phpBB/phpbb/db/driver/driver.php:270
/data/phpBB/phpbb/db/tools/tools.php:281
(5 more lines...)
phpbb_auth_provider_oauth_token_storage_test::test_hasAccessToken with data set #0 (null, false)
Exception: Could not find parameter: debug.load_time

/data/tests/mock/container_builder.php:101
/data/phpBB/phpbb/db/driver/sqlite3.php:128
/data/phpBB/phpbb/db/driver/sqlite3.php:215
/data/phpBB/phpbb/db/driver/driver.php:270
/data/phpBB/phpbb/db/tools/tools.php:281
(6 more lines...)
phpbb_auth_provider_oauth_token_storage_test::test_hasAccessToken with data set #1 (OAuth\OAuth2\Token\StdOAuth2Token Object (...), true)
Exception: Could not find parameter: debug.load_time

/data/tests/mock/container_builder.php:101
/data/phpBB/phpbb/db/driver/sqlite3.php:128
/data/phpBB/phpbb/db/driver/sqlite3.php:215
/data/phpBB/phpbb/db/driver/driver.php:270
/data/phpBB/phpbb/db/tools/tools.php:281
(6 more lines...)
phpbb_auth_provider_oauth_token_storage_test::test_clearToken
Exception: Could not find parameter: debug.load_time

/data/tests/mock/container_builder.php:101
/data/phpBB/phpbb/db/driver/sqlite3.php:128
/data/phpBB/phpbb/db/driver/sqlite3.php:215
/data/phpBB/phpbb/db/driver/driver.php:270
/data/phpBB/phpbb/db/tools/tools.php:281
(6 more lines...)
phpbb_auth_provider_oauth_token_storage_test::test_has_access_token_by_session with data set #0 (null, false)
Exception: Could not find parameter: debug.load_time

/data/tests/mock/container_builder.php:101
/data/phpBB/phpbb/db/driver/sqlite3.php:128
/data/phpBB/phpbb/db/driver/sqlite3.php:215
/data/phpBB/phpbb/db/driver/driver.php:270
/data/phpBB/phpbb/db/tools/tools.php:281
(6 more lines...)
phpbb_auth_provider_oauth_token_storage_test::test_has_access_token_by_session with data set #1 (OAuth\OAuth2\Token\StdOAuth2Token Object (...), true)
Exception: Could not find parameter: debug.load_time

/data/tests/mock/container_builder.php:101
/data/phpBB/phpbb/db/driver/sqlite3.php:128
/data/phpBB/phpbb/db/driver/sqlite3.php:215
/data/phpBB/phpbb/db/driver/driver.php:270
/data/phpBB/phpbb/db/tools/tools.php:281
(6 more lines...)
phpbb_auth_provider_oauth_token_storage_test::test_set_user_id
Exception: Could not find parameter: debug.load_time

/data/tests/mock/container_builder.php:101
/data/phpBB/phpbb/db/driver/sqlite3.php:128
/data/phpBB/phpbb/db/driver/sqlite3.php:215
/data/phpBB/phpbb/db/driver/driver.php:270
/data/phpBB/phpbb/db/tools/tools.php:281
(6 more lines...)
phpbb_auth_provider_oauth_token_storage_test::test_retrieveAccessToken with data set #0 (OAuth\OAuth2\Token\StdOAuth2Token Object (...), null)
Exception: Could not find parameter: debug.load_time

/data/tests/mock/container_builder.php:101
/data/phpBB/phpbb/db/driver/sqlite3.php:128
/data/phpBB/phpbb/db/driver/sqlite3.php:215
/data/phpBB/phpbb/db/driver/driver.php:270
/data/phpBB/phpbb/db/tools/tools.php:281
(6 more lines...)
phpbb_auth_provider_oauth_token_storage_test::test_retrieveAccessToken with data set #1 (null, 'OAuth\Common\Storage\Exceptio...eption')
Exception: Could not find parameter: debug.load_time

/data/tests/mock/container_builder.php:101
/data/phpBB/phpbb/db/driver/sqlite3.php:128
/data/phpBB/phpbb/db/driver/sqlite3.php:215
/data/phpBB/phpbb/db/driver/driver.php:270
/data/phpBB/phpbb/db/tools/tools.php:281
(6 more lines...)
phpbb_auth_provider_oauth_token_storage_test::test_retrieveAccessToken_from_db
Exception: Could not find parameter: debug.load_time

/data/tests/mock/container_builder.php:101
/data/phpBB/phpbb/db/driver/sqlite3.php:128
/data/phpBB/phpbb/db/driver/sqlite3.php:215
/data/phpBB/phpbb/db/driver/driver.php:270
/data/phpBB/phpbb/db/tools/tools.php:281
(6 more lines...)
phpbb_auth_provider_oauth_token_storage_test::test_retrieveAccessToken_wrong_token
Exception: Could not find parameter: debug.load_time

/data/tests/mock/container_builder.php:101
/data/phpBB/phpbb/db/driver/sqlite3.php:128
/data/phpBB/phpbb/db/driver/sqlite3.php:215
/data/phpBB/phpbb/db/driver/driver.php:270
/data/phpBB/phpbb/db/tools/tools.php:281
(6 more lines...)
phpbb_auth_provider_oauth_token_storage_test::test_retrieve_access_token_by_session with data set #0 (OAuth\OAuth2\Token\StdOAuth2Token Object (...), null)
Exception: Could not find parameter: debug.load_time

/data/tests/mock/container_builder.php:101
/data/phpBB/phpbb/db/driver/sqlite3.php:128
/data/phpBB/phpbb/db/driver/sqlite3.php:215
/data/phpBB/phpbb/db/driver/driver.php:270
/data/phpBB/phpbb/db/tools/tools.php:281
(6 more lines...)
phpbb_auth_provider_oauth_token_storage_test::test_retrieve_access_token_by_session with data set #1 (null, 'OAuth\Common\Storage\Exceptio...eption')
Exception: Could not find parameter: debug.load_time

/data/tests/mock/container_builder.php:101
/data/phpBB/phpbb/db/driver/sqlite3.php:128
/data/phpBB/phpbb/db/driver/sqlite3.php:215
/data/phpBB/phpbb/db/driver/driver.php:270
/data/phpBB/phpbb/db/tools/tools.php:281
(6 more lines...)
phpbb_auth_provider_oauth_token_storage_test::test_retrieve_access_token_by_session_from_db
Exception: Could not find parameter: debug.load_time

/data/tests/mock/container_builder.php:101
/data/phpBB/phpbb/db/driver/sqlite3.php:128
/data/phpBB/phpbb/db/driver/sqlite3.php:215
/data/phpBB/phpbb/db/driver/driver.php:270
/data/phpBB/phpbb/db/tools/tools.php:281
(6 more lines...)
phpbb_auth_provider_oauth_token_storage_test::test_storeAccessToken
Exception: Could not find parameter: debug.load_time

/data/tests/mock/container_builder.php:101
/data/phpBB/phpbb/db/driver/sqlite3.php:128
/data/phpBB/phpbb/db/driver/sqlite3.php:215
/data/phpBB/phpbb/db/driver/driver.php:270
/data/phpBB/phpbb/db/tools/tools.php:281
(6 more lines...)
phpbb_avatar_manager_test::test_get_all_drivers
Exception: Could not find parameter: debug.load_time

/data/tests/mock/container_builder.php:101
/data/phpBB/phpbb/db/driver/sqlite3.php:128
/data/phpBB/phpbb/db/driver/sqlite3.php:215
/data/phpBB/phpbb/db/driver/driver.php:270
/data/phpBB/phpbb/db/tools/tools.php:281
(5 more lines...)
phpbb_avatar_manager_test::test_get_enabled_drivers
Exception: Could not find parameter: debug.load_time

/data/tests/mock/container_builder.php:101
/data/phpBB/phpbb/db/driver/sqlite3.php:128
/data/phpBB/phpbb/db/driver/sqlite3.php:215
/data/phpBB/phpbb/db/driver/driver.php:270
/data/phpBB/phpbb/db/tools/tools.php:281
(5 more lines...)

Error summary

The build generated some errors. See the full build log for more details.

From https://github.com/phpbb/phpbb
* branch            refs/pull/5266/head -> FETCH_HEAD
  % Total    % Received % Xferd  Average Speed   Time    Time     Time  Current
                                 Dload  Upload   Total   Spent    Left  Speed

  0     0    0     0    0     0      0      0 --:--:-- --:--:-- --:--:--     0
  0     0    0     0    0     0      0      0 --:--:-- --:--:-- --:--:--     0
100   275  100    93  100   182    113    222 --:--:-- --:--:-- --:--:--   221
From https://github.com/phpbb/phpbb
* branch            refs/pull/5266/merge -> FETCH_HEAD
Note: checking out 'FETCH_HEAD'.

You are in 'detached HEAD' state. You can look around, make experimental
changes and commit them, and you can discard any commits you make in this
state without impacting any branches by performing another checkout.

If you want to create a new branch to retain commits you create, you may
do so (now or later) by using -b with the checkout command again. Example:

  git checkout -b new_branch_name

HEAD is now at 2833786... Merge d6c23bed3e58f72f7236fe6150920b9305becef4 into 1d0046437bea5318a84ae38ca4637f1419b5a15a
From https://github.com/phpbb/phpbb
* branch            refs/pull/5266/head -> FETCH_HEAD
  % Total    % Received % Xferd  Average Speed   Time    Time     Time  Current
                                 Dload  Upload   Total   Spent    Left  Speed

  0     0    0     0    0     0      0      0 --:--:-- --:--:-- --:--:--     0
  0     0    0     0    0     0      0      0 --:--:-- --:--:-- --:--:--     0
100   267  100    93  100   174    187    349 --:--:-- --:--:-- --:--:--   349