Tests pending pull requests

Build: #8276 failed

Job: Build and Test Job failed

Stages & jobs

  1. Build and Test

Build log

The build generated 351 lines of output. Download or view full build log

19-Jun-2018 16:37:33 Build phpBB3 - Pull Requests - Build and Test Job #8276 (PHPBB3-PR-JOB1-8276) started building on agent Default Agent
19-Jun-2018 16:37:33
19-Jun-2018 16:37:33 Build working directory is /home/bamboo/xml-data/build-dir/PHPBB3-PR-JOB1
19-Jun-2018 16:37:33 Executing build phpBB3 - Pull Requests - Build and Test Job #8276 (PHPBB3-PR-JOB1-8276)
19-Jun-2018 16:37:33 Starting task 'Checkout develop branch' of type 'com.atlassian.bamboo.plugins.vcs:task.vcs.checkout'
19-Jun-2018 16:37:33 Build always requires a clean checkout
19-Jun-2018 16:37:33 Cleaning build directory '/home/bamboo/xml-data/build-dir/PHPBB3-PR-JOB1'
19-Jun-2018 16:37:33 Checking out into /home/bamboo/xml-data/build-dir/PHPBB3-PR-JOB1
19-Jun-2018 16:37:33 Updating source code to revision: dc8ff9da28b8ab4ad11c7ea94cca526f17c87fe5
19-Jun-2018 16:37:33 Fetching 'refs/heads/3.1.x' from 'https://github.com/phpbb/phpbb.git'.
19-Jun-2018 16:37:33 Checking out revision dc8ff9da28b8ab4ad11c7ea94cca526f17c87fe5.
19-Jun-2018 16:37:33 Creating local git repository in '/home/bamboo/xml-data/build-dir/PHPBB3-PR-JOB1/.git'.
19-Jun-2018 16:37:33 Cloning into '/home/bamboo/xml-data/build-dir/PHPBB3-PR-JOB1'...
19-Jun-2018 16:37:33 done.
19-Jun-2018 16:37:35 Switched to a new branch '3.1.x'
19-Jun-2018 16:37:35 Branch 3.1.x set up to track remote branch 3.1.x from origin.
19-Jun-2018 16:37:35 Updated source code to revision: dc8ff9da28b8ab4ad11c7ea94cca526f17c87fe5
19-Jun-2018 16:37:35 Finished task 'Checkout develop branch' with result: Success
19-Jun-2018 16:37:35 Running pre-build action: VCS Version Collector
19-Jun-2018 16:37:35
Substituting variable: ${bamboo.PRnumber} with 4933
19-Jun-2018 16:37:35
Substituting variable: ${bamboo.buildResultsUrl} with https://bamboo.phpbb.com/browse/PHPBB3-PR-JOB1-8276
19-Jun-2018 16:37:35 Starting task 'Set pending build status' of type 'com.atlassian.bamboo.plugins.scripttask:task.builder.script'
19-Jun-2018 16:37:35
Beginning to execute external process for build 'phpBB3 - Pull Requests - Build and Test Job #8276 (PHPBB3-PR-JOB1-8276)'
... running command line:
/bin/sh /home/bamboo/temp/PHPBB3-PR-JOB1-8276-ScriptBuildTask-3501477517848242476.sh
... in: /home/bamboo/xml-data/build-dir/PHPBB3-PR-JOB1
... using extra environment variables:
bamboo_planRepository_1_branch=3.1.x
bamboo_planRepository_1_branchDisplayName=3.1.x
bamboo_repository_revision_number=dc8ff9da28b8ab4ad11c7ea94cca526f17c87fe5
bamboo_PRref=master
bamboo_resultsUrl=https://bamboo.phpbb.com/browse/PHPBB3-PR-JOB1-8276
bamboo_capability_system_builder_command_Git=/usr/bin/git
bamboo_repository_75956235_git_username=bantu
bamboo_build_working_directory=/home/bamboo/xml-data/build-dir/PHPBB3-PR-JOB1
bamboo_planRepository_1_name=phpBB Ascraeus
bamboo_buildKey=PHPBB3-PR-JOB1
bamboo_capability_phpbb_tests=true
bamboo_shortPlanName=Pull Requests
bamboo_capability_system_builder_command_fop=/usr/bin/fop
bamboo_capability_dbms_sqlite_2=true
bamboo_planRepository_name=phpBB Ascraeus
bamboo_PRnumber=4933
bamboo_buildNumber=8276
bamboo_repository_75956235_git_repositoryUrl=https://github.com/phpbb/phpbb.git
bamboo_capability_system_builder_phpunit_PHPUnit=/usr/bin/phpunit
bamboo_shortJobName=Build and Test Job
bamboo_buildResultsUrl=https://bamboo.phpbb.com/browse/PHPBB3-PR-JOB1-8276
bamboo_repository_75956235_branch_name=3.1.x
bamboo_planRepository_repositoryUrl=https://github.com/phpbb/phpbb.git
bamboo_agentId=131073
bamboo_planName=phpBB3 - Pull Requests
bamboo_shortPlanKey=PR
bamboo_shortJobKey=JOB1
bamboo_capability_dbms_mysql_55=true
bamboo_capability_system_jdk_JDK_1_7_0_65=/usr/lib/jvm/java-7-openjdk-amd64
bamboo_planRepository_revision=dc8ff9da28b8ab4ad11c7ea94cca526f17c87fe5
bamboo_buildTimeStamp=2018-06-19T16:37:33.068Z
bamboo_repository_previous_revision_number=dc8ff9da28b8ab4ad11c7ea94cca526f17c87fe5
bamboo_capability_system_jdk_JDK_1_6_0_16=/usr/lib/jvm/java-6-sun-1.6.0.16
bamboo_capability_system_builder_mvn2_Maven_2=/usr/share/maven2
bamboo_planRepository_previousRevision=dc8ff9da28b8ab4ad11c7ea94cca526f17c87fe5
bamboo_repository_git_branch=3.1.x
bamboo_buildResultKey=PHPBB3-PR-JOB1-8276
bamboo_repository_branch_name=3.1.x
bamboo_buildPlanName=phpBB3 - Pull Requests - Build and Test Job
bamboo_planRepository_1_revision=dc8ff9da28b8ab4ad11c7ea94cca526f17c87fe5
bamboo_repository_name=phpBB Ascraeus
bamboo_buildFailed=false
bamboo_capability_system_docker_executable=/usr/bin/docker
bamboo_planRepository_branch=3.1.x
bamboo_agentWorkingDirectory=/home/bamboo/xml-data/build-dir
bamboo_capability_system_git_executable=/usr/bin/git
bamboo_capability_system_builder_phpunit_PHPUnit_3_4=/usr/bin/phpunit
bamboo_repository_git_username=bantu
bamboo_planRepository_1_previousRevision=dc8ff9da28b8ab4ad11c7ea94cca526f17c87fe5
bamboo_repository_75956235_revision_number=dc8ff9da28b8ab4ad11c7ea94cca526f17c87fe5
bamboo_planRepository_branchDisplayName=3.1.x
bamboo_planRepository_1_type=gitv2
bamboo_planRepository_branchName=3.1.x
bamboo_repository_75956235_previous_revision_number=dc8ff9da28b8ab4ad11c7ea94cca526f17c87fe5
bamboo_capability_system_jdk_JDK=/usr/lib/jvm/java-6-sun
bamboo_plan_storageTag=PHPBB3-PR
bamboo_hg_cache_directory=/home/bamboo/xml-data/build-dir/_hg-repositories-cache
bamboo_planRepository_1_username=bantu
bamboo_planRepository_type=gitv2
bamboo_git_cache_directory=/home/bamboo/xml-data/build-dir/_git-repositories-cache
bamboo_ManualBuildTriggerReason_userName=Build Robot
bamboo_repository_git_repositoryUrl=https://github.com/phpbb/phpbb.git
bamboo_repository_75956235_git_branch=3.1.x
bamboo_capability_system_builder_ant_Ant=/usr/share/ant
bamboo_repository_75956235_name=phpBB Ascraeus
bamboo_tmp_directory=/home/bamboo/temp
bamboo_working_directory=/home/bamboo/xml-data/build-dir/PHPBB3-PR-JOB1
bamboo_planKey=PHPBB3-PR
bamboo_capability_local=true
bamboo_planRepository_1_repositoryUrl=https://github.com/phpbb/phpbb.git
bamboo_planRepository_username=bantu
bamboo_capability_system_jdk_JDK_1_6=/usr/lib/jvm/java-6-sun
bamboo_capability_system_jdk_JDK_1_7=/usr/lib/jvm/java-7-openjdk-amd64
bamboo_planRepository_1_branchName=3.1.x
19-Jun-2018 16:37:37 From https://github.com/phpbb/phpbb
19-Jun-2018 16:37:37 * branch            refs/pull/4933/head -> FETCH_HEAD
19-Jun-2018 16:37:37   % Total    % Received % Xferd  Average Speed   Time    Time     Time  Current
19-Jun-2018 16:37:37                                  Dload  Upload   Total   Spent    Left  Speed
19-Jun-2018 16:37:37
19-Jun-2018 16:37:38   0     0    0     0    0     0      0      0 --:--:-- --:--:-- --:--:--     0
19-Jun-2018 16:37:38 100   275  100    93  100   182    170    333 --:--:-- --:--:-- --:--:--   333
19-Jun-2018 16:37:38 100   275  100    93  100   182    170    333 --:--:-- --:--:-- --:--:--   333
19-Jun-2018 16:37:38 Finished task 'Set pending build status' with result: Success
19-Jun-2018 16:37:38
Substituting variable: ${bamboo.PRnumber} with 4933
19-Jun-2018 16:37:38 Starting task 'Fetch PR' of type 'com.atlassian.bamboo.plugins.scripttask:task.builder.script'
19-Jun-2018 16:37:38
Beginning to execute external process for build 'phpBB3 - Pull Requests - Build and Test Job #8276 (PHPBB3-PR-JOB1-8276)'
... running command line:
/bin/sh /home/bamboo/temp/PHPBB3-PR-JOB1-8276-ScriptBuildTask-522664624142112639.sh
... in: /home/bamboo/xml-data/build-dir/PHPBB3-PR-JOB1
... using extra environment variables:
bamboo_planRepository_1_branch=3.1.x
bamboo_planRepository_1_branchDisplayName=3.1.x
bamboo_repository_revision_number=dc8ff9da28b8ab4ad11c7ea94cca526f17c87fe5
bamboo_PRref=master
bamboo_resultsUrl=https://bamboo.phpbb.com/browse/PHPBB3-PR-JOB1-8276
bamboo_capability_system_builder_command_Git=/usr/bin/git
bamboo_repository_75956235_git_username=bantu
bamboo_build_working_directory=/home/bamboo/xml-data/build-dir/PHPBB3-PR-JOB1
bamboo_planRepository_1_name=phpBB Ascraeus
bamboo_buildKey=PHPBB3-PR-JOB1
bamboo_capability_phpbb_tests=true
bamboo_shortPlanName=Pull Requests
bamboo_capability_system_builder_command_fop=/usr/bin/fop
bamboo_capability_dbms_sqlite_2=true
bamboo_planRepository_name=phpBB Ascraeus
bamboo_PRnumber=4933
bamboo_buildNumber=8276
bamboo_repository_75956235_git_repositoryUrl=https://github.com/phpbb/phpbb.git
bamboo_capability_system_builder_phpunit_PHPUnit=/usr/bin/phpunit
bamboo_shortJobName=Build and Test Job
bamboo_buildResultsUrl=https://bamboo.phpbb.com/browse/PHPBB3-PR-JOB1-8276
bamboo_repository_75956235_branch_name=3.1.x
bamboo_planRepository_repositoryUrl=https://github.com/phpbb/phpbb.git
bamboo_agentId=131073
bamboo_planName=phpBB3 - Pull Requests
bamboo_build_commandline_com_atlassian_bamboo_plugins_scripttask_task_builder_script_7=/bin/sh /home/bamboo/temp/PHPBB3-PR-JOB1-8276-ScriptBuildTask-3501477517848242476.sh
bamboo_shortPlanKey=PR
bamboo_shortJobKey=JOB1
bamboo_capability_dbms_mysql_55=true
bamboo_capability_system_jdk_JDK_1_7_0_65=/usr/lib/jvm/java-7-openjdk-amd64
bamboo_planRepository_revision=dc8ff9da28b8ab4ad11c7ea94cca526f17c87fe5
bamboo_buildTimeStamp=2018-06-19T16:37:33.068Z
bamboo_repository_previous_revision_number=dc8ff9da28b8ab4ad11c7ea94cca526f17c87fe5
bamboo_capability_system_jdk_JDK_1_6_0_16=/usr/lib/jvm/java-6-sun-1.6.0.16
bamboo_capability_system_builder_mvn2_Maven_2=/usr/share/maven2
bamboo_planRepository_previousRevision=dc8ff9da28b8ab4ad11c7ea94cca526f17c87fe5
bamboo_repository_git_branch=3.1.x
bamboo_buildResultKey=PHPBB3-PR-JOB1-8276
bamboo_repository_branch_name=3.1.x
bamboo_buildPlanName=phpBB3 - Pull Requests - Build and Test Job
bamboo_planRepository_1_revision=dc8ff9da28b8ab4ad11c7ea94cca526f17c87fe5
bamboo_repository_name=phpBB Ascraeus
bamboo_buildFailed=false
bamboo_capability_system_docker_executable=/usr/bin/docker
bamboo_planRepository_branch=3.1.x
bamboo_agentWorkingDirectory=/home/bamboo/xml-data/build-dir
bamboo_capability_system_git_executable=/usr/bin/git
bamboo_capability_system_builder_phpunit_PHPUnit_3_4=/usr/bin/phpunit
bamboo_repository_git_username=bantu
bamboo_planRepository_1_previousRevision=dc8ff9da28b8ab4ad11c7ea94cca526f17c87fe5
bamboo_repository_75956235_revision_number=dc8ff9da28b8ab4ad11c7ea94cca526f17c87fe5
bamboo_planRepository_branchDisplayName=3.1.x
bamboo_planRepository_1_type=gitv2
bamboo_planRepository_branchName=3.1.x
bamboo_repository_75956235_previous_revision_number=dc8ff9da28b8ab4ad11c7ea94cca526f17c87fe5
bamboo_capability_system_jdk_JDK=/usr/lib/jvm/java-6-sun
bamboo_plan_storageTag=PHPBB3-PR
bamboo_hg_cache_directory=/home/bamboo/xml-data/build-dir/_hg-repositories-cache
bamboo_planRepository_1_username=bantu
bamboo_planRepository_type=gitv2
bamboo_git_cache_directory=/home/bamboo/xml-data/build-dir/_git-repositories-cache
bamboo_ManualBuildTriggerReason_userName=Build Robot
bamboo_repository_git_repositoryUrl=https://github.com/phpbb/phpbb.git
bamboo_repository_75956235_git_branch=3.1.x
bamboo_capability_system_builder_ant_Ant=/usr/share/ant
bamboo_repository_75956235_name=phpBB Ascraeus
bamboo_tmp_directory=/home/bamboo/temp
bamboo_working_directory=/home/bamboo/xml-data/build-dir/PHPBB3-PR-JOB1
bamboo_planKey=PHPBB3-PR
bamboo_capability_local=true
bamboo_planRepository_1_repositoryUrl=https://github.com/phpbb/phpbb.git
bamboo_planRepository_username=bantu
bamboo_capability_system_jdk_JDK_1_6=/usr/lib/jvm/java-6-sun
bamboo_capability_system_jdk_JDK_1_7=/usr/lib/jvm/java-7-openjdk-amd64
bamboo_planRepository_1_branchName=3.1.x
19-Jun-2018 16:37:40 From https://github.com/phpbb/phpbb
19-Jun-2018 16:37:40 * branch            refs/pull/4933/merge -> FETCH_HEAD
19-Jun-2018 16:37:40 Note: checking out 'FETCH_HEAD'.
19-Jun-2018 16:37:40
19-Jun-2018 16:37:40 You are in 'detached HEAD' state. You can look around, make experimental
19-Jun-2018 16:37:40 changes and commit them, and you can discard any commits you make in this
19-Jun-2018 16:37:40 state without impacting any branches by performing another checkout.
19-Jun-2018 16:37:40
19-Jun-2018 16:37:40 If you want to create a new branch to retain commits you create, you may
19-Jun-2018 16:37:40 do so (now or later) by using -b with the checkout command again. Example:
19-Jun-2018 16:37:40
19-Jun-2018 16:37:40   git checkout -b new_branch_name
19-Jun-2018 16:37:40
19-Jun-2018 16:37:40 HEAD is now at 42c452b... Merge 90b8138ff27c00ac1f4d28aaca97cebc4b8e81b6 into 857b55dd20c3b7525e472654b1d5e9b4e2669710
19-Jun-2018 16:37:40 Finished task 'Fetch PR' with result: Success
19-Jun-2018 16:37:40 Skipping execution of task 'Prepare directory' as it is disabled
19-Jun-2018 16:37:40
Substituting variable: ${bamboo.working.directory} with /home/bamboo/xml-data/build-dir/PHPBB3-PR-JOB1
19-Jun-2018 16:37:40 Starting task 'Prepare directory' of type 'com.atlassian.bamboo.plugins.bamboo-docker-plugin:task.docker.cli'
19-Jun-2018 16:37:40 Running image name (phpbb:php-5.6)
19-Jun-2018 16:37:40
Beginning to execute external process for build 'phpBB3 - Pull Requests - Build and Test Job #8276 (PHPBB3-PR-JOB1-8276)'
... running command line:
/usr/bin/docker run --volume /home/bamboo/xml-data/build-dir/PHPBB3-PR-JOB1:/data --workdir /data/phpBB --rm -e HOME=/home/bamboo -u=991 phpbb:php-5.6 /bin/bash -c php ../composer.phar install --dev; cd ../build; ../phpBB/vendor/bin/phing clean prepare
... in: /home/bamboo/xml-data/build-dir/PHPBB3-PR-JOB1
... using extra environment variables:
bamboo_planRepository_1_branch=3.1.x
bamboo_planRepository_1_branchDisplayName=3.1.x
bamboo_repository_revision_number=dc8ff9da28b8ab4ad11c7ea94cca526f17c87fe5
bamboo_PRref=master
bamboo_resultsUrl=https://bamboo.phpbb.com/browse/PHPBB3-PR-JOB1-8276
bamboo_capability_system_builder_command_Git=/usr/bin/git
bamboo_repository_75956235_git_username=bantu
bamboo_build_working_directory=/home/bamboo/xml-data/build-dir/PHPBB3-PR-JOB1
bamboo_planRepository_1_name=phpBB Ascraeus
bamboo_buildKey=PHPBB3-PR-JOB1
bamboo_capability_phpbb_tests=true
bamboo_shortPlanName=Pull Requests
bamboo_capability_system_builder_command_fop=/usr/bin/fop
bamboo_capability_dbms_sqlite_2=true
bamboo_planRepository_name=phpBB Ascraeus
bamboo_PRnumber=4933
bamboo_buildNumber=8276
bamboo_repository_75956235_git_repositoryUrl=https://github.com/phpbb/phpbb.git
bamboo_capability_system_builder_phpunit_PHPUnit=/usr/bin/phpunit
bamboo_shortJobName=Build and Test Job
bamboo_buildResultsUrl=https://bamboo.phpbb.com/browse/PHPBB3-PR-JOB1-8276
bamboo_repository_75956235_branch_name=3.1.x
bamboo_planRepository_repositoryUrl=https://github.com/phpbb/phpbb.git
bamboo_agentId=131073
bamboo_planName=phpBB3 - Pull Requests
bamboo_build_commandline_com_atlassian_bamboo_plugins_scripttask_task_builder_script_7=/bin/sh /home/bamboo/temp/PHPBB3-PR-JOB1-8276-ScriptBuildTask-3501477517848242476.sh
bamboo_shortPlanKey=PR
bamboo_shortJobKey=JOB1
bamboo_capability_dbms_mysql_55=true
bamboo_capability_system_jdk_JDK_1_7_0_65=/usr/lib/jvm/java-7-openjdk-amd64
bamboo_planRepository_revision=dc8ff9da28b8ab4ad11c7ea94cca526f17c87fe5
bamboo_buildTimeStamp=2018-06-19T16:37:33.068Z
bamboo_repository_previous_revision_number=dc8ff9da28b8ab4ad11c7ea94cca526f17c87fe5
bamboo_capability_system_jdk_JDK_1_6_0_16=/usr/lib/jvm/java-6-sun-1.6.0.16
bamboo_capability_system_builder_mvn2_Maven_2=/usr/share/maven2
bamboo_planRepository_previousRevision=dc8ff9da28b8ab4ad11c7ea94cca526f17c87fe5
bamboo_build_commandline_com_atlassian_bamboo_plugins_scripttask_task_builder_script_4=/bin/sh /home/bamboo/temp/PHPBB3-PR-JOB1-8276-ScriptBuildTask-522664624142112639.sh
bamboo_repository_git_branch=3.1.x
bamboo_buildResultKey=PHPBB3-PR-JOB1-8276
bamboo_repository_branch_name=3.1.x
bamboo_buildPlanName=phpBB3 - Pull Requests - Build and Test Job
bamboo_planRepository_1_revision=dc8ff9da28b8ab4ad11c7ea94cca526f17c87fe5
bamboo_repository_name=phpBB Ascraeus
bamboo_buildFailed=false
bamboo_capability_system_docker_executable=/usr/bin/docker
bamboo_planRepository_branch=3.1.x
bamboo_agentWorkingDirectory=/home/bamboo/xml-data/build-dir
bamboo_capability_system_git_executable=/usr/bin/git
bamboo_capability_system_builder_phpunit_PHPUnit_3_4=/usr/bin/phpunit
bamboo_repository_git_username=bantu
bamboo_planRepository_1_previousRevision=dc8ff9da28b8ab4ad11c7ea94cca526f17c87fe5
bamboo_repository_75956235_revision_number=dc8ff9da28b8ab4ad11c7ea94cca526f17c87fe5
bamboo_planRepository_branchDisplayName=3.1.x
bamboo_planRepository_1_type=gitv2
bamboo_planRepository_branchName=3.1.x
bamboo_repository_75956235_previous_revision_number=dc8ff9da28b8ab4ad11c7ea94cca526f17c87fe5
bamboo_capability_system_jdk_JDK=/usr/lib/jvm/java-6-sun
bamboo_plan_storageTag=PHPBB3-PR
bamboo_hg_cache_directory=/home/bamboo/xml-data/build-dir/_hg-repositories-cache
bamboo_planRepository_1_username=bantu
bamboo_planRepository_type=gitv2
bamboo_git_cache_directory=/home/bamboo/xml-data/build-dir/_git-repositories-cache
bamboo_ManualBuildTriggerReason_userName=Build Robot
bamboo_repository_git_repositoryUrl=https://github.com/phpbb/phpbb.git
bamboo_repository_75956235_git_branch=3.1.x
bamboo_capability_system_builder_ant_Ant=/usr/share/ant
bamboo_repository_75956235_name=phpBB Ascraeus
bamboo_tmp_directory=/home/bamboo/temp
bamboo_working_directory=/home/bamboo/xml-data/build-dir/PHPBB3-PR-JOB1
bamboo_planKey=PHPBB3-PR
bamboo_capability_local=true
bamboo_planRepository_1_repositoryUrl=https://github.com/phpbb/phpbb.git
bamboo_planRepository_username=bantu
bamboo_capability_system_jdk_JDK_1_6=/usr/lib/jvm/java-6-sun
bamboo_capability_system_jdk_JDK_1_7=/usr/lib/jvm/java-7-openjdk-amd64
bamboo_planRepository_1_branchName=3.1.x
19-Jun-2018 16:37:41 Cannot create cache directory /home/bamboo/.composer/cache/repo/https---packagist.org/, or directory is not writable. Proceeding without cache
19-Jun-2018 16:37:41 Cannot create cache directory /home/bamboo/.composer/cache/files/, or directory is not writable. Proceeding without cache
19-Jun-2018 16:37:41 You are using the deprecated option "dev". Dev packages are installed by default now.
19-Jun-2018 16:37:41 Loading composer repositories with package information
19-Jun-2018 16:37:41 Installing dependencies (including require-dev) from lock file
19-Jun-2018 16:37:41 Package operations: 75 installs, 0 updates, 0 removals
19-Jun-2018 16:37:42   - Installing composer/installers (v1.5.0): Downloading (connecting...)Downloading (0%)           Downloading (5%)Downloading (20%)Downloading (45%)Downloading (50%)Downloading (55%)Downloading (75%)Downloading (80%)Downloading (85%)Downloading (100%)
19-Jun-2018 16:37:43   - Installing bantu/ini-get-wrapper (v1.0.1): Downloading (connecting...)Downloading (0%)           Downloading (100%)
19-Jun-2018 16:37:44   - Installing symfony/process (v3.4.3): Downloading (connecting...)Downloading (0%)           Downloading (5%)Downloading (30%)Downloading (35%)Downloading (70%)Downloading (75%)Downloading (80%)Downloading (100%)
19-Jun-2018 16:37:45   - Installing symfony/finder (v3.4.3): Downloading (connecting...)Downloading (0%)           Downloading (5%)Downloading (10%)Downloading (50%)Downloading (55%)Downloading (60%)Downloading (95%)Downloading (100%)
19-Jun-2018 16:37:45   - Installing symfony/filesystem (v3.4.3): Downloading (connecting...)Downloading (0%)           Downloading (5%)Downloading (70%)Downloading (100%)
19-Jun-2018 16:37:46   - Installing symfony/polyfill-mbstring (v1.7.0): Downloading (connecting...)Downloading (0%)           Downloading (20%)Downloading (40%)Downloading (100%)
19-Jun-2018 16:37:47   - Installing psr/log (1.0.2): Downloading (connecting...)Downloading (0%)           Downloading (15%)Downloading (100%)
19-Jun-2018 16:37:48   - Installing symfony/debug (v3.4.3): Downloading (connecting...)Downloading (0%)           Downloading (5%)Downloading (15%)Downloading (20%)Downloading (30%)Downloading (35%)Downloading (40%)Downloading (50%)Downloading (60%)Downloading (65%)Downloading (70%)Downloading (80%)Downloading (85%)Downloading (100%)
19-Jun-2018 16:37:48   - Installing symfony/console (v3.4.3): Downloading (connecting...)Downloading (0%)           Downloading (5%)Downloading (10%)Downloading (15%)Downloading (20%)Downloading (25%)Downloading (30%)Downloading (35%)Downloading (40%)Downloading (45%)Downloading (50%)Downloading (55%)Downloading (60%)Downloading (65%)Downloading (70%)Downloading (75%)Downloading (80%)Downloading (85%)Downloading (90%)Downloading (95%)Downloading (100%)
19-Jun-2018 16:37:49   - Installing seld/phar-utils (1.0.1): Downloading (connecting...)Downloading (0%)           Downloading (30%)Downloading (60%)Downloading (90%)Downloading (100%)
19-Jun-2018 16:37:50   - Installing seld/jsonlint (1.7.0): Downloading (connecting...)Downloading (0%)           Downloading (15%)Downloading (60%)Downloading (75%)Downloading (90%)Downloading (100%)
19-Jun-2018 16:37:51   - Installing seld/cli-prompt (1.0.3): Downloading (connecting...)Downloading (0%)           Downloading (15%)Downloading (30%)Downloading (100%)
19-Jun-2018 16:37:52   - Installing justinrainbow/json-schema (5.2.6): Downloading (connecting...)Downloading (0%)           Downloading (20%)Downloading (25%)Downloading (30%)Downloading (35%)Downloading (45%)Downloading (50%)Downloading (65%)Downloading (70%)Downloading (75%)Downloading (80%)Downloading (95%)Downloading (100%)
19-Jun-2018 16:37:52   - Installing composer/spdx-licenses (1.2.0): Downloading (connecting...)Downloading (0%)           Downloading (65%)Downloading (100%)
19-Jun-2018 16:37:53   - Installing composer/semver (1.4.2): Downloading (connecting...)Downloading (0%)           Downloading (35%)Downloading (75%)Downloading (100%)
19-Jun-2018 16:37:54   - Installing composer/ca-bundle (1.1.0): Downloading (connecting...)Downloading (0%)           Downloading (5%)Downloading (10%)Downloading (15%)Downloading (20%)Downloading (25%)Downloading (30%)Downloading (35%)Downloading (40%)Downloading (45%)Downloading (50%)Downloading (55%)Downloading (60%)Downloading (65%)Downloading (70%)Downloading (75%)Downloading (80%)Downloading (85%)Downloading (90%)Downloading (95%)Downloading (100%)
19-Jun-2018 16:37:56   - Installing composer/composer (1.6.2): Downloading (connecting...)Downloading (0%)           Downloading (5%)Downloading (10%)Downloading (15%)Downloading (20%)Downloading (25%)Downloading (30%)Downloading (35%)Downloading (40%)Downloading (45%)Downloading (50%)Downloading (55%)Downloading (60%)Downloading (65%)Downloading (70%)Downloading (75%)Downloading (80%)Downloading (85%)Downloading (90%)Downloading (95%)Downloading (100%)
19-Jun-2018 16:37:56   - Installing google/recaptcha (1.1.3): Downloading (connecting...)Downloading (0%)           Downloading (25%)Downloading (40%)Downloading (70%)Downloading (95%)Downloading (100%)
19-Jun-2018 16:37:57   - Installing guzzlehttp/promises (v1.3.1): Downloading (connecting...)Downloading (0%)           Downloading (30%)Downloading (40%)Downloading (70%)Downloading (80%)Downloading (100%)
19-Jun-2018 16:37:58   - Installing psr/http-message (1.0.1): Downloading (connecting...)Downloading (0%)           Downloading (65%)Downloading (100%)
19-Jun-2018 16:37:58   - Installing guzzlehttp/psr7 (1.4.2): Downloading (connecting...)Downloading (0%)           Downloading (5%)Downloading (10%)Downloading (15%)Downloading (20%)Downloading (50%)Downloading (55%)Downloading (60%)Downloading (65%)Downloading (70%)Downloading (100%)
19-Jun-2018 16:38:00   - Installing lusitanian/oauth (v0.8.10): Downloading (connecting...)Downloading (0%)           Downloading (5%)Downloading (10%)Downloading (15%)Downloading (20%)Downloading (25%)Downloading (30%)Downloading (35%)Downloading (40%)Downloading (45%)Downloading (50%)Downloading (55%)Downloading (60%)Downloading (70%)Downloading (75%)Downloading (80%)Downloading (85%)Downloading (90%)Downloading (100%)
19-Jun-2018 16:38:00   - Installing marc1706/fast-image-size (v1.1.4): Downloading (connecting...)Downloading (0%)           Downloading (45%)Downloading (90%)Downloading (100%)
19-Jun-2018 16:38:01   - Installing patchwork/utf8 (v1.3.1): Downloading (connecting...)Downloading (0%)           Downloading (5%)Downloading (10%)Downloading (15%)Downloading (20%)Downloading (25%)Downloading (30%)Downloading (35%)Downloading (40%)Downloading (45%)Downloading (50%)Downloading (55%)Downloading (60%)Downloading (65%)Downloading (70%)Downloading (75%)Downloading (80%)Downloading (85%)Downloading (90%)Downloading (95%)Downloading (100%)
19-Jun-2018 16:38:02   - Installing psr/container (1.0.0): Downloading (connecting...)Downloading (0%)           Downloading (75%)Downloading (100%)
19-Jun-2018 16:38:03   - Installing s9e/text-formatter (0.13.1): Downloading (connecting...)Downloading (0%)           Downloading (5%)Downloading (10%)Downloading (15%)Downloading (20%)Downloading (25%)Downloading (30%)Downloading (35%)Downloading (40%)Downloading (45%)Downloading (50%)Downloading (55%)Downloading (60%)Downloading (65%)Downloading (70%)Downloading (75%)Downloading (80%)Downloading (85%)Downloading (90%)Downloading (95%)Downloading (100%)
19-Jun-2018 16:38:04   - Installing symfony/config (v3.4.3): Downloading (connecting...)Downloading (0%)           Downloading (5%)Downloading (10%)Downloading (15%)Downloading (20%)Downloading (25%)Downloading (30%)Downloading (35%)Downloading (40%)Downloading (45%)Downloading (50%)Downloading (55%)Downloading (60%)Downloading (65%)Downloading (70%)Downloading (75%)Downloading (80%)Downloading (85%)Downloading (90%)Downloading (95%)Downloading (100%)
19-Jun-2018 16:38:05   - Installing paragonie/random_compat (v1.4.2): Downloading (connecting...)Downloading (0%)           Downloading (10%)Downloading (30%)Downloading (50%)Downloading (60%)Downloading (70%)Downloading (80%)Downloading (100%)
19-Jun-2018 16:38:05   - Installing symfony/polyfill-php70 (v1.6.0): Downloading (connecting...)Downloading (0%)           Downloading (85%)Downloading (100%)
19-Jun-2018 16:38:06   - Installing symfony/http-foundation (v3.4.3): Downloading (connecting...)Downloading (0%)           Downloading (5%)Downloading (10%)Downloading (15%)Downloading (20%)Downloading (25%)Downloading (30%)Downloading (35%)Downloading (40%)Downloading (45%)Downloading (50%)Downloading (55%)Downloading (60%)Downloading (65%)Downloading (70%)Downloading (75%)Downloading (80%)Downloading (85%)Downloading (90%)Downloading (95%)Downloading (100%)
19-Jun-2018 16:38:07   - Installing symfony/event-dispatcher (v3.4.3): Downloading (connecting...)Downloading (0%)           Downloading (5%)Downloading (60%)Downloading (65%)Downloading (100%)
19-Jun-2018 16:38:09   - Installing symfony/http-kernel (v3.4.3): Downloading (connecting...)Downloading (0%)           Downloading (5%)Downloading (10%)Downloading (15%)Downloading (20%)Downloading (25%)Downloading (30%)Downloading (35%)Downloading (40%)Downloading (45%)Downloading (50%)Downloading (55%)Downloading (60%)Downloading (65%)Downloading (70%)Downloading (75%)Downloading (80%)Downloading (85%)Downloading (90%)Downloading (95%)Downloading (100%)
19-Jun-2018 16:38:09   - Installing symfony/dependency-injection (v3.4.3): Downloading (connecting...)Downloading (0%)           Downloading (5%)Downloading (10%)Downloading (15%)Downloading (20%)Downloading (25%)Downloading (30%)Downloading (35%)Downloading (40%)Downloading (45%)Downloading (50%)Downloading (55%)Downloading (60%)Downloading (65%)Downloading (70%)Downloading (75%)Downloading (80%)Downloading (85%)Downloading (90%)Downloading (95%)Downloading (100%)
19-Jun-2018 16:38:10   - Installing zendframework/zend-eventmanager (3.2.0): Downloading (connecting...)Downloading (0%)           Downloading (25%)Downloading (35%)Downloading (50%)Downloading (75%)Downloading (100%)
19-Jun-2018 16:38:11   - Installing zendframework/zend-code (2.6.3): Downloading (connecting...)Downloading (0%)           Downloading (5%)Downloading (10%)Downloading (15%)Downloading (20%)Downloading (25%)Downloading (35%)Downloading (40%)Downloading (45%)Downloading (50%)Downloading (55%)Downloading (60%)Downloading (65%)Downloading (70%)Downloading (75%)Downloading (80%)Downloading (85%)Downloading (90%)Downloading (95%)Downloading (100%)
19-Jun-2018 16:38:12   - Installing ocramius/proxy-manager (1.0.2): Downloading (connecting...)Downloading (0%)           Downloading (5%)Downloading (10%)Downloading (15%)Downloading (20%)Downloading (25%)Downloading (30%)Downloading (35%)Downloading (40%)Downloading (45%)Downloading (50%)Downloading (55%)Downloading (60%)Downloading (65%)Downloading (70%)Downloading (75%)Downloading (80%)Downloading (85%)Downloading (95%)Downloading (100%)
19-Jun-2018 16:38:13   - Installing symfony/proxy-manager-bridge (v3.4.3): Downloading (connecting...)Downloading (0%)           Downloading (75%)Downloading (100%)
19-Jun-2018 16:38:14   - Installing symfony/routing (v3.4.3): Downloading (connecting...)Downloading (0%)           Downloading (5%)Downloading (10%)Downloading (15%)Downloading (20%)Downloading (25%)Downloading (30%)Downloading (35%)Downloading (40%)Downloading (45%)Downloading (50%)Downloading (55%)Downloading (60%)Downloading (65%)Downloading (70%)Downloading (75%)Downloading (80%)Downloading (85%)Downloading (90%)Downloading (95%)Downloading (100%)
19-Jun-2018 16:38:15   - Installing twig/twig (v1.35.0): Downloading (connecting...)Downloading (0%)           Downloading (5%)Downloading (10%)Downloading (15%)Downloading (20%)Downloading (25%)Downloading (30%)Downloading (35%)Downloading (40%)Downloading (45%)Downloading (50%)Downloading (55%)Downloading (60%)Downloading (65%)Downloading (70%)Downloading (75%)Downloading (80%)Downloading (85%)Downloading (90%)Downloading (95%)Downloading (100%)
19-Jun-2018 16:38:16   - Installing symfony/twig-bridge (v3.4.3): Downloading (connecting...)Downloading (0%)           Downloading (5%)Downloading (10%)Downloading (20%)Downloading (30%)Downloading (35%)Downloading (40%)Downloading (45%)Downloading (50%)Downloading (55%)Downloading (60%)Downloading (65%)Downloading (75%)Downloading (80%)Downloading (85%)Downloading (90%)Downloading (95%)Downloading (100%)
19-Jun-2018 16:38:17   - Installing symfony/dom-crawler (v3.4.3): Downloading (connecting...)Downloading (0%)           Downloading (5%)Downloading (35%)Downloading (45%)Downloading (50%)Downloading (55%)Downloading (80%)Downloading (85%)Downloading (95%)Downloading (100%)
19-Jun-2018 16:38:18   - Installing symfony/css-selector (v3.4.3): Downloading (connecting...)Downloading (0%)           Downloading (5%)Downloading (10%)Downloading (15%)Downloading (20%)Downloading (25%)Downloading (30%)Downloading (65%)Downloading (70%)Downloading (75%)Downloading (80%)Downloading (85%)Downloading (90%)Downloading (95%)Downloading (100%)
19-Jun-2018 16:38:19   - Installing symfony/browser-kit (v3.4.3): Downloading (connecting...)Downloading (0%)           Downloading (5%)Downloading (70%)Downloading (100%)
19-Jun-2018 16:38:20   - Installing guzzlehttp/guzzle (6.3.0): Downloading (connecting...)Downloading (0%)           Downloading (5%)Downloading (15%)Downloading (25%)Downloading (30%)Downloading (40%)Downloading (50%)Downloading (55%)Downloading (65%)Downloading (70%)Downloading (80%)Downloading (85%)Downloading (95%)Downloading (100%)
19-Jun-2018 16:38:20   - Installing fabpot/goutte (v3.2.2): Downloading (connecting...)Downloading (0%)           Downloading (55%)Downloading (90%)Downloading (100%)
19-Jun-2018 16:38:22   - Installing facebook/webdriver (1.5.0): Downloading (connecting...)Downloading (0%)           Downloading (5%)Downloading (10%)Downloading (15%)Downloading (20%)Downloading (25%)Downloading (30%)Downloading (35%)Downloading (40%)Downloading (45%)Downloading (50%)Downloading (55%)Downloading (60%)Downloading (65%)Downloading (70%)Downloading (75%)Downloading (80%)Downloading (85%)Downloading (90%)Downloading (95%)Downloading (100%)
19-Jun-2018 16:38:22   - Installing symfony/yaml (v3.4.3): Downloading (connecting...)Downloading (0%)           Downloading (5%)Downloading (10%)Downloading (15%)Downloading (20%)Downloading (25%)Downloading (30%)Downloading (35%)Downloading (40%)Downloading (45%)Downloading (50%)Downloading (100%)
19-Jun-2018 16:38:23   - Installing laravel/homestead (v7.7.0): Downloading (connecting...)Downloading (0%)           Downloading (5%)Downloading (10%)Downloading (50%)Downloading (55%)Downloading (100%)
19-Jun-2018 16:38:27   - Installing phing/phing (2.4.14): Downloading (connecting...)Downloading (0%)           Downloading (5%)Downloading (10%)Downloading (15%)Downloading (20%)Downloading (25%)Downloading (30%)Downloading (35%)Downloading (40%)Downloading (45%)Downloading (50%)Downloading (55%)Downloading (60%)Downloading (65%)Downloading (70%)Downloading (75%)Downloading (80%)Downloading (85%)Downloading (90%)Downloading (95%)Downloading (100%)
19-Jun-2018 16:38:28   - Installing webmozart/assert (1.2.0): Downloading (connecting...)Downloading (0%)           Downloading (55%)Downloading (80%)Downloading (100%)
19-Jun-2018 16:38:28   - Installing phpdocumentor/reflection-common (1.0.1): Downloading (connecting...)Downloading (0%)           Downloading (100%)
19-Jun-2018 16:38:29   - Installing phpdocumentor/type-resolver (0.4.0): Downloading (connecting...)Downloading (0%)           Downloading (5%)Downloading (100%)
19-Jun-2018 16:38:30   - Installing phpdocumentor/reflection-docblock (3.3.2): Downloading (connecting...)Downloading (0%)           Downloading (5%)Downloading (10%)Downloading (15%)Downloading (45%)Downloading (50%)Downloading (100%)
19-Jun-2018 16:38:30   - Installing sebastian/version (2.0.1): Downloading (connecting...)Downloading (0%)           Downloading (100%)
19-Jun-2018 16:38:31   - Installing sebastian/resource-operations (1.0.0): Downloading (connecting...)Downloading (0%)           Downloading (65%)Downloading (100%)
19-Jun-2018 16:38:32   - Installing sebastian/recursion-context (2.0.0): Downloading (connecting...)Downloading (0%)           Downloading (100%)
19-Jun-2018 16:38:32   - Installing sebastian/object-enumerator (2.0.1): Downloading (connecting...)Downloading (0%)           Downloading (95%)Downloading (100%)
19-Jun-2018 16:38:33   - Installing sebastian/global-state (1.1.1): Downloading (connecting...)Downloading (0%)           Downloading (40%)Downloading (50%)Downloading (90%)Downloading (100%)
19-Jun-2018 16:38:34   - Installing sebastian/exporter (2.0.0): Downloading (connecting...)Downloading (0%)           Downloading (100%)
19-Jun-2018 16:38:35   - Installing sebastian/environment (2.0.0): Downloading (connecting...)Downloading (0%)           Downloading (15%)Downloading (30%)Downloading (45%)Downloading (60%)Downloading (75%)Downloading (90%)Downloading (100%)
19-Jun-2018 16:38:36   - Installing sebastian/diff (1.4.3): Downloading (connecting...)Downloading (0%)           Downloading (35%)Downloading (40%)Downloading (75%)Downloading (100%)
19-Jun-2018 16:38:37   - Installing sebastian/comparator (1.2.4): Downloading (connecting...)Downloading (0%)           Downloading (10%)Downloading (75%)Downloading (95%)Downloading (100%)
19-Jun-2018 16:38:37   - Installing phpunit/php-text-template (1.2.1): Downloading (connecting...)Downloading (0%)           Downloading (35%)Downloading (100%)
19-Jun-2018 16:38:38   - Installing doctrine/instantiator (1.0.5): Downloading (connecting...)Downloading (0%)           Downloading (15%)Downloading (30%)Downloading (45%)Downloading (50%)Downloading (65%)Downloading (80%)Downloading (95%)Downloading (100%)
19-Jun-2018 16:38:39   - Installing phpunit/phpunit-mock-objects (3.4.4): Downloading (connecting...)Downloading (0%)           Downloading (5%)Downloading (10%)Downloading (15%)Downloading (20%)Downloading (25%)Downloading (30%)Downloading (35%)Downloading (40%)Downloading (45%)Downloading (50%)Downloading (55%)Downloading (60%)Downloading (70%)Downloading (80%)Downloading (85%)Downloading (90%)Downloading (95%)Downloading (100%)
19-Jun-2018 16:38:40   - Installing phpunit/php-timer (1.0.9): Downloading (connecting...)Downloading (0%)           Downloading (45%)Downloading (90%)Downloading (100%)
19-Jun-2018 16:38:41   - Installing phpunit/php-file-iterator (1.4.5): Downloading (connecting...)Downloading (0%)           Downloading (100%)
19-Jun-2018 16:38:41   - Installing sebastian/code-unit-reverse-lookup (1.0.1): Downloading (connecting...)Downloading (0%)           Downloading (55%)Downloading (100%)
19-Jun-2018 16:38:42   - Installing phpunit/php-token-stream (1.4.12): Downloading (connecting...)Downloading (0%)           Downloading (5%)Downloading (10%)Downloading (15%)Downloading (20%)Downloading (90%)Downloading (95%)Downloading (100%)
19-Jun-2018 16:38:44   - Installing phpunit/php-code-coverage (4.0.8): Downloading (connecting...)Downloading (0%)           Downloading (5%)Downloading (10%)Downloading (15%)Downloading (20%)Downloading (25%)Downloading (30%)Downloading (35%)Downloading (40%)Downloading (45%)Downloading (50%)Downloading (55%)Downloading (60%)Downloading (65%)Downloading (70%)Downloading (75%)Downloading (80%)Downloading (85%)Downloading (90%)Downloading (95%)Downloading (100%)
19-Jun-2018 16:38:44   - Installing phpspec/prophecy (1.7.5): Downloading (connecting...)Downloading (0%)           Downloading (10%)Downloading (15%)Downloading (20%)Downloading (25%)Downloading (30%)Downloading (45%)Downloading (55%)Downloading (60%)Downloading (70%)Downloading (80%)Downloading (85%)Downloading (100%)
19-Jun-2018 16:38:45   - Installing myclabs/deep-copy (1.7.0): Downloading (connecting...)Downloading (0%)           Downloading (15%)Downloading (20%)Downloading (35%)Downloading (40%)Downloading (55%)Downloading (60%)Downloading (75%)Downloading (80%)Downloading (95%)Downloading (100%)
19-Jun-2018 16:38:48   - Installing phpunit/phpunit (5.7.26): Downloading (connecting...)Downloading (0%)           Downloading (5%)Downloading (10%)Downloading (15%)Downloading (20%)Downloading (25%)Downloading (30%)Downloading (35%)Downloading (40%)Downloading (45%)Downloading (50%)Downloading (55%)Downloading (60%)Downloading (65%)Downloading (70%)Downloading (75%)Downloading (80%)Downloading (85%)Downloading (90%)Downloading (95%)Downloading (100%)
19-Jun-2018 16:38:48   - Installing phpunit/dbunit (2.0.3): Downloading (connecting...)Downloading (0%)           Downloading (5%)Downloading (10%)Downloading (15%)Downloading (20%)Downloading (25%)Downloading (30%)Downloading (35%)Downloading (40%)Downloading (45%)Downloading (50%)Downloading (55%)Downloading (60%)Downloading (65%)Downloading (70%)Downloading (75%)Downloading (80%)Downloading (85%)Downloading (90%)Downloading (95%)Downloading (100%)
19-Jun-2018 16:38:49   - Installing squizlabs/php_codesniffer (2.9.1): Downloading (connecting...)Downloading (0%)           Downloading (5%)Downloading (10%)Downloading (15%)Downloading (20%)Downloading (25%)Downloading (30%)Downloading (35%)Downloading (40%)Downloading (45%)Downloading (50%)Downloading (55%)Downloading (60%)Downloading (65%)Downloading (70%)Downloading (75%)Downloading (80%)Downloading (85%)Downloading (90%)Downloading (95%)Downloading (100%)
19-Jun-2018 16:38:50 symfony/console suggests installing symfony/lock ()
19-Jun-2018 16:38:50 lusitanian/oauth suggests installing predis/predis (Allows using the Redis storage backend.)
19-Jun-2018 16:38:50 patchwork/utf8 suggests installing ext-intl (Use Intl for best performance)
19-Jun-2018 16:38:50 patchwork/utf8 suggests installing ext-wfio (Use WFIO for UTF-8 filesystem access on Windows)
19-Jun-2018 16:38:50 s9e/text-formatter suggests installing ext-intl (Allows international URLs to be accepted by the URL filter)
19-Jun-2018 16:38:50 s9e/text-formatter suggests installing ext-xsl (Enables the XSLT renderer)
19-Jun-2018 16:38:50 paragonie/random_compat suggests installing ext-libsodium (Provides a modern crypto API that can be used to generate random bytes.)
19-Jun-2018 16:38:50 symfony/http-kernel suggests installing symfony/var-dumper ()
19-Jun-2018 16:38:50 symfony/dependency-injection suggests installing symfony/expression-language (For using expressions in service container configuration)
19-Jun-2018 16:38:50 zendframework/zend-eventmanager suggests installing container-interop/container-interop (^1.1.0, to use the lazy listeners feature)
19-Jun-2018 16:38:50 zendframework/zend-eventmanager suggests installing zendframework/zend-stdlib (^2.7.3 || ^3.0, to use the FilterChain feature)
19-Jun-2018 16:38:50 zendframework/zend-code suggests installing doctrine/annotations (Doctrine\Common\Annotations >=1.0 for annotation features)
19-Jun-2018 16:38:50 zendframework/zend-code suggests installing zendframework/zend-stdlib (Zend\Stdlib component)
19-Jun-2018 16:38:50 ocramius/proxy-manager suggests installing ocramius/generated-hydrator (To have very fast object to array to object conversion for ghost objects)
19-Jun-2018 16:38:50 ocramius/proxy-manager suggests installing zendframework/zend-json (To have the JsonRpc adapter (Remote Object feature))
19-Jun-2018 16:38:50 ocramius/proxy-manager suggests installing zendframework/zend-soap (To have the Soap adapter (Remote Object feature))
19-Jun-2018 16:38:50 ocramius/proxy-manager suggests installing zendframework/zend-stdlib (To use the hydrator proxy)
19-Jun-2018 16:38:50 ocramius/proxy-manager suggests installing zendframework/zend-xmlrpc (To have the XmlRpc adapter (Remote Object feature))
19-Jun-2018 16:38:50 symfony/routing suggests installing doctrine/annotations (For using the annotation loader)
19-Jun-2018 16:38:50 symfony/routing suggests installing symfony/expression-language (For using expression matching)
19-Jun-2018 16:38:50 symfony/twig-bridge suggests installing symfony/asset (For using the AssetExtension)
19-Jun-2018 16:38:50 symfony/twig-bridge suggests installing symfony/expression-language (For using the ExpressionExtension)
19-Jun-2018 16:38:50 symfony/twig-bridge suggests installing symfony/form (For using the FormExtension)
19-Jun-2018 16:38:50 symfony/twig-bridge suggests installing symfony/security (For using the SecurityExtension)
19-Jun-2018 16:38:50 symfony/twig-bridge suggests installing symfony/stopwatch (For using the StopwatchExtension)
19-Jun-2018 16:38:50 symfony/twig-bridge suggests installing symfony/templating (For using the TwigEngine)
19-Jun-2018 16:38:50 symfony/twig-bridge suggests installing symfony/translation (For using the TranslationExtension)
19-Jun-2018 16:38:50 symfony/twig-bridge suggests installing symfony/var-dumper (For using the DumpExtension)
19-Jun-2018 16:38:50 symfony/twig-bridge suggests installing symfony/web-link (For using the WebLinkExtension)
19-Jun-2018 16:38:50 sebastian/global-state suggests installing ext-uopz (*)
19-Jun-2018 16:38:50 phpunit/phpunit-mock-objects suggests installing ext-soap (*)
19-Jun-2018 16:38:50 phpunit/phpunit suggests installing phpunit/php-invoker (~1.1)
19-Jun-2018 16:38:50 Generating autoload files
19-Jun-2018 16:38:50 Buildfile: /data/build/build.xml
19-Jun-2018 16:38:51
19-Jun-2018 16:38:51 phpBB > clean:
19-Jun-2018 16:38:51
19-Jun-2018 16:38:51    [delete] Directory /data/build/logs does not exist or is not a directory.
19-Jun-2018 16:38:51    [delete] Directory /data/build/api does not exist or is not a directory.
19-Jun-2018 16:38:51    [delete] Directory /data/build/codebrowser does not exist or is not a directory.
19-Jun-2018 16:38:51    [delete] Directory /data/build/coverage does not exist or is not a directory.
19-Jun-2018 16:38:51    [delete] Directory /data/build/cpd does not exist or is not a directory.
19-Jun-2018 16:38:51    [delete] Directory /data/build/dependencies does not exist or is not a directory.
19-Jun-2018 16:38:51    [delete] Directory /data/build/new_version does not exist or is not a directory.
19-Jun-2018 16:38:51    [delete] Directory /data/build/old_versions does not exist or is not a directory.
19-Jun-2018 16:38:51    [delete] Directory /data/build/save does not exist or is not a directory.
19-Jun-2018 16:38:51
19-Jun-2018 16:38:51 phpBB > prepare:
19-Jun-2018 16:38:51
19-Jun-2018 16:38:51     [mkdir] Created dir: /data/build/logs
19-Jun-2018 16:38:51     [mkdir] Created dir: /data/build/api
19-Jun-2018 16:38:51     [mkdir] Created dir: /data/build/codebrowser
19-Jun-2018 16:38:51     [mkdir] Created dir: /data/build/coverage
19-Jun-2018 16:38:51     [mkdir] Created dir: /data/build/cpd
19-Jun-2018 16:38:51     [mkdir] Created dir: /data/build/dependencies
19-Jun-2018 16:38:51     [mkdir] Created dir: /data/build/new_version
19-Jun-2018 16:38:51     [mkdir] Created dir: /data/build/new_version/files
19-Jun-2018 16:38:51     [mkdir] Created dir: /data/build/new_version/patches
19-Jun-2018 16:38:51     [mkdir] Created dir: /data/build/new_version/release_files
19-Jun-2018 16:38:51     [mkdir] Created dir: /data/build/new_version/update
19-Jun-2018 16:38:51     [mkdir] Created dir: /data/build/old_versions
19-Jun-2018 16:38:51     [mkdir] Created dir: /data/build/save
19-Jun-2018 16:38:51
19-Jun-2018 16:38:51 BUILD FINISHED
19-Jun-2018 16:38:51
19-Jun-2018 16:38:51 Total time: 0.1026 seconds
19-Jun-2018 16:38:51
19-Jun-2018 16:38:51 Finished task 'Prepare directory' with result: Success
19-Jun-2018 16:38:51 Skipping execution of task 'Run sniffs' as it is disabled
19-Jun-2018 16:38:51
Substituting variable: ${bamboo.working.directory} with /home/bamboo/xml-data/build-dir/PHPBB3-PR-JOB1
19-Jun-2018 16:38:51 Starting task 'Run sniffs' of type 'com.atlassian.bamboo.plugins.bamboo-docker-plugin:task.docker.cli'
19-Jun-2018 16:38:51 Running image name (phpbb:php-5.6)
19-Jun-2018 16:38:51
Beginning to execute external process for build 'phpBB3 - Pull Requests - Build and Test Job #8276 (PHPBB3-PR-JOB1-8276)'
... running command line:
/usr/bin/docker run --volume /home/bamboo/xml-data/build-dir/PHPBB3-PR-JOB1:/data --workdir /data/build --rm -u=991 phpbb:php-5.6 ../phpBB/vendor/bin/phing sniff
... in: /home/bamboo/xml-data/build-dir/PHPBB3-PR-JOB1
... using extra environment variables:
bamboo_planRepository_1_branch=3.1.x
bamboo_planRepository_1_branchDisplayName=3.1.x
bamboo_repository_revision_number=dc8ff9da28b8ab4ad11c7ea94cca526f17c87fe5
bamboo_PRref=master
bamboo_resultsUrl=https://bamboo.phpbb.com/browse/PHPBB3-PR-JOB1-8276
bamboo_capability_system_builder_command_Git=/usr/bin/git
bamboo_repository_75956235_git_username=bantu
bamboo_build_working_directory=/home/bamboo/xml-data/build-dir/PHPBB3-PR-JOB1
bamboo_planRepository_1_name=phpBB Ascraeus
bamboo_buildKey=PHPBB3-PR-JOB1
bamboo_capability_phpbb_tests=true
bamboo_shortPlanName=Pull Requests
bamboo_capability_system_builder_command_fop=/usr/bin/fop
bamboo_capability_dbms_sqlite_2=true
bamboo_planRepository_name=phpBB Ascraeus
bamboo_PRnumber=4933
bamboo_buildNumber=8276
bamboo_repository_75956235_git_repositoryUrl=https://github.com/phpbb/phpbb.git
bamboo_capability_system_builder_phpunit_PHPUnit=/usr/bin/phpunit
bamboo_shortJobName=Build and Test Job
bamboo_buildResultsUrl=https://bamboo.phpbb.com/browse/PHPBB3-PR-JOB1-8276
bamboo_repository_75956235_branch_name=3.1.x
bamboo_planRepository_repositoryUrl=https://github.com/phpbb/phpbb.git
bamboo_agentId=131073
bamboo_planName=phpBB3 - Pull Requests
bamboo_build_commandline_com_atlassian_bamboo_plugins_scripttask_task_builder_script_7=/bin/sh /home/bamboo/temp/PHPBB3-PR-JOB1-8276-ScriptBuildTask-3501477517848242476.sh
bamboo_shortPlanKey=PR
bamboo_shortJobKey=JOB1
bamboo_capability_dbms_mysql_55=true
bamboo_capability_system_jdk_JDK_1_7_0_65=/usr/lib/jvm/java-7-openjdk-amd64
bamboo_planRepository_revision=dc8ff9da28b8ab4ad11c7ea94cca526f17c87fe5
bamboo_buildTimeStamp=2018-06-19T16:37:33.068Z
bamboo_repository_previous_revision_number=dc8ff9da28b8ab4ad11c7ea94cca526f17c87fe5
bamboo_capability_system_jdk_JDK_1_6_0_16=/usr/lib/jvm/java-6-sun-1.6.0.16
bamboo_capability_system_builder_mvn2_Maven_2=/usr/share/maven2
bamboo_planRepository_previousRevision=dc8ff9da28b8ab4ad11c7ea94cca526f17c87fe5
bamboo_build_commandline_com_atlassian_bamboo_plugins_scripttask_task_builder_script_4=/bin/sh /home/bamboo/temp/PHPBB3-PR-JOB1-8276-ScriptBuildTask-522664624142112639.sh
bamboo_repository_git_branch=3.1.x
bamboo_buildResultKey=PHPBB3-PR-JOB1-8276
bamboo_repository_branch_name=3.1.x
bamboo_buildPlanName=phpBB3 - Pull Requests - Build and Test Job
bamboo_planRepository_1_revision=dc8ff9da28b8ab4ad11c7ea94cca526f17c87fe5
bamboo_repository_name=phpBB Ascraeus
bamboo_buildFailed=false
bamboo_capability_system_docker_executable=/usr/bin/docker
bamboo_build_commandline_com_atlassian_bamboo_plugins_bamboo_docker_plugin_task_docker_cli_12=/usr/bin/docker run --volume /home/bamboo/xml-data/build-dir/PHPBB3-PR-JOB1:/data --workdir /data/phpBB --rm -e HOME=/home/bamboo -u=991 phpbb:php-5.6 /bin/bash -c php ../composer.phar install --dev; cd ../build; ../phpBB/vendor/bin/phing clean prepare
bamboo_planRepository_branch=3.1.x
bamboo_agentWorkingDirectory=/home/bamboo/xml-data/build-dir
bamboo_capability_system_git_executable=/usr/bin/git
bamboo_capability_system_builder_phpunit_PHPUnit_3_4=/usr/bin/phpunit
bamboo_repository_git_username=bantu
bamboo_planRepository_1_previousRevision=dc8ff9da28b8ab4ad11c7ea94cca526f17c87fe5
bamboo_repository_75956235_revision_number=dc8ff9da28b8ab4ad11c7ea94cca526f17c87fe5
bamboo_planRepository_branchDisplayName=3.1.x
bamboo_planRepository_1_type=gitv2
bamboo_planRepository_branchName=3.1.x
bamboo_repository_75956235_previous_revision_number=dc8ff9da28b8ab4ad11c7ea94cca526f17c87fe5
bamboo_capability_system_jdk_JDK=/usr/lib/jvm/java-6-sun
bamboo_plan_storageTag=PHPBB3-PR
bamboo_hg_cache_directory=/home/bamboo/xml-data/build-dir/_hg-repositories-cache
bamboo_planRepository_1_username=bantu
bamboo_planRepository_type=gitv2
bamboo_git_cache_directory=/home/bamboo/xml-data/build-dir/_git-repositories-cache
bamboo_ManualBuildTriggerReason_userName=Build Robot
bamboo_repository_git_repositoryUrl=https://github.com/phpbb/phpbb.git
bamboo_repository_75956235_git_branch=3.1.x
bamboo_capability_system_builder_ant_Ant=/usr/share/ant
bamboo_repository_75956235_name=phpBB Ascraeus
bamboo_tmp_directory=/home/bamboo/temp
bamboo_working_directory=/home/bamboo/xml-data/build-dir/PHPBB3-PR-JOB1
bamboo_planKey=PHPBB3-PR
bamboo_capability_local=true
bamboo_planRepository_1_repositoryUrl=https://github.com/phpbb/phpbb.git
bamboo_planRepository_username=bantu
bamboo_capability_system_jdk_JDK_1_6=/usr/lib/jvm/java-6-sun
bamboo_capability_system_jdk_JDK_1_7=/usr/lib/jvm/java-7-openjdk-amd64
bamboo_planRepository_1_branchName=3.1.x
19-Jun-2018 16:38:51 Buildfile: /data/build/build.xml
19-Jun-2018 16:38:51
19-Jun-2018 16:38:51 phpBB > sniff:
19-Jun-2018 16:38:51
19-Jun-2018 16:38:59 ............................................................  60 / 754 (8%)
19-Jun-2018 16:39:00 ...........E................................................ 120 / 754 (16%)
19-Jun-2018 16:39:00 ............................................................ 180 / 754 (24%)
19-Jun-2018 16:39:01 ............................................................ 240 / 754 (32%)
19-Jun-2018 16:39:04 ............................................................ 300 / 754 (40%)
19-Jun-2018 16:39:10 ............................................................ 360 / 754 (48%)
19-Jun-2018 16:39:15 ............................................................ 420 / 754 (56%)
19-Jun-2018 16:39:19 ............................................................ 480 / 754 (64%)
19-Jun-2018 16:39:22 ............................................................ 540 / 754 (72%)
19-Jun-2018 16:39:26 ............................................................ 600 / 754 (80%)
19-Jun-2018 16:39:31 ............................................................ 660 / 754 (88%)
19-Jun-2018 16:39:33 ............................................................ 720 / 754 (95%)
19-Jun-2018 16:39:35 ..................................
19-Jun-2018 16:39:35
19-Jun-2018 16:39:35
19-Jun-2018 16:39:35 FILE: /data/phpBB/phpbb/db/migration/data/v330/storage_track.php
19-Jun-2018 16:39:35 ----------------------------------------------------------------------
19-Jun-2018 16:39:35 FOUND 1 ERROR AFFECTING 1 LINE
19-Jun-2018 16:39:35 ----------------------------------------------------------------------
19-Jun-2018 16:39:35 96 | ERROR | There should be exactly one space between the keyword and
19-Jun-2018 16:39:35     |       | opening parenthesis
19-Jun-2018 16:39:35     |       | (phpbb.ControlStructures.OpeningParenthesis.NoSpaceBeforeOpeningParenthesis)
19-Jun-2018 16:39:35 ----------------------------------------------------------------------
19-Jun-2018 16:39:35
19-Jun-2018 16:39:35 Time: 43.45 secs; Memory: 64Mb
19-Jun-2018 16:39:35
19-Jun-2018 16:39:43 ............................................................  60 / 209 (29%)
19-Jun-2018 16:40:01 ............................................................ 120 / 209 (57%)
19-Jun-2018 16:40:15 ............................................................ 180 / 209 (86%)
19-Jun-2018 16:40:24 .............................
19-Jun-2018 16:40:24
19-Jun-2018 16:40:24 Time: 49.06 secs; Memory: 60.5Mb
19-Jun-2018 16:40:24
19-Jun-2018 16:40:24
19-Jun-2018 16:40:24
19-Jun-2018 16:40:24 Time: 22ms; Memory: 3.75Mb
19-Jun-2018 16:40:24
19-Jun-2018 16:40:24        [if] Error in IfTask
19-Jun-2018 16:40:24 Execution of target "sniff" failed for the following reason: /data/build/build.xml:109:6: /data/build/build.xml:115:9: PHP Code Sniffer failed.
19-Jun-2018 16:40:24
19-Jun-2018 16:40:24 BUILD FAILED
19-Jun-2018 16:40:24 /data/build/build.xml:109:6: /data/build/build.xml:115:9: PHP Code Sniffer failed.
19-Jun-2018 16:40:24 Total time: 2 minutes  32.83 seconds
19-Jun-2018 16:40:24
19-Jun-2018 16:40:24 Error occurred while running Task 'Run sniffs(11)' of type com.atlassian.bamboo.plugins.bamboo-docker-plugin:task.docker.cli.
19-Jun-2018 16:40:24 com.atlassian.bamboo.task.TaskException: Failed to execute task
19-Jun-2018 16:40:24         at com.atlassian.bamboo.plugins.docker.service.RunService.execute(RunService.java:75)
19-Jun-2018 16:40:24         at com.atlassian.bamboo.plugins.docker.tasks.cli.DockerCliTask.execute(DockerCliTask.java:70)
19-Jun-2018 16:40:24         at com.atlassian.bamboo.task.TaskExecutorImpl.lambda$executeTasks$3(TaskExecutorImpl.java:285)
19-Jun-2018 16:40:24         at com.atlassian.bamboo.task.TaskExecutorImpl.executeTaskWithPrePostActions(TaskExecutorImpl.java:224)
19-Jun-2018 16:40:24         at com.atlassian.bamboo.task.TaskExecutorImpl.executeTasks(TaskExecutorImpl.java:285)
19-Jun-2018 16:40:24         at com.atlassian.bamboo.task.TaskExecutorImpl.execute(TaskExecutorImpl.java:112)
19-Jun-2018 16:40:24         at com.atlassian.bamboo.build.pipeline.tasks.ExecuteBuildTask.call(ExecuteBuildTask.java:71)
19-Jun-2018 16:40:24         at com.atlassian.bamboo.v2.build.agent.DefaultBuildAgent.executeBuildPhase(DefaultBuildAgent.java:203)
19-Jun-2018 16:40:24         at com.atlassian.bamboo.v2.build.agent.DefaultBuildAgent.build(DefaultBuildAgent.java:175)
19-Jun-2018 16:40:24         at com.atlassian.bamboo.v2.build.agent.BuildAgentControllerImpl.lambda$waitAndPerformBuild$0(BuildAgentControllerImpl.java:122)
19-Jun-2018 16:40:24         at com.atlassian.bamboo.variable.CustomVariableContextImpl.withVariableSubstitutor(CustomVariableContextImpl.java:185)
19-Jun-2018 16:40:24         at com.atlassian.bamboo.v2.build.agent.BuildAgentControllerImpl.waitAndPerformBuild(BuildAgentControllerImpl.java:117)
19-Jun-2018 16:40:24         at com.atlassian.bamboo.v2.build.agent.DefaultBuildAgent$1.run(DefaultBuildAgent.java:126)
19-Jun-2018 16:40:24         at com.atlassian.bamboo.utils.BambooRunnables$1.run(BambooRunnables.java:48)
19-Jun-2018 16:40:24         at com.atlassian.bamboo.security.ImpersonationHelper.runWith(ImpersonationHelper.java:26)
19-Jun-2018 16:40:24         at com.atlassian.bamboo.security.ImpersonationHelper.runWithSystemAuthority(ImpersonationHelper.java:17)
19-Jun-2018 16:40:24         at com.atlassian.bamboo.security.ImpersonationHelper$1.run(ImpersonationHelper.java:41)
19-Jun-2018 16:40:24         at java.lang.Thread.run(Thread.java:748)
19-Jun-2018 16:40:24 Caused by: com.atlassian.bamboo.docker.DockerException: Error running Docker run command
19-Jun-2018 16:40:24         at com.atlassian.bamboo.docker.DockerContainerServiceImpl.run(DockerContainerServiceImpl.java:118)
19-Jun-2018 16:40:24         at sun.reflect.GeneratedMethodAccessor2553.invoke(Unknown Source)
19-Jun-2018 16:40:24         at sun.reflect.DelegatingMethodAccessorImpl.invoke(DelegatingMethodAccessorImpl.java:43)
19-Jun-2018 16:40:24         at java.lang.reflect.Method.invoke(Method.java:498)
19-Jun-2018 16:40:24         at com.atlassian.plugin.util.ContextClassLoaderSettingInvocationHandler.invoke(ContextClassLoaderSettingInvocationHandler.java:26)
19-Jun-2018 16:40:24         at com.sun.proxy.$Proxy401.run(Unknown Source)
19-Jun-2018 16:40:24         at sun.reflect.GeneratedMethodAccessor2553.invoke(Unknown Source)
19-Jun-2018 16:40:24         at sun.reflect.DelegatingMethodAccessorImpl.invoke(DelegatingMethodAccessorImpl.java:43)
19-Jun-2018 16:40:24         at java.lang.reflect.Method.invoke(Method.java:498)
19-Jun-2018 16:40:24         at org.springframework.aop.support.AopUtils.invokeJoinpointUsingReflection(AopUtils.java:302)
19-Jun-2018 16:40:24         at org.eclipse.gemini.blueprint.service.importer.support.internal.aop.ServiceInvoker.doInvoke(ServiceInvoker.java:56)
19-Jun-2018 16:40:24         at org.eclipse.gemini.blueprint.service.importer.support.internal.aop.ServiceInvoker.invoke(ServiceInvoker.java:60)
19-Jun-2018 16:40:24         at org.springframework.aop.framework.ReflectiveMethodInvocation.proceed(ReflectiveMethodInvocation.java:179)
19-Jun-2018 16:40:24         at org.springframework.aop.support.DelegatingIntroductionInterceptor.doProceed(DelegatingIntroductionInterceptor.java:133)
19-Jun-2018 16:40:24         at org.springframework.aop.support.DelegatingIntroductionInterceptor.invoke(DelegatingIntroductionInterceptor.java:121)
19-Jun-2018 16:40:24         at org.springframework.aop.framework.ReflectiveMethodInvocation.proceed(ReflectiveMethodInvocation.java:179)
19-Jun-2018 16:40:24         at org.eclipse.gemini.blueprint.service.util.internal.aop.ServiceTCCLInterceptor.invokeUnprivileged(ServiceTCCLInterceptor.java:70)
19-Jun-2018 16:40:24         at org.eclipse.gemini.blueprint.service.util.internal.aop.ServiceTCCLInterceptor.invoke(ServiceTCCLInterceptor.java:53)
19-Jun-2018 16:40:24         at org.springframework.aop.framework.ReflectiveMethodInvocation.proceed(ReflectiveMethodInvocation.java:179)
19-Jun-2018 16:40:24         at org.eclipse.gemini.blueprint.service.importer.support.LocalBundleContextAdvice.invoke(LocalBundleContextAdvice.java:57)
19-Jun-2018 16:40:24         at org.springframework.aop.framework.ReflectiveMethodInvocation.proceed(ReflectiveMethodInvocation.java:179)
19-Jun-2018 16:40:24         at org.springframework.aop.support.DelegatingIntroductionInterceptor.doProceed(DelegatingIntroductionInterceptor.java:133)
19-Jun-2018 16:40:24         at org.springframework.aop.support.DelegatingIntroductionInterceptor.invoke(DelegatingIntroductionInterceptor.java:121)
19-Jun-2018 16:40:24         at org.springframework.aop.framework.ReflectiveMethodInvocation.proceed(ReflectiveMethodInvocation.java:179)
19-Jun-2018 16:40:24         at org.springframework.aop.framework.JdkDynamicAopProxy.invoke(JdkDynamicAopProxy.java:207)
19-Jun-2018 16:40:24         at com.sun.proxy.$Proxy679.run(Unknown Source)
19-Jun-2018 16:40:24         at com.atlassian.bamboo.plugins.docker.client.DockerCmd.run(DockerCmd.java:51)
19-Jun-2018 16:40:24         at com.atlassian.bamboo.plugins.docker.service.RunService.execute(RunService.java:64)
19-Jun-2018 16:40:24         ... 17 more
19-Jun-2018 16:40:24 Caused by: com.atlassian.utils.process.ProcessException: Error executing /usr/bin/docker run --volume /home/bamboo/xml-data/build-dir/PHPBB3-PR-JOB1:/data --workdir /data/build --rm -u=991 phpbb:php-5.6 ../phpBB/vendor/bin/phing sniff
19-Jun-2018 16:40:24         at com.atlassian.bamboo.docker.DockerContainerServiceImpl.execute(DockerContainerServiceImpl.java:252)
19-Jun-2018 16:40:24         at com.atlassian.bamboo.docker.DockerContainerServiceImpl.run(DockerContainerServiceImpl.java:106)
19-Jun-2018 16:40:24         ... 44 more
19-Jun-2018 16:40:24 Starting task 'Parsing test results produced by script' of type 'com.atlassian.bamboo.plugins.testresultparser:task.testresultparser.junit'
19-Jun-2018 16:40:24 Parsing test results under /home/bamboo/xml-data/build-dir/PHPBB3-PR-JOB1...
19-Jun-2018 16:40:24 Failing task since test cases were expected but none were found.
19-Jun-2018 16:40:24 Finished task 'Parsing test results produced by script' with result: Failed
19-Jun-2018 16:40:24
Substituting variable: ${bamboo.PRnumber} with 4933
19-Jun-2018 16:40:24
Substituting variable: ${bamboo.buildResultsUrl} with https://bamboo.phpbb.com/browse/PHPBB3-PR-JOB1-8276
19-Jun-2018 16:40:24
Substituting variable: ${bamboo.buildResultsUrl} with https://bamboo.phpbb.com/browse/PHPBB3-PR-JOB1-8276
19-Jun-2018 16:40:24 Starting task 'Set result build status' of type 'com.atlassian.bamboo.plugins.scripttask:task.builder.script'
19-Jun-2018 16:40:24
Beginning to execute external process for build 'phpBB3 - Pull Requests - Build and Test Job #8276 (PHPBB3-PR-JOB1-8276)'
... running command line:
/bin/sh /home/bamboo/temp/PHPBB3-PR-JOB1-8276-ScriptBuildTask-7994920125388634562.sh
... in: /home/bamboo/xml-data/build-dir/PHPBB3-PR-JOB1
... using extra environment variables:
bamboo_planRepository_1_branch=3.1.x
bamboo_planRepository_1_branchDisplayName=3.1.x
bamboo_repository_revision_number=dc8ff9da28b8ab4ad11c7ea94cca526f17c87fe5
bamboo_PRref=master
bamboo_resultsUrl=https://bamboo.phpbb.com/browse/PHPBB3-PR-JOB1-8276
bamboo_capability_system_builder_command_Git=/usr/bin/git
bamboo_repository_75956235_git_username=bantu
bamboo_build_working_directory=/home/bamboo/xml-data/build-dir/PHPBB3-PR-JOB1
bamboo_planRepository_1_name=phpBB Ascraeus
bamboo_buildKey=PHPBB3-PR-JOB1
bamboo_capability_phpbb_tests=true
bamboo_shortPlanName=Pull Requests
bamboo_capability_system_builder_command_fop=/usr/bin/fop
bamboo_capability_dbms_sqlite_2=true
bamboo_planRepository_name=phpBB Ascraeus
bamboo_PRnumber=4933
bamboo_buildNumber=8276
bamboo_repository_75956235_git_repositoryUrl=https://github.com/phpbb/phpbb.git
bamboo_capability_system_builder_phpunit_PHPUnit=/usr/bin/phpunit
bamboo_shortJobName=Build and Test Job
bamboo_buildResultsUrl=https://bamboo.phpbb.com/browse/PHPBB3-PR-JOB1-8276
bamboo_repository_75956235_branch_name=3.1.x
bamboo_planRepository_repositoryUrl=https://github.com/phpbb/phpbb.git
bamboo_agentId=131073
bamboo_planName=phpBB3 - Pull Requests
bamboo_build_commandline_com_atlassian_bamboo_plugins_scripttask_task_builder_script_7=/bin/sh /home/bamboo/temp/PHPBB3-PR-JOB1-8276-ScriptBuildTask-3501477517848242476.sh
bamboo_shortPlanKey=PR
bamboo_shortJobKey=JOB1
bamboo_capability_dbms_mysql_55=true
bamboo_capability_system_jdk_JDK_1_7_0_65=/usr/lib/jvm/java-7-openjdk-amd64
bamboo_planRepository_revision=dc8ff9da28b8ab4ad11c7ea94cca526f17c87fe5
bamboo_buildTimeStamp=2018-06-19T16:37:33.068Z
bamboo_repository_previous_revision_number=dc8ff9da28b8ab4ad11c7ea94cca526f17c87fe5
bamboo_capability_system_jdk_JDK_1_6_0_16=/usr/lib/jvm/java-6-sun-1.6.0.16
bamboo_capability_system_builder_mvn2_Maven_2=/usr/share/maven2
bamboo_planRepository_previousRevision=dc8ff9da28b8ab4ad11c7ea94cca526f17c87fe5
bamboo_build_commandline_com_atlassian_bamboo_plugins_scripttask_task_builder_script_4=/bin/sh /home/bamboo/temp/PHPBB3-PR-JOB1-8276-ScriptBuildTask-522664624142112639.sh
bamboo_repository_git_branch=3.1.x
bamboo_buildResultKey=PHPBB3-PR-JOB1-8276
bamboo_repository_branch_name=3.1.x
bamboo_buildPlanName=phpBB3 - Pull Requests - Build and Test Job
bamboo_planRepository_1_revision=dc8ff9da28b8ab4ad11c7ea94cca526f17c87fe5
bamboo_repository_name=phpBB Ascraeus
bamboo_buildFailed=true
bamboo_capability_system_docker_executable=/usr/bin/docker
bamboo_build_commandline_com_atlassian_bamboo_plugins_bamboo_docker_plugin_task_docker_cli_11=/usr/bin/docker run --volume /home/bamboo/xml-data/build-dir/PHPBB3-PR-JOB1:/data --workdir /data/build --rm -u=991 phpbb:php-5.6 ../phpBB/vendor/bin/phing sniff
bamboo_build_commandline_com_atlassian_bamboo_plugins_bamboo_docker_plugin_task_docker_cli_12=/usr/bin/docker run --volume /home/bamboo/xml-data/build-dir/PHPBB3-PR-JOB1:/data --workdir /data/phpBB --rm -e HOME=/home/bamboo -u=991 phpbb:php-5.6 /bin/bash -c php ../composer.phar install --dev; cd ../build; ../phpBB/vendor/bin/phing clean prepare
bamboo_planRepository_branch=3.1.x
bamboo_agentWorkingDirectory=/home/bamboo/xml-data/build-dir
bamboo_jobFailed=true
bamboo_capability_system_git_executable=/usr/bin/git
bamboo_capability_system_builder_phpunit_PHPUnit_3_4=/usr/bin/phpunit
bamboo_repository_git_username=bantu
bamboo_planRepository_1_previousRevision=dc8ff9da28b8ab4ad11c7ea94cca526f17c87fe5
bamboo_repository_75956235_revision_number=dc8ff9da28b8ab4ad11c7ea94cca526f17c87fe5
bamboo_planRepository_branchDisplayName=3.1.x
bamboo_planRepository_1_type=gitv2
bamboo_planRepository_branchName=3.1.x
bamboo_repository_75956235_previous_revision_number=dc8ff9da28b8ab4ad11c7ea94cca526f17c87fe5
bamboo_capability_system_jdk_JDK=/usr/lib/jvm/java-6-sun
bamboo_plan_storageTag=PHPBB3-PR
bamboo_hg_cache_directory=/home/bamboo/xml-data/build-dir/_hg-repositories-cache
bamboo_planRepository_1_username=bantu
bamboo_planRepository_type=gitv2
bamboo_git_cache_directory=/home/bamboo/xml-data/build-dir/_git-repositories-cache
bamboo_ManualBuildTriggerReason_userName=Build Robot
bamboo_repository_git_repositoryUrl=https://github.com/phpbb/phpbb.git
bamboo_repository_75956235_git_branch=3.1.x
bamboo_capability_system_builder_ant_Ant=/usr/share/ant
bamboo_repository_75956235_name=phpBB Ascraeus
bamboo_tmp_directory=/home/bamboo/temp
bamboo_working_directory=/home/bamboo/xml-data/build-dir/PHPBB3-PR-JOB1
bamboo_planKey=PHPBB3-PR
bamboo_capability_local=true
bamboo_planRepository_1_repositoryUrl=https://github.com/phpbb/phpbb.git
bamboo_planRepository_username=bantu
bamboo_capability_system_jdk_JDK_1_6=/usr/lib/jvm/java-6-sun
bamboo_capability_system_jdk_JDK_1_7=/usr/lib/jvm/java-7-openjdk-amd64
bamboo_planRepository_1_branchName=3.1.x
19-Jun-2018 16:40:25 From https://github.com/phpbb/phpbb
19-Jun-2018 16:40:25 * branch            refs/pull/4933/head -> FETCH_HEAD
19-Jun-2018 16:40:25 grep: build/logs/phpunit.xml: No such file or directory
19-Jun-2018 16:40:25 grep: build/logs/phpunit.xml: No such file or directory
19-Jun-2018 16:40:25   % Total    % Received % Xferd  Average Speed   Time    Time     Time  Current
19-Jun-2018 16:40:25                                  Dload  Upload   Total   Spent    Left  Speed
19-Jun-2018 16:40:25
19-Jun-2018 16:40:26   0     0    0     0    0     0      0      0 --:--:-- --:--:-- --:--:--     0
19-Jun-2018 16:40:26   0     0    0     0    0     0      0      0 --:--:-- --:--:-- --:--:--     0
19-Jun-2018 16:40:26 100   273  100    93  100   180    185    359 --:--:-- --:--:-- --:--:--   359
19-Jun-2018 16:40:26 Finished task 'Set result build status' with result: Success
19-Jun-2018 16:40:26 Running post build plugin 'NCover Results Collector'
19-Jun-2018 16:40:26 Running post build plugin 'Artifact Copier'
19-Jun-2018 16:40:26 Running post build plugin 'npm Cache Cleanup'
19-Jun-2018 16:40:26 Running post build plugin 'Clover Results Collector'
19-Jun-2018 16:40:26 Running post build plugin 'Docker Container Cleanup'
19-Jun-2018 16:40:26 Successfully removed working directory at '/home/bamboo/xml-data/build-dir/PHPBB3-PR-JOB1'
19-Jun-2018 16:40:26 Finalising the build...
19-Jun-2018 16:40:26 Stopping timer.
19-Jun-2018 16:40:26 Build PHPBB3-PR-JOB1-8276 completed.
19-Jun-2018 16:40:26 Running on server: post build plugin 'NCover Results Collector'
19-Jun-2018 16:40:26 Running on server: post build plugin 'Build Hanging Detection Configuration'
19-Jun-2018 16:40:26 Running on server: post build plugin 'Clover Delta Calculator'
19-Jun-2018 16:40:26 Running on server: post build plugin 'Maven Dependencies Postprocessor'
19-Jun-2018 16:40:26 All post build plugins have finished
19-Jun-2018 16:40:26 Generating build results summary...
19-Jun-2018 16:40:26 Saving build results to disk...
19-Jun-2018 16:40:26 Logging substituted variables...
19-Jun-2018 16:40:26 Indexing build results...
19-Jun-2018 16:40:26 Finished building PHPBB3-PR-JOB1-8276.
19-Jun-2018 16:40:26
Substituting variable: ${bamboo.PRnumber} with 4933