Tests pending pull requests

Build: #8286 failed

Job: Build and Test Job failed

Stages & jobs

  1. Build and Test

Build log

The build generated 956 lines of output. Download or view full build log

19-Jun-2018 19:52:05 Build phpBB3 - Pull Requests - Build and Test Job #8286 (PHPBB3-PR-JOB1-8286) started building on agent Default Agent
19-Jun-2018 19:52:05
19-Jun-2018 19:52:05 Build working directory is /home/bamboo/xml-data/build-dir/PHPBB3-PR-JOB1
19-Jun-2018 19:52:05 Executing build phpBB3 - Pull Requests - Build and Test Job #8286 (PHPBB3-PR-JOB1-8286)
19-Jun-2018 19:52:05 Starting task 'Checkout develop branch' of type 'com.atlassian.bamboo.plugins.vcs:task.vcs.checkout'
19-Jun-2018 19:52:05 Build always requires a clean checkout
19-Jun-2018 19:52:05 Cleaning build directory '/home/bamboo/xml-data/build-dir/PHPBB3-PR-JOB1'
19-Jun-2018 19:52:05 Checking out into /home/bamboo/xml-data/build-dir/PHPBB3-PR-JOB1
19-Jun-2018 19:52:05 Updating source code to revision: dc8ff9da28b8ab4ad11c7ea94cca526f17c87fe5
19-Jun-2018 19:52:05 Fetching 'refs/heads/3.1.x' from 'https://github.com/phpbb/phpbb.git'.
19-Jun-2018 19:52:06 Checking out revision dc8ff9da28b8ab4ad11c7ea94cca526f17c87fe5.
19-Jun-2018 19:52:06 Creating local git repository in '/home/bamboo/xml-data/build-dir/PHPBB3-PR-JOB1/.git'.
19-Jun-2018 19:52:06 Cloning into '/home/bamboo/xml-data/build-dir/PHPBB3-PR-JOB1'...
19-Jun-2018 19:52:06 done.
19-Jun-2018 19:52:08 Switched to a new branch '3.1.x'
19-Jun-2018 19:52:08 Branch 3.1.x set up to track remote branch 3.1.x from origin.
19-Jun-2018 19:52:08 Updated source code to revision: dc8ff9da28b8ab4ad11c7ea94cca526f17c87fe5
19-Jun-2018 19:52:08 Finished task 'Checkout develop branch' with result: Success
19-Jun-2018 19:52:08 Running pre-build action: VCS Version Collector
19-Jun-2018 19:52:08
Substituting variable: ${bamboo.PRnumber} with 5247
19-Jun-2018 19:52:08
Substituting variable: ${bamboo.buildResultsUrl} with https://bamboo.phpbb.com/browse/PHPBB3-PR-JOB1-8286
19-Jun-2018 19:52:08 Starting task 'Set pending build status' of type 'com.atlassian.bamboo.plugins.scripttask:task.builder.script'
19-Jun-2018 19:52:08
Beginning to execute external process for build 'phpBB3 - Pull Requests - Build and Test Job #8286 (PHPBB3-PR-JOB1-8286)'
... running command line:
/bin/sh /home/bamboo/temp/PHPBB3-PR-JOB1-8286-ScriptBuildTask-8619838594406234099.sh
... in: /home/bamboo/xml-data/build-dir/PHPBB3-PR-JOB1
... using extra environment variables:
bamboo_planRepository_1_branch=3.1.x
bamboo_planRepository_1_branchDisplayName=3.1.x
bamboo_repository_revision_number=dc8ff9da28b8ab4ad11c7ea94cca526f17c87fe5
bamboo_PRref=master
bamboo_resultsUrl=https://bamboo.phpbb.com/browse/PHPBB3-PR-JOB1-8286
bamboo_capability_system_builder_command_Git=/usr/bin/git
bamboo_repository_75956235_git_username=bantu
bamboo_build_working_directory=/home/bamboo/xml-data/build-dir/PHPBB3-PR-JOB1
bamboo_planRepository_1_name=phpBB Ascraeus
bamboo_buildKey=PHPBB3-PR-JOB1
bamboo_capability_phpbb_tests=true
bamboo_shortPlanName=Pull Requests
bamboo_capability_system_builder_command_fop=/usr/bin/fop
bamboo_capability_dbms_sqlite_2=true
bamboo_planRepository_name=phpBB Ascraeus
bamboo_PRnumber=5247
bamboo_buildNumber=8286
bamboo_repository_75956235_git_repositoryUrl=https://github.com/phpbb/phpbb.git
bamboo_capability_system_builder_phpunit_PHPUnit=/usr/bin/phpunit
bamboo_shortJobName=Build and Test Job
bamboo_buildResultsUrl=https://bamboo.phpbb.com/browse/PHPBB3-PR-JOB1-8286
bamboo_repository_75956235_branch_name=3.1.x
bamboo_planRepository_repositoryUrl=https://github.com/phpbb/phpbb.git
bamboo_agentId=131073
bamboo_planName=phpBB3 - Pull Requests
bamboo_shortPlanKey=PR
bamboo_shortJobKey=JOB1
bamboo_capability_dbms_mysql_55=true
bamboo_capability_system_jdk_JDK_1_7_0_65=/usr/lib/jvm/java-7-openjdk-amd64
bamboo_planRepository_revision=dc8ff9da28b8ab4ad11c7ea94cca526f17c87fe5
bamboo_buildTimeStamp=2018-06-19T19:52:05.356Z
bamboo_repository_previous_revision_number=dc8ff9da28b8ab4ad11c7ea94cca526f17c87fe5
bamboo_capability_system_jdk_JDK_1_6_0_16=/usr/lib/jvm/java-6-sun-1.6.0.16
bamboo_capability_system_builder_mvn2_Maven_2=/usr/share/maven2
bamboo_planRepository_previousRevision=dc8ff9da28b8ab4ad11c7ea94cca526f17c87fe5
bamboo_repository_git_branch=3.1.x
bamboo_buildResultKey=PHPBB3-PR-JOB1-8286
bamboo_repository_branch_name=3.1.x
bamboo_buildPlanName=phpBB3 - Pull Requests - Build and Test Job
bamboo_planRepository_1_revision=dc8ff9da28b8ab4ad11c7ea94cca526f17c87fe5
bamboo_repository_name=phpBB Ascraeus
bamboo_buildFailed=false
bamboo_capability_system_docker_executable=/usr/bin/docker
bamboo_planRepository_branch=3.1.x
bamboo_agentWorkingDirectory=/home/bamboo/xml-data/build-dir
bamboo_capability_system_git_executable=/usr/bin/git
bamboo_capability_system_builder_phpunit_PHPUnit_3_4=/usr/bin/phpunit
bamboo_repository_git_username=bantu
bamboo_planRepository_1_previousRevision=dc8ff9da28b8ab4ad11c7ea94cca526f17c87fe5
bamboo_repository_75956235_revision_number=dc8ff9da28b8ab4ad11c7ea94cca526f17c87fe5
bamboo_planRepository_branchDisplayName=3.1.x
bamboo_planRepository_1_type=gitv2
bamboo_planRepository_branchName=3.1.x
bamboo_repository_75956235_previous_revision_number=dc8ff9da28b8ab4ad11c7ea94cca526f17c87fe5
bamboo_capability_system_jdk_JDK=/usr/lib/jvm/java-6-sun
bamboo_plan_storageTag=PHPBB3-PR
bamboo_hg_cache_directory=/home/bamboo/xml-data/build-dir/_hg-repositories-cache
bamboo_planRepository_1_username=bantu
bamboo_planRepository_type=gitv2
bamboo_git_cache_directory=/home/bamboo/xml-data/build-dir/_git-repositories-cache
bamboo_ManualBuildTriggerReason_userName=Build Robot
bamboo_repository_git_repositoryUrl=https://github.com/phpbb/phpbb.git
bamboo_repository_75956235_git_branch=3.1.x
bamboo_capability_system_builder_ant_Ant=/usr/share/ant
bamboo_repository_75956235_name=phpBB Ascraeus
bamboo_tmp_directory=/home/bamboo/temp
bamboo_working_directory=/home/bamboo/xml-data/build-dir/PHPBB3-PR-JOB1
bamboo_planKey=PHPBB3-PR
bamboo_capability_local=true
bamboo_planRepository_1_repositoryUrl=https://github.com/phpbb/phpbb.git
bamboo_planRepository_username=bantu
bamboo_capability_system_jdk_JDK_1_6=/usr/lib/jvm/java-6-sun
bamboo_capability_system_jdk_JDK_1_7=/usr/lib/jvm/java-7-openjdk-amd64
bamboo_planRepository_1_branchName=3.1.x
19-Jun-2018 19:52:11 From https://github.com/phpbb/phpbb
19-Jun-2018 19:52:11 * branch            refs/pull/5247/head -> FETCH_HEAD
19-Jun-2018 19:52:11   % Total    % Received % Xferd  Average Speed   Time    Time     Time  Current
19-Jun-2018 19:52:11                                  Dload  Upload   Total   Spent    Left  Speed
19-Jun-2018 19:52:11
19-Jun-2018 19:52:11   0     0    0     0    0     0      0      0 --:--:-- --:--:-- --:--:--     0
19-Jun-2018 19:52:11 100   275  100    93  100   182    309    604 --:--:-- --:--:-- --:--:--   606
19-Jun-2018 19:52:11 Finished task 'Set pending build status' with result: Success
19-Jun-2018 19:52:11
Substituting variable: ${bamboo.PRnumber} with 5247
19-Jun-2018 19:52:11 Starting task 'Fetch PR' of type 'com.atlassian.bamboo.plugins.scripttask:task.builder.script'
19-Jun-2018 19:52:11
Beginning to execute external process for build 'phpBB3 - Pull Requests - Build and Test Job #8286 (PHPBB3-PR-JOB1-8286)'
... running command line:
/bin/sh /home/bamboo/temp/PHPBB3-PR-JOB1-8286-ScriptBuildTask-5310967031814310925.sh
... in: /home/bamboo/xml-data/build-dir/PHPBB3-PR-JOB1
... using extra environment variables:
bamboo_planRepository_1_branch=3.1.x
bamboo_planRepository_1_branchDisplayName=3.1.x
bamboo_repository_revision_number=dc8ff9da28b8ab4ad11c7ea94cca526f17c87fe5
bamboo_PRref=master
bamboo_resultsUrl=https://bamboo.phpbb.com/browse/PHPBB3-PR-JOB1-8286
bamboo_capability_system_builder_command_Git=/usr/bin/git
bamboo_repository_75956235_git_username=bantu
bamboo_build_working_directory=/home/bamboo/xml-data/build-dir/PHPBB3-PR-JOB1
bamboo_planRepository_1_name=phpBB Ascraeus
bamboo_buildKey=PHPBB3-PR-JOB1
bamboo_capability_phpbb_tests=true
bamboo_shortPlanName=Pull Requests
bamboo_capability_system_builder_command_fop=/usr/bin/fop
bamboo_capability_dbms_sqlite_2=true
bamboo_planRepository_name=phpBB Ascraeus
bamboo_PRnumber=5247
bamboo_buildNumber=8286
bamboo_repository_75956235_git_repositoryUrl=https://github.com/phpbb/phpbb.git
bamboo_capability_system_builder_phpunit_PHPUnit=/usr/bin/phpunit
bamboo_shortJobName=Build and Test Job
bamboo_buildResultsUrl=https://bamboo.phpbb.com/browse/PHPBB3-PR-JOB1-8286
bamboo_repository_75956235_branch_name=3.1.x
bamboo_planRepository_repositoryUrl=https://github.com/phpbb/phpbb.git
bamboo_agentId=131073
bamboo_planName=phpBB3 - Pull Requests
bamboo_build_commandline_com_atlassian_bamboo_plugins_scripttask_task_builder_script_7=/bin/sh /home/bamboo/temp/PHPBB3-PR-JOB1-8286-ScriptBuildTask-8619838594406234099.sh
bamboo_shortPlanKey=PR
bamboo_shortJobKey=JOB1
bamboo_capability_dbms_mysql_55=true
bamboo_capability_system_jdk_JDK_1_7_0_65=/usr/lib/jvm/java-7-openjdk-amd64
bamboo_planRepository_revision=dc8ff9da28b8ab4ad11c7ea94cca526f17c87fe5
bamboo_buildTimeStamp=2018-06-19T19:52:05.356Z
bamboo_repository_previous_revision_number=dc8ff9da28b8ab4ad11c7ea94cca526f17c87fe5
bamboo_capability_system_jdk_JDK_1_6_0_16=/usr/lib/jvm/java-6-sun-1.6.0.16
bamboo_capability_system_builder_mvn2_Maven_2=/usr/share/maven2
bamboo_planRepository_previousRevision=dc8ff9da28b8ab4ad11c7ea94cca526f17c87fe5
bamboo_repository_git_branch=3.1.x
bamboo_buildResultKey=PHPBB3-PR-JOB1-8286
bamboo_repository_branch_name=3.1.x
bamboo_buildPlanName=phpBB3 - Pull Requests - Build and Test Job
bamboo_planRepository_1_revision=dc8ff9da28b8ab4ad11c7ea94cca526f17c87fe5
bamboo_repository_name=phpBB Ascraeus
bamboo_buildFailed=false
bamboo_capability_system_docker_executable=/usr/bin/docker
bamboo_planRepository_branch=3.1.x
bamboo_agentWorkingDirectory=/home/bamboo/xml-data/build-dir
bamboo_capability_system_git_executable=/usr/bin/git
bamboo_capability_system_builder_phpunit_PHPUnit_3_4=/usr/bin/phpunit
bamboo_repository_git_username=bantu
bamboo_planRepository_1_previousRevision=dc8ff9da28b8ab4ad11c7ea94cca526f17c87fe5
bamboo_repository_75956235_revision_number=dc8ff9da28b8ab4ad11c7ea94cca526f17c87fe5
bamboo_planRepository_branchDisplayName=3.1.x
bamboo_planRepository_1_type=gitv2
bamboo_planRepository_branchName=3.1.x
bamboo_repository_75956235_previous_revision_number=dc8ff9da28b8ab4ad11c7ea94cca526f17c87fe5
bamboo_capability_system_jdk_JDK=/usr/lib/jvm/java-6-sun
bamboo_plan_storageTag=PHPBB3-PR
bamboo_hg_cache_directory=/home/bamboo/xml-data/build-dir/_hg-repositories-cache
bamboo_planRepository_1_username=bantu
bamboo_planRepository_type=gitv2
bamboo_git_cache_directory=/home/bamboo/xml-data/build-dir/_git-repositories-cache
bamboo_ManualBuildTriggerReason_userName=Build Robot
bamboo_repository_git_repositoryUrl=https://github.com/phpbb/phpbb.git
bamboo_repository_75956235_git_branch=3.1.x
bamboo_capability_system_builder_ant_Ant=/usr/share/ant
bamboo_repository_75956235_name=phpBB Ascraeus
bamboo_tmp_directory=/home/bamboo/temp
bamboo_working_directory=/home/bamboo/xml-data/build-dir/PHPBB3-PR-JOB1
bamboo_planKey=PHPBB3-PR
bamboo_capability_local=true
bamboo_planRepository_1_repositoryUrl=https://github.com/phpbb/phpbb.git
bamboo_planRepository_username=bantu
bamboo_capability_system_jdk_JDK_1_6=/usr/lib/jvm/java-6-sun
bamboo_capability_system_jdk_JDK_1_7=/usr/lib/jvm/java-7-openjdk-amd64
bamboo_planRepository_1_branchName=3.1.x
19-Jun-2018 19:52:15 From https://github.com/phpbb/phpbb
19-Jun-2018 19:52:15 * branch            refs/pull/5247/merge -> FETCH_HEAD
19-Jun-2018 19:52:15 Note: checking out 'FETCH_HEAD'.
19-Jun-2018 19:52:15
19-Jun-2018 19:52:15 You are in 'detached HEAD' state. You can look around, make experimental
19-Jun-2018 19:52:15 changes and commit them, and you can discard any commits you make in this
19-Jun-2018 19:52:15 state without impacting any branches by performing another checkout.
19-Jun-2018 19:52:15
19-Jun-2018 19:52:15 If you want to create a new branch to retain commits you create, you may
19-Jun-2018 19:52:15 do so (now or later) by using -b with the checkout command again. Example:
19-Jun-2018 19:52:15
19-Jun-2018 19:52:15   git checkout -b new_branch_name
19-Jun-2018 19:52:15
19-Jun-2018 19:52:15 HEAD is now at 107c9e3... Merge 146624ef650c8628ca801d12752e8ac91dbdcdc2 into 857b55dd20c3b7525e472654b1d5e9b4e2669710
19-Jun-2018 19:52:15 Finished task 'Fetch PR' with result: Success
19-Jun-2018 19:52:15 Skipping execution of task 'Prepare directory' as it is disabled
19-Jun-2018 19:52:15
Substituting variable: ${bamboo.working.directory} with /home/bamboo/xml-data/build-dir/PHPBB3-PR-JOB1
19-Jun-2018 19:52:15 Starting task 'Prepare directory' of type 'com.atlassian.bamboo.plugins.bamboo-docker-plugin:task.docker.cli'
19-Jun-2018 19:52:15 Running image name (phpbb:php-5.6)
19-Jun-2018 19:52:15
Beginning to execute external process for build 'phpBB3 - Pull Requests - Build and Test Job #8286 (PHPBB3-PR-JOB1-8286)'
... running command line:
/usr/bin/docker run --volume /home/bamboo/xml-data/build-dir/PHPBB3-PR-JOB1:/data --workdir /data/phpBB --rm -e HOME=/home/bamboo -u=991 phpbb:php-5.6 /bin/bash -c php ../composer.phar install --dev; cd ../build; ../phpBB/vendor/bin/phing clean prepare
... in: /home/bamboo/xml-data/build-dir/PHPBB3-PR-JOB1
... using extra environment variables:
bamboo_planRepository_1_branch=3.1.x
bamboo_planRepository_1_branchDisplayName=3.1.x
bamboo_repository_revision_number=dc8ff9da28b8ab4ad11c7ea94cca526f17c87fe5
bamboo_PRref=master
bamboo_resultsUrl=https://bamboo.phpbb.com/browse/PHPBB3-PR-JOB1-8286
bamboo_capability_system_builder_command_Git=/usr/bin/git
bamboo_repository_75956235_git_username=bantu
bamboo_build_working_directory=/home/bamboo/xml-data/build-dir/PHPBB3-PR-JOB1
bamboo_planRepository_1_name=phpBB Ascraeus
bamboo_buildKey=PHPBB3-PR-JOB1
bamboo_capability_phpbb_tests=true
bamboo_shortPlanName=Pull Requests
bamboo_capability_system_builder_command_fop=/usr/bin/fop
bamboo_capability_dbms_sqlite_2=true
bamboo_planRepository_name=phpBB Ascraeus
bamboo_PRnumber=5247
bamboo_buildNumber=8286
bamboo_repository_75956235_git_repositoryUrl=https://github.com/phpbb/phpbb.git
bamboo_capability_system_builder_phpunit_PHPUnit=/usr/bin/phpunit
bamboo_shortJobName=Build and Test Job
bamboo_buildResultsUrl=https://bamboo.phpbb.com/browse/PHPBB3-PR-JOB1-8286
bamboo_repository_75956235_branch_name=3.1.x
bamboo_planRepository_repositoryUrl=https://github.com/phpbb/phpbb.git
bamboo_agentId=131073
bamboo_planName=phpBB3 - Pull Requests
bamboo_build_commandline_com_atlassian_bamboo_plugins_scripttask_task_builder_script_7=/bin/sh /home/bamboo/temp/PHPBB3-PR-JOB1-8286-ScriptBuildTask-8619838594406234099.sh
bamboo_shortPlanKey=PR
bamboo_shortJobKey=JOB1
bamboo_capability_dbms_mysql_55=true
bamboo_capability_system_jdk_JDK_1_7_0_65=/usr/lib/jvm/java-7-openjdk-amd64
bamboo_planRepository_revision=dc8ff9da28b8ab4ad11c7ea94cca526f17c87fe5
bamboo_buildTimeStamp=2018-06-19T19:52:05.356Z
bamboo_repository_previous_revision_number=dc8ff9da28b8ab4ad11c7ea94cca526f17c87fe5
bamboo_capability_system_jdk_JDK_1_6_0_16=/usr/lib/jvm/java-6-sun-1.6.0.16
bamboo_capability_system_builder_mvn2_Maven_2=/usr/share/maven2
bamboo_planRepository_previousRevision=dc8ff9da28b8ab4ad11c7ea94cca526f17c87fe5
bamboo_build_commandline_com_atlassian_bamboo_plugins_scripttask_task_builder_script_4=/bin/sh /home/bamboo/temp/PHPBB3-PR-JOB1-8286-ScriptBuildTask-5310967031814310925.sh
bamboo_repository_git_branch=3.1.x
bamboo_buildResultKey=PHPBB3-PR-JOB1-8286
bamboo_repository_branch_name=3.1.x
bamboo_buildPlanName=phpBB3 - Pull Requests - Build and Test Job
bamboo_planRepository_1_revision=dc8ff9da28b8ab4ad11c7ea94cca526f17c87fe5
bamboo_repository_name=phpBB Ascraeus
bamboo_buildFailed=false
bamboo_capability_system_docker_executable=/usr/bin/docker
bamboo_planRepository_branch=3.1.x
bamboo_agentWorkingDirectory=/home/bamboo/xml-data/build-dir
bamboo_capability_system_git_executable=/usr/bin/git
bamboo_capability_system_builder_phpunit_PHPUnit_3_4=/usr/bin/phpunit
bamboo_repository_git_username=bantu
bamboo_planRepository_1_previousRevision=dc8ff9da28b8ab4ad11c7ea94cca526f17c87fe5
bamboo_repository_75956235_revision_number=dc8ff9da28b8ab4ad11c7ea94cca526f17c87fe5
bamboo_planRepository_branchDisplayName=3.1.x
bamboo_planRepository_1_type=gitv2
bamboo_planRepository_branchName=3.1.x
bamboo_repository_75956235_previous_revision_number=dc8ff9da28b8ab4ad11c7ea94cca526f17c87fe5
bamboo_capability_system_jdk_JDK=/usr/lib/jvm/java-6-sun
bamboo_plan_storageTag=PHPBB3-PR
bamboo_hg_cache_directory=/home/bamboo/xml-data/build-dir/_hg-repositories-cache
bamboo_planRepository_1_username=bantu
bamboo_planRepository_type=gitv2
bamboo_git_cache_directory=/home/bamboo/xml-data/build-dir/_git-repositories-cache
bamboo_ManualBuildTriggerReason_userName=Build Robot
bamboo_repository_git_repositoryUrl=https://github.com/phpbb/phpbb.git
bamboo_repository_75956235_git_branch=3.1.x
bamboo_capability_system_builder_ant_Ant=/usr/share/ant
bamboo_repository_75956235_name=phpBB Ascraeus
bamboo_tmp_directory=/home/bamboo/temp
bamboo_working_directory=/home/bamboo/xml-data/build-dir/PHPBB3-PR-JOB1
bamboo_planKey=PHPBB3-PR
bamboo_capability_local=true
bamboo_planRepository_1_repositoryUrl=https://github.com/phpbb/phpbb.git
bamboo_planRepository_username=bantu
bamboo_capability_system_jdk_JDK_1_6=/usr/lib/jvm/java-6-sun
bamboo_capability_system_jdk_JDK_1_7=/usr/lib/jvm/java-7-openjdk-amd64
bamboo_planRepository_1_branchName=3.1.x
19-Jun-2018 19:52:15 Cannot create cache directory /home/bamboo/.composer/cache/repo/https---packagist.org/, or directory is not writable. Proceeding without cache
19-Jun-2018 19:52:15 Cannot create cache directory /home/bamboo/.composer/cache/files/, or directory is not writable. Proceeding without cache
19-Jun-2018 19:52:15 You are using the deprecated option "dev". Dev packages are installed by default now.
19-Jun-2018 19:52:15 Loading composer repositories with package information
19-Jun-2018 19:52:15 Installing dependencies (including require-dev) from lock file
19-Jun-2018 19:52:16 Package operations: 75 installs, 0 updates, 0 removals
19-Jun-2018 19:52:17   - Installing composer/installers (v1.5.0): Downloading (connecting...)Downloading (0%)           Downloading (5%)Downloading (20%)Downloading (25%)Downloading (30%)Downloading (35%)Downloading (50%)Downloading (55%)Downloading (60%)Downloading (80%)Downloading (85%)Downloading (90%)Downloading (100%)
19-Jun-2018 19:52:17   - Installing bantu/ini-get-wrapper (v1.0.1): Downloading (connecting...)Downloading (0%)           Downloading (100%)
19-Jun-2018 19:52:18   - Installing symfony/process (v3.4.3): Downloading (connecting...)Downloading (0%)           Downloading (5%)Downloading (30%)Downloading (35%)Downloading (70%)Downloading (75%)Downloading (80%)Downloading (100%)
19-Jun-2018 19:52:19   - Installing symfony/finder (v3.4.3): Downloading (connecting...)Downloading (0%)           Downloading (5%)Downloading (10%)Downloading (15%)Downloading (35%)Downloading (40%)Downloading (45%)Downloading (50%)Downloading (85%)Downloading (90%)Downloading (95%)Downloading (100%)
19-Jun-2018 19:52:19   - Installing symfony/filesystem (v3.4.3): Downloading (connecting...)Downloading (0%)           Downloading (5%)Downloading (85%)Downloading (90%)Downloading (100%)
19-Jun-2018 19:52:20   - Installing symfony/polyfill-mbstring (v1.7.0): Downloading (connecting...)Downloading (0%)           Downloading (20%)Downloading (40%)Downloading (60%)Downloading (100%)
19-Jun-2018 19:52:21   - Installing psr/log (1.0.2): Downloading (connecting...)Downloading (0%)           Downloading (15%)Downloading (100%)
19-Jun-2018 19:52:22   - Installing symfony/debug (v3.4.3): Downloading (connecting...)Downloading (0%)           Downloading (5%)Downloading (15%)Downloading (20%)Downloading (30%)Downloading (35%)Downloading (50%)Downloading (55%)Downloading (70%)Downloading (75%)Downloading (80%)Downloading (95%)Downloading (100%)
19-Jun-2018 19:52:23   - Installing symfony/console (v3.4.3): Downloading (connecting...)Downloading (100%)         
19-Jun-2018 19:52:23   - Installing seld/phar-utils (1.0.1): Downloading (connecting...)Downloading (0%)           Downloading (30%)Downloading (60%)Downloading (90%)Downloading (100%)
19-Jun-2018 19:52:24   - Installing seld/jsonlint (1.7.0): Downloading (connecting...)Downloading (0%)           Downloading (15%)Downloading (60%)Downloading (75%)Downloading (90%)Downloading (100%)
19-Jun-2018 19:52:25   - Installing seld/cli-prompt (1.0.3): Downloading (connecting...)Downloading (0%)           Downloading (15%)Downloading (30%)Downloading (100%)
19-Jun-2018 19:52:26   - Installing justinrainbow/json-schema (5.2.6): Downloading (connecting...)Downloading (0%)           Downloading (20%)Downloading (25%)Downloading (30%)Downloading (35%)Downloading (50%)Downloading (55%)Downloading (70%)Downloading (75%)Downloading (95%)Downloading (100%)
19-Jun-2018 19:52:26   - Installing composer/spdx-licenses (1.2.0): Downloading (connecting...)Downloading (0%)           Downloading (65%)Downloading (100%)
19-Jun-2018 19:52:27   - Installing composer/semver (1.4.2): Downloading (connecting...)Downloading (0%)           Downloading (35%)Downloading (75%)Downloading (100%)
19-Jun-2018 19:52:28   - Installing composer/ca-bundle (1.1.0): Downloading (connecting...)Downloading (0%)           Downloading (5%)Downloading (10%)Downloading (15%)Downloading (20%)Downloading (25%)Downloading (30%)Downloading (35%)Downloading (40%)Downloading (45%)Downloading (50%)Downloading (55%)Downloading (60%)Downloading (65%)Downloading (70%)Downloading (75%)Downloading (80%)Downloading (85%)Downloading (90%)Downloading (95%)Downloading (100%)
19-Jun-2018 19:52:32   - Installing composer/composer (1.6.2): Downloading (connecting...)Downloading (0%)           Downloading (5%)Downloading (10%)Downloading (15%)Downloading (20%)Downloading (25%)Downloading (30%)Downloading (35%)Downloading (40%)Downloading (45%)Downloading (50%)Downloading (55%)Downloading (60%)Downloading (65%)Downloading (70%)Downloading (75%)Downloading (80%)Downloading (85%)Downloading (90%)Downloading (95%)Downloading (100%)
19-Jun-2018 19:52:33   - Installing google/recaptcha (1.1.3): Downloading (connecting...)Downloading (0%)           Downloading (25%)Downloading (40%)Downloading (70%)Downloading (95%)Downloading (100%)
19-Jun-2018 19:52:33   - Installing guzzlehttp/promises (v1.3.1): Downloading (connecting...)Downloading (0%)           Downloading (30%)Downloading (40%)Downloading (70%)Downloading (80%)Downloading (100%)
19-Jun-2018 19:52:34   - Installing psr/http-message (1.0.1): Downloading (connecting...)Downloading (0%)           Downloading (95%)Downloading (100%)
19-Jun-2018 19:52:35   - Installing guzzlehttp/psr7 (1.4.2): Downloading (connecting...)Downloading (0%)           Downloading (5%)Downloading (10%)Downloading (15%)Downloading (35%)Downloading (40%)Downloading (45%)Downloading (50%)Downloading (55%)Downloading (60%)Downloading (65%)Downloading (85%)Downloading (90%)Downloading (95%)Downloading (100%)
19-Jun-2018 19:52:36   - Installing lusitanian/oauth (v0.8.10): Downloading (connecting...)Downloading (0%)           Downloading (5%)Downloading (10%)Downloading (15%)Downloading (20%)Downloading (25%)Downloading (35%)Downloading (40%)Downloading (50%)Downloading (55%)Downloading (60%)Downloading (65%)Downloading (70%)Downloading (80%)Downloading (85%)Downloading (90%)Downloading (95%)Downloading (100%)
19-Jun-2018 19:52:37   - Installing marc1706/fast-image-size (v1.1.4): Downloading (connecting...)Downloading (0%)           Downloading (45%)Downloading (95%)Downloading (100%)
19-Jun-2018 19:52:38   - Installing patchwork/utf8 (v1.3.1): Downloading (connecting...)Downloading (0%)           Downloading (5%)Downloading (10%)Downloading (15%)Downloading (20%)Downloading (25%)Downloading (30%)Downloading (35%)Downloading (40%)Downloading (45%)Downloading (50%)Downloading (55%)Downloading (60%)Downloading (65%)Downloading (70%)Downloading (75%)Downloading (80%)Downloading (85%)Downloading (90%)Downloading (95%)Downloading (100%)
19-Jun-2018 19:52:38   - Installing psr/container (1.0.0): Downloading (connecting...)Downloading (0%)           Downloading (75%)Downloading (100%)
19-Jun-2018 19:52:41   - Installing s9e/text-formatter (0.13.1): Downloading (connecting...)Downloading (0%)           Downloading (5%)Downloading (10%)Downloading (15%)Downloading (20%)Downloading (25%)Downloading (30%)Downloading (35%)Downloading (40%)Downloading (45%)Downloading (50%)Downloading (55%)Downloading (60%)Downloading (65%)Downloading (70%)Downloading (75%)Downloading (80%)Downloading (85%)Downloading (90%)Downloading (95%)Downloading (100%)
19-Jun-2018 19:52:42   - Installing symfony/config (v3.4.3): Downloading (connecting...)Downloading (100%)         
19-Jun-2018 19:52:43   - Installing paragonie/random_compat (v1.4.2): Downloading (connecting...)Downloading (0%)           Downloading (10%)Downloading (35%)Downloading (45%)Downloading (55%)Downloading (80%)Downloading (90%)Downloading (100%)
19-Jun-2018 19:52:44   - Installing symfony/polyfill-php70 (v1.6.0): Downloading (connecting...)Downloading (0%)           Downloading (85%)Downloading (100%)
19-Jun-2018 19:52:44   - Installing symfony/http-foundation (v3.4.3): Downloading (connecting...)Downloading (0%)           Downloading (5%)Downloading (10%)Downloading (15%)Downloading (20%)Downloading (25%)Downloading (30%)Downloading (35%)Downloading (40%)Downloading (45%)Downloading (50%)Downloading (55%)Downloading (60%)Downloading (65%)Downloading (70%)Downloading (75%)Downloading (80%)Downloading (85%)Downloading (90%)Downloading (95%)Downloading (100%)
19-Jun-2018 19:52:45   - Installing symfony/event-dispatcher (v3.4.3): Downloading (connecting...)Downloading (0%)           Downloading (5%)Downloading (90%)Downloading (95%)Downloading (100%)
19-Jun-2018 19:52:47   - Installing symfony/http-kernel (v3.4.3): Downloading (connecting...)Downloading (0%)           Downloading (5%)Downloading (10%)Downloading (15%)Downloading (20%)Downloading (25%)Downloading (30%)Downloading (35%)Downloading (40%)Downloading (45%)Downloading (50%)Downloading (55%)Downloading (60%)Downloading (65%)Downloading (70%)Downloading (75%)Downloading (80%)Downloading (85%)Downloading (90%)Downloading (95%)Downloading (100%)
19-Jun-2018 19:52:48   - Installing symfony/dependency-injection (v3.4.3): Downloading (connecting...)Downloading (100%)         
19-Jun-2018 19:52:49   - Installing zendframework/zend-eventmanager (3.2.0): Downloading (connecting...)Downloading (0%)           Downloading (25%)Downloading (35%)Downloading (45%)Downloading (70%)Downloading (80%)Downloading (100%)
19-Jun-2018 19:52:51   - Installing zendframework/zend-code (2.6.3): Downloading (connecting...)Downloading (0%)           Downloading (5%)Downloading (10%)Downloading (15%)Downloading (20%)Downloading (25%)Downloading (30%)Downloading (35%)Downloading (40%)Downloading (45%)Downloading (50%)Downloading (55%)Downloading (60%)Downloading (65%)Downloading (70%)Downloading (75%)Downloading (85%)Downloading (90%)Downloading (95%)Downloading (100%)
19-Jun-2018 19:52:51   - Installing ocramius/proxy-manager (1.0.2): Downloading (connecting...)Downloading (0%)           Downloading (5%)Downloading (10%)Downloading (15%)Downloading (20%)Downloading (25%)Downloading (30%)Downloading (35%)Downloading (40%)Downloading (45%)Downloading (50%)Downloading (55%)Downloading (60%)Downloading (65%)Downloading (75%)Downloading (80%)Downloading (85%)Downloading (90%)Downloading (95%)Downloading (100%)
19-Jun-2018 19:52:52   - Installing symfony/proxy-manager-bridge (v3.4.3): Downloading (connecting...)Downloading (0%)           Downloading (75%)Downloading (100%)
19-Jun-2018 19:52:54   - Installing symfony/routing (v3.4.3): Downloading (connecting...)Downloading (0%)           Downloading (5%)Downloading (10%)Downloading (15%)Downloading (20%)Downloading (25%)Downloading (30%)Downloading (35%)Downloading (40%)Downloading (45%)Downloading (50%)Downloading (55%)Downloading (60%)Downloading (65%)Downloading (70%)Downloading (75%)Downloading (80%)Downloading (85%)Downloading (90%)Downloading (95%)Downloading (100%)
19-Jun-2018 19:52:55   - Installing twig/twig (v1.35.0): Downloading (connecting...)Downloading (0%)           Downloading (5%)Downloading (10%)Downloading (15%)Downloading (20%)Downloading (25%)Downloading (30%)Downloading (35%)Downloading (40%)Downloading (45%)Downloading (50%)Downloading (55%)Downloading (60%)Downloading (65%)Downloading (70%)Downloading (75%)Downloading (80%)Downloading (85%)Downloading (90%)Downloading (95%)Downloading (100%)
19-Jun-2018 19:52:56   - Installing symfony/twig-bridge (v3.4.3): Downloading (connecting...)Downloading (0%)           Downloading (5%)Downloading (10%)Downloading (15%)Downloading (20%)Downloading (25%)Downloading (30%)Downloading (40%)Downloading (45%)Downloading (50%)Downloading (55%)Downloading (60%)Downloading (70%)Downloading (75%)Downloading (80%)Downloading (90%)Downloading (95%)Downloading (100%)
19-Jun-2018 19:52:57   - Installing symfony/dom-crawler (v3.4.3): Downloading (connecting...)Downloading (0%)           Downloading (5%)Downloading (25%)Downloading (30%)Downloading (45%)Downloading (50%)Downloading (70%)Downloading (75%)Downloading (100%)
19-Jun-2018 19:52:58   - Installing symfony/css-selector (v3.4.3): Downloading (connecting...)Downloading (0%)           Downloading (5%)Downloading (10%)Downloading (15%)Downloading (20%)Downloading (25%)Downloading (30%)Downloading (55%)Downloading (60%)Downloading (65%)Downloading (70%)Downloading (75%)Downloading (80%)Downloading (85%)Downloading (90%)Downloading (95%)Downloading (100%)
19-Jun-2018 19:52:59   - Installing symfony/browser-kit (v3.4.3): Downloading (connecting...)Downloading (0%)           Downloading (5%)Downloading (70%)Downloading (100%)
19-Jun-2018 19:53:00   - Installing guzzlehttp/guzzle (6.3.0): Downloading (connecting...)Downloading (0%)           Downloading (5%)Downloading (15%)Downloading (25%)Downloading (30%)Downloading (40%)Downloading (45%)Downloading (55%)Downloading (60%)Downloading (70%)Downloading (75%)Downloading (90%)Downloading (95%)Downloading (100%)
19-Jun-2018 19:53:00   - Installing fabpot/goutte (v3.2.2): Downloading (connecting...)Downloading (0%)           Downloading (55%)Downloading (90%)Downloading (100%)
19-Jun-2018 19:53:02   - Installing facebook/webdriver (1.5.0): Downloading (connecting...)Downloading (0%)           Downloading (5%)Downloading (10%)Downloading (15%)Downloading (20%)Downloading (25%)Downloading (30%)Downloading (35%)Downloading (40%)Downloading (45%)Downloading (50%)Downloading (55%)Downloading (60%)Downloading (65%)Downloading (70%)Downloading (75%)Downloading (80%)Downloading (85%)Downloading (90%)Downloading (95%)Downloading (100%)
19-Jun-2018 19:53:03   - Installing symfony/yaml (v3.4.3): Downloading (connecting...)Downloading (0%)           Downloading (5%)Downloading (10%)Downloading (60%)Downloading (65%)Downloading (100%)
19-Jun-2018 19:53:04   - Installing laravel/homestead (v7.7.0): Downloading (connecting...)Downloading (100%)         
19-Jun-2018 19:53:11   - Installing phing/phing (2.4.14): Downloading (connecting...)Downloading (0%)           Downloading (5%)Downloading (10%)Downloading (15%)Downloading (20%)Downloading (25%)Downloading (30%)Downloading (35%)Downloading (40%)Downloading (45%)Downloading (50%)Downloading (55%)Downloading (60%)Downloading (65%)Downloading (70%)Downloading (75%)Downloading (80%)Downloading (85%)Downloading (90%)Downloading (95%)Downloading (100%)
19-Jun-2018 19:53:12   - Installing webmozart/assert (1.2.0): Downloading (connecting...)Downloading (0%)           Downloading (55%)Downloading (80%)Downloading (100%)
19-Jun-2018 19:53:12   - Installing phpdocumentor/reflection-common (1.0.1): Downloading (connecting...)Downloading (0%)           Downloading (100%)
19-Jun-2018 19:53:13   - Installing phpdocumentor/type-resolver (0.4.0): Downloading (connecting...)Downloading (0%)           Downloading (5%)Downloading (100%)
19-Jun-2018 19:53:14   - Installing phpdocumentor/reflection-docblock (3.3.2): Downloading (connecting...)Downloading (0%)           Downloading (5%)Downloading (10%)Downloading (15%)Downloading (50%)Downloading (55%)Downloading (60%)Downloading (100%)
19-Jun-2018 19:53:15   - Installing sebastian/version (2.0.1): Downloading (connecting...)Downloading (0%)           Downloading (100%)
19-Jun-2018 19:53:15   - Installing sebastian/resource-operations (1.0.0): Downloading (connecting...)Downloading (0%)           Downloading (65%)Downloading (100%)
19-Jun-2018 19:53:16   - Installing sebastian/recursion-context (2.0.0): Downloading (connecting...)Downloading (0%)           Downloading (100%)
19-Jun-2018 19:53:17   - Installing sebastian/object-enumerator (2.0.1): Downloading (connecting...)Downloading (0%)           Downloading (95%)Downloading (100%)
19-Jun-2018 19:53:18   - Installing sebastian/global-state (1.1.1): Downloading (connecting...)Downloading (0%)           Downloading (40%)Downloading (70%)Downloading (100%)
19-Jun-2018 19:53:18   - Installing sebastian/exporter (2.0.0): Downloading (connecting...)Downloading (0%)           Downloading (100%)
19-Jun-2018 19:53:19   - Installing sebastian/environment (2.0.0): Downloading (connecting...)Downloading (0%)           Downloading (15%)Downloading (30%)Downloading (45%)Downloading (60%)Downloading (75%)Downloading (90%)Downloading (100%)
19-Jun-2018 19:53:20   - Installing sebastian/diff (1.4.3): Downloading (connecting...)Downloading (0%)           Downloading (35%)Downloading (40%)Downloading (75%)Downloading (100%)
19-Jun-2018 19:53:20   - Installing sebastian/comparator (1.2.4): Downloading (connecting...)Downloading (0%)           Downloading (10%)Downloading (30%)Downloading (40%)Downloading (70%)Downloading (80%)Downloading (90%)Downloading (100%)
19-Jun-2018 19:53:21   - Installing phpunit/php-text-template (1.2.1): Downloading (connecting...)Downloading (0%)           Downloading (35%)Downloading (100%)
19-Jun-2018 19:53:22   - Installing doctrine/instantiator (1.0.5): Downloading (connecting...)Downloading (0%)           Downloading (15%)Downloading (30%)Downloading (45%)Downloading (50%)Downloading (65%)Downloading (80%)Downloading (95%)Downloading (100%)
19-Jun-2018 19:53:23   - Installing phpunit/phpunit-mock-objects (3.4.4): Downloading (connecting...)Downloading (0%)           Downloading (5%)Downloading (10%)Downloading (15%)Downloading (20%)Downloading (25%)Downloading (30%)Downloading (35%)Downloading (45%)Downloading (50%)Downloading (55%)Downloading (60%)Downloading (65%)Downloading (70%)Downloading (75%)Downloading (85%)Downloading (90%)Downloading (95%)Downloading (100%)
19-Jun-2018 19:53:24   - Installing phpunit/php-timer (1.0.9): Downloading (connecting...)Downloading (0%)           Downloading (45%)Downloading (90%)Downloading (100%)
19-Jun-2018 19:53:25   - Installing phpunit/php-file-iterator (1.4.5): Downloading (connecting...)Downloading (0%)           Downloading (100%)
19-Jun-2018 19:53:25   - Installing sebastian/code-unit-reverse-lookup (1.0.1): Downloading (connecting...)Downloading (0%)           Downloading (55%)Downloading (100%)
19-Jun-2018 19:53:26   - Installing phpunit/php-token-stream (1.4.12): Downloading (connecting...)Downloading (0%)           Downloading (5%)Downloading (10%)Downloading (15%)Downloading (20%)Downloading (90%)Downloading (95%)Downloading (100%)
19-Jun-2018 19:53:29   - Installing phpunit/php-code-coverage (4.0.8): Downloading (connecting...)Downloading (0%)           Downloading (5%)Downloading (10%)Downloading (15%)Downloading (20%)Downloading (25%)Downloading (30%)Downloading (35%)Downloading (40%)Downloading (45%)Downloading (50%)Downloading (55%)Downloading (60%)Downloading (65%)Downloading (70%)Downloading (75%)Downloading (80%)Downloading (85%)Downloading (90%)Downloading (95%)Downloading (100%)
19-Jun-2018 19:53:30   - Installing phpspec/prophecy (1.7.5): Downloading (connecting...)Downloading (0%)           Downloading (10%)Downloading (15%)Downloading (20%)Downloading (30%)Downloading (35%)Downloading (45%)Downloading (50%)Downloading (55%)Downloading (60%)Downloading (70%)Downloading (80%)Downloading (90%)Downloading (95%)Downloading (100%)
19-Jun-2018 19:53:31   - Installing myclabs/deep-copy (1.7.0): Downloading (connecting...)Downloading (0%)           Downloading (15%)Downloading (20%)Downloading (35%)Downloading (40%)Downloading (45%)Downloading (50%)Downloading (60%)Downloading (75%)Downloading (80%)Downloading (95%)Downloading (100%)
19-Jun-2018 19:53:34   - Installing phpunit/phpunit (5.7.26): Downloading (connecting...)Downloading (0%)           Downloading (5%)Downloading (10%)Downloading (15%)Downloading (20%)Downloading (25%)Downloading (30%)Downloading (35%)Downloading (40%)Downloading (45%)Downloading (50%)Downloading (55%)Downloading (60%)Downloading (65%)Downloading (70%)Downloading (75%)Downloading (80%)Downloading (85%)Downloading (90%)Downloading (95%)Downloading (100%)
19-Jun-2018 19:53:35   - Installing phpunit/dbunit (2.0.3): Downloading (connecting...)Downloading (0%)           Downloading (5%)Downloading (10%)Downloading (15%)Downloading (20%)Downloading (25%)Downloading (30%)Downloading (35%)Downloading (40%)Downloading (45%)Downloading (50%)Downloading (55%)Downloading (60%)Downloading (65%)Downloading (70%)Downloading (75%)Downloading (80%)Downloading (85%)Downloading (90%)Downloading (95%)Downloading (100%)
19-Jun-2018 19:53:36   - Installing squizlabs/php_codesniffer (2.9.1): Downloading (connecting...)Downloading (0%)           Downloading (5%)Downloading (10%)Downloading (15%)Downloading (20%)Downloading (25%)Downloading (30%)Downloading (35%)Downloading (40%)Downloading (45%)Downloading (50%)Downloading (55%)Downloading (60%)Downloading (65%)Downloading (70%)Downloading (75%)Downloading (80%)Downloading (85%)Downloading (90%)Downloading (95%)Downloading (100%)
19-Jun-2018 19:53:37 symfony/console suggests installing symfony/lock ()
19-Jun-2018 19:53:37 lusitanian/oauth suggests installing predis/predis (Allows using the Redis storage backend.)
19-Jun-2018 19:53:37 patchwork/utf8 suggests installing ext-intl (Use Intl for best performance)
19-Jun-2018 19:53:37 patchwork/utf8 suggests installing ext-wfio (Use WFIO for UTF-8 filesystem access on Windows)
19-Jun-2018 19:53:37 s9e/text-formatter suggests installing ext-intl (Allows international URLs to be accepted by the URL filter)
19-Jun-2018 19:53:37 s9e/text-formatter suggests installing ext-xsl (Enables the XSLT renderer)
19-Jun-2018 19:53:37 paragonie/random_compat suggests installing ext-libsodium (Provides a modern crypto API that can be used to generate random bytes.)
19-Jun-2018 19:53:37 symfony/http-kernel suggests installing symfony/var-dumper ()
19-Jun-2018 19:53:37 symfony/dependency-injection suggests installing symfony/expression-language (For using expressions in service container configuration)
19-Jun-2018 19:53:37 zendframework/zend-eventmanager suggests installing container-interop/container-interop (^1.1.0, to use the lazy listeners feature)
19-Jun-2018 19:53:37 zendframework/zend-eventmanager suggests installing zendframework/zend-stdlib (^2.7.3 || ^3.0, to use the FilterChain feature)
19-Jun-2018 19:53:37 zendframework/zend-code suggests installing doctrine/annotations (Doctrine\Common\Annotations >=1.0 for annotation features)
19-Jun-2018 19:53:37 zendframework/zend-code suggests installing zendframework/zend-stdlib (Zend\Stdlib component)
19-Jun-2018 19:53:37 ocramius/proxy-manager suggests installing ocramius/generated-hydrator (To have very fast object to array to object conversion for ghost objects)
19-Jun-2018 19:53:37 ocramius/proxy-manager suggests installing zendframework/zend-json (To have the JsonRpc adapter (Remote Object feature))
19-Jun-2018 19:53:37 ocramius/proxy-manager suggests installing zendframework/zend-soap (To have the Soap adapter (Remote Object feature))
19-Jun-2018 19:53:37 ocramius/proxy-manager suggests installing zendframework/zend-stdlib (To use the hydrator proxy)
19-Jun-2018 19:53:37 ocramius/proxy-manager suggests installing zendframework/zend-xmlrpc (To have the XmlRpc adapter (Remote Object feature))
19-Jun-2018 19:53:37 symfony/routing suggests installing doctrine/annotations (For using the annotation loader)
19-Jun-2018 19:53:37 symfony/routing suggests installing symfony/expression-language (For using expression matching)
19-Jun-2018 19:53:37 symfony/twig-bridge suggests installing symfony/asset (For using the AssetExtension)
19-Jun-2018 19:53:37 symfony/twig-bridge suggests installing symfony/expression-language (For using the ExpressionExtension)
19-Jun-2018 19:53:37 symfony/twig-bridge suggests installing symfony/form (For using the FormExtension)
19-Jun-2018 19:53:37 symfony/twig-bridge suggests installing symfony/security (For using the SecurityExtension)
19-Jun-2018 19:53:37 symfony/twig-bridge suggests installing symfony/stopwatch (For using the StopwatchExtension)
19-Jun-2018 19:53:37 symfony/twig-bridge suggests installing symfony/templating (For using the TwigEngine)
19-Jun-2018 19:53:37 symfony/twig-bridge suggests installing symfony/translation (For using the TranslationExtension)
19-Jun-2018 19:53:37 symfony/twig-bridge suggests installing symfony/var-dumper (For using the DumpExtension)
19-Jun-2018 19:53:37 symfony/twig-bridge suggests installing symfony/web-link (For using the WebLinkExtension)
19-Jun-2018 19:53:37 sebastian/global-state suggests installing ext-uopz (*)
19-Jun-2018 19:53:37 phpunit/phpunit-mock-objects suggests installing ext-soap (*)
19-Jun-2018 19:53:37 phpunit/phpunit suggests installing phpunit/php-invoker (~1.1)
19-Jun-2018 19:53:37 Generating autoload files
19-Jun-2018 19:53:37 Buildfile: /data/build/build.xml
19-Jun-2018 19:53:38
19-Jun-2018 19:53:38 phpBB > clean:
19-Jun-2018 19:53:38
19-Jun-2018 19:53:38    [delete] Directory /data/build/logs does not exist or is not a directory.
19-Jun-2018 19:53:38    [delete] Directory /data/build/api does not exist or is not a directory.
19-Jun-2018 19:53:38    [delete] Directory /data/build/codebrowser does not exist or is not a directory.
19-Jun-2018 19:53:38    [delete] Directory /data/build/coverage does not exist or is not a directory.
19-Jun-2018 19:53:38    [delete] Directory /data/build/cpd does not exist or is not a directory.
19-Jun-2018 19:53:38    [delete] Directory /data/build/dependencies does not exist or is not a directory.
19-Jun-2018 19:53:38    [delete] Directory /data/build/new_version does not exist or is not a directory.
19-Jun-2018 19:53:38    [delete] Directory /data/build/old_versions does not exist or is not a directory.
19-Jun-2018 19:53:38    [delete] Directory /data/build/save does not exist or is not a directory.
19-Jun-2018 19:53:38
19-Jun-2018 19:53:38 phpBB > prepare:
19-Jun-2018 19:53:38
19-Jun-2018 19:53:38     [mkdir] Created dir: /data/build/logs
19-Jun-2018 19:53:38     [mkdir] Created dir: /data/build/api
19-Jun-2018 19:53:38     [mkdir] Created dir: /data/build/codebrowser
19-Jun-2018 19:53:38     [mkdir] Created dir: /data/build/coverage
19-Jun-2018 19:53:38     [mkdir] Created dir: /data/build/cpd
19-Jun-2018 19:53:38     [mkdir] Created dir: /data/build/dependencies
19-Jun-2018 19:53:38     [mkdir] Created dir: /data/build/new_version
19-Jun-2018 19:53:38     [mkdir] Created dir: /data/build/new_version/files
19-Jun-2018 19:53:38     [mkdir] Created dir: /data/build/new_version/patches
19-Jun-2018 19:53:38     [mkdir] Created dir: /data/build/new_version/release_files
19-Jun-2018 19:53:38     [mkdir] Created dir: /data/build/new_version/update
19-Jun-2018 19:53:38     [mkdir] Created dir: /data/build/old_versions
19-Jun-2018 19:53:38     [mkdir] Created dir: /data/build/save
19-Jun-2018 19:53:38
19-Jun-2018 19:53:38 BUILD FINISHED
19-Jun-2018 19:53:38
19-Jun-2018 19:53:38 Total time: 0.1002 seconds
19-Jun-2018 19:53:38
19-Jun-2018 19:53:38 Finished task 'Prepare directory' with result: Success
19-Jun-2018 19:53:38 Skipping execution of task 'Run sniffs' as it is disabled
19-Jun-2018 19:53:38
Substituting variable: ${bamboo.working.directory} with /home/bamboo/xml-data/build-dir/PHPBB3-PR-JOB1
19-Jun-2018 19:53:38 Starting task 'Run sniffs' of type 'com.atlassian.bamboo.plugins.bamboo-docker-plugin:task.docker.cli'
19-Jun-2018 19:53:38 Running image name (phpbb:php-5.6)
19-Jun-2018 19:53:38
Beginning to execute external process for build 'phpBB3 - Pull Requests - Build and Test Job #8286 (PHPBB3-PR-JOB1-8286)'
... running command line:
/usr/bin/docker run --volume /home/bamboo/xml-data/build-dir/PHPBB3-PR-JOB1:/data --workdir /data/build --rm -u=991 phpbb:php-5.6 ../phpBB/vendor/bin/phing sniff
... in: /home/bamboo/xml-data/build-dir/PHPBB3-PR-JOB1
... using extra environment variables:
bamboo_planRepository_1_branch=3.1.x
bamboo_planRepository_1_branchDisplayName=3.1.x
bamboo_repository_revision_number=dc8ff9da28b8ab4ad11c7ea94cca526f17c87fe5
bamboo_PRref=master
bamboo_resultsUrl=https://bamboo.phpbb.com/browse/PHPBB3-PR-JOB1-8286
bamboo_capability_system_builder_command_Git=/usr/bin/git
bamboo_repository_75956235_git_username=bantu
bamboo_build_working_directory=/home/bamboo/xml-data/build-dir/PHPBB3-PR-JOB1
bamboo_planRepository_1_name=phpBB Ascraeus
bamboo_buildKey=PHPBB3-PR-JOB1
bamboo_capability_phpbb_tests=true
bamboo_shortPlanName=Pull Requests
bamboo_capability_system_builder_command_fop=/usr/bin/fop
bamboo_capability_dbms_sqlite_2=true
bamboo_planRepository_name=phpBB Ascraeus
bamboo_PRnumber=5247
bamboo_buildNumber=8286
bamboo_repository_75956235_git_repositoryUrl=https://github.com/phpbb/phpbb.git
bamboo_capability_system_builder_phpunit_PHPUnit=/usr/bin/phpunit
bamboo_shortJobName=Build and Test Job
bamboo_buildResultsUrl=https://bamboo.phpbb.com/browse/PHPBB3-PR-JOB1-8286
bamboo_repository_75956235_branch_name=3.1.x
bamboo_planRepository_repositoryUrl=https://github.com/phpbb/phpbb.git
bamboo_agentId=131073
bamboo_planName=phpBB3 - Pull Requests
bamboo_build_commandline_com_atlassian_bamboo_plugins_scripttask_task_builder_script_7=/bin/sh /home/bamboo/temp/PHPBB3-PR-JOB1-8286-ScriptBuildTask-8619838594406234099.sh
bamboo_shortPlanKey=PR
bamboo_shortJobKey=JOB1
bamboo_capability_dbms_mysql_55=true
bamboo_capability_system_jdk_JDK_1_7_0_65=/usr/lib/jvm/java-7-openjdk-amd64
bamboo_planRepository_revision=dc8ff9da28b8ab4ad11c7ea94cca526f17c87fe5
bamboo_buildTimeStamp=2018-06-19T19:52:05.356Z
bamboo_repository_previous_revision_number=dc8ff9da28b8ab4ad11c7ea94cca526f17c87fe5
bamboo_capability_system_jdk_JDK_1_6_0_16=/usr/lib/jvm/java-6-sun-1.6.0.16
bamboo_capability_system_builder_mvn2_Maven_2=/usr/share/maven2
bamboo_planRepository_previousRevision=dc8ff9da28b8ab4ad11c7ea94cca526f17c87fe5
bamboo_build_commandline_com_atlassian_bamboo_plugins_scripttask_task_builder_script_4=/bin/sh /home/bamboo/temp/PHPBB3-PR-JOB1-8286-ScriptBuildTask-5310967031814310925.sh
bamboo_repository_git_branch=3.1.x
bamboo_buildResultKey=PHPBB3-PR-JOB1-8286
bamboo_repository_branch_name=3.1.x
bamboo_buildPlanName=phpBB3 - Pull Requests - Build and Test Job
bamboo_planRepository_1_revision=dc8ff9da28b8ab4ad11c7ea94cca526f17c87fe5
bamboo_repository_name=phpBB Ascraeus
bamboo_buildFailed=false
bamboo_capability_system_docker_executable=/usr/bin/docker
bamboo_build_commandline_com_atlassian_bamboo_plugins_bamboo_docker_plugin_task_docker_cli_12=/usr/bin/docker run --volume /home/bamboo/xml-data/build-dir/PHPBB3-PR-JOB1:/data --workdir /data/phpBB --rm -e HOME=/home/bamboo -u=991 phpbb:php-5.6 /bin/bash -c php ../composer.phar install --dev; cd ../build; ../phpBB/vendor/bin/phing clean prepare
bamboo_planRepository_branch=3.1.x
bamboo_agentWorkingDirectory=/home/bamboo/xml-data/build-dir
bamboo_capability_system_git_executable=/usr/bin/git
bamboo_capability_system_builder_phpunit_PHPUnit_3_4=/usr/bin/phpunit
bamboo_repository_git_username=bantu
bamboo_planRepository_1_previousRevision=dc8ff9da28b8ab4ad11c7ea94cca526f17c87fe5
bamboo_repository_75956235_revision_number=dc8ff9da28b8ab4ad11c7ea94cca526f17c87fe5
bamboo_planRepository_branchDisplayName=3.1.x
bamboo_planRepository_1_type=gitv2
bamboo_planRepository_branchName=3.1.x
bamboo_repository_75956235_previous_revision_number=dc8ff9da28b8ab4ad11c7ea94cca526f17c87fe5
bamboo_capability_system_jdk_JDK=/usr/lib/jvm/java-6-sun
bamboo_plan_storageTag=PHPBB3-PR
bamboo_hg_cache_directory=/home/bamboo/xml-data/build-dir/_hg-repositories-cache
bamboo_planRepository_1_username=bantu
bamboo_planRepository_type=gitv2
bamboo_git_cache_directory=/home/bamboo/xml-data/build-dir/_git-repositories-cache
bamboo_ManualBuildTriggerReason_userName=Build Robot
bamboo_repository_git_repositoryUrl=https://github.com/phpbb/phpbb.git
bamboo_repository_75956235_git_branch=3.1.x
bamboo_capability_system_builder_ant_Ant=/usr/share/ant
bamboo_repository_75956235_name=phpBB Ascraeus
bamboo_tmp_directory=/home/bamboo/temp
bamboo_working_directory=/home/bamboo/xml-data/build-dir/PHPBB3-PR-JOB1
bamboo_planKey=PHPBB3-PR
bamboo_capability_local=true
bamboo_planRepository_1_repositoryUrl=https://github.com/phpbb/phpbb.git
bamboo_planRepository_username=bantu
bamboo_capability_system_jdk_JDK_1_6=/usr/lib/jvm/java-6-sun
bamboo_capability_system_jdk_JDK_1_7=/usr/lib/jvm/java-7-openjdk-amd64
bamboo_planRepository_1_branchName=3.1.x
19-Jun-2018 19:53:38 Buildfile: /data/build/build.xml
19-Jun-2018 19:53:38
19-Jun-2018 19:53:38 phpBB > sniff:
19-Jun-2018 19:53:38
19-Jun-2018 19:53:46 ............................................................  60 / 756 (8%)
19-Jun-2018 19:53:47 ............................................................ 120 / 756 (16%)
19-Jun-2018 19:53:48 ............................................................ 180 / 756 (24%)
19-Jun-2018 19:53:49 ............................................................ 240 / 756 (32%)
19-Jun-2018 19:53:51 ............................................................ 300 / 756 (40%)
19-Jun-2018 19:53:57 ............................................................ 360 / 756 (48%)
19-Jun-2018 19:54:02 ............................................................ 420 / 756 (56%)
19-Jun-2018 19:54:06 ............................................................ 480 / 756 (63%)
19-Jun-2018 19:54:10 ............................................................ 540 / 756 (71%)
19-Jun-2018 19:54:13 ............................................................ 600 / 756 (79%)
19-Jun-2018 19:54:18 ............................................................ 660 / 756 (87%)
19-Jun-2018 19:54:21 ............................................................ 720 / 756 (95%)
19-Jun-2018 19:54:22 ....................................
19-Jun-2018 19:54:22
19-Jun-2018 19:54:22 Time: 43.9 secs; Memory: 64.5Mb
19-Jun-2018 19:54:22
19-Jun-2018 19:54:30 ............................................................  60 / 209 (29%)
19-Jun-2018 19:54:48 ............................................................ 120 / 209 (57%)
19-Jun-2018 19:55:01 ............................................................ 180 / 209 (86%)
19-Jun-2018 19:55:09 .............................
19-Jun-2018 19:55:09
19-Jun-2018 19:55:09 Time: 47.26 secs; Memory: 60.5Mb
19-Jun-2018 19:55:09
19-Jun-2018 19:55:10
19-Jun-2018 19:55:10
19-Jun-2018 19:55:10 Time: 17ms; Memory: 3.75Mb
19-Jun-2018 19:55:10
19-Jun-2018 19:55:10
19-Jun-2018 19:55:10 BUILD FINISHED
19-Jun-2018 19:55:10
19-Jun-2018 19:55:10 Total time: 2 minutes  31.47 seconds
19-Jun-2018 19:55:10
19-Jun-2018 19:55:10 Finished task 'Run sniffs' with result: Success
19-Jun-2018 19:55:10 Skipping execution of task 'Run tests' as it is disabled
19-Jun-2018 19:55:10
Substituting variable: ${bamboo.working.directory} with /home/bamboo/xml-data/build-dir/PHPBB3-PR-JOB1
19-Jun-2018 19:55:10 Starting task 'Run tests' of type 'com.atlassian.bamboo.plugins.bamboo-docker-plugin:task.docker.cli'
19-Jun-2018 19:55:10 Running image name (phpbb:php-5.6)
19-Jun-2018 19:55:10
Beginning to execute external process for build 'phpBB3 - Pull Requests - Build and Test Job #8286 (PHPBB3-PR-JOB1-8286)'
... running command line:
/usr/bin/docker run --volume /home/bamboo/xml-data/build-dir/PHPBB3-PR-JOB1:/data --workdir /data --rm -u=991 -t phpbb:php-5.6 /bin/bash -c phpBB/vendor/bin/phpunit --log-junit build/logs/phpunit.xml
... in: /home/bamboo/xml-data/build-dir/PHPBB3-PR-JOB1
... using extra environment variables:
bamboo_planRepository_1_branch=3.1.x
bamboo_planRepository_1_branchDisplayName=3.1.x
bamboo_repository_revision_number=dc8ff9da28b8ab4ad11c7ea94cca526f17c87fe5
bamboo_PRref=master
bamboo_resultsUrl=https://bamboo.phpbb.com/browse/PHPBB3-PR-JOB1-8286
bamboo_capability_system_builder_command_Git=/usr/bin/git
bamboo_repository_75956235_git_username=bantu
bamboo_build_working_directory=/home/bamboo/xml-data/build-dir/PHPBB3-PR-JOB1
bamboo_planRepository_1_name=phpBB Ascraeus
bamboo_buildKey=PHPBB3-PR-JOB1
bamboo_capability_phpbb_tests=true
bamboo_shortPlanName=Pull Requests
bamboo_capability_system_builder_command_fop=/usr/bin/fop
bamboo_capability_dbms_sqlite_2=true
bamboo_planRepository_name=phpBB Ascraeus
bamboo_PRnumber=5247
bamboo_buildNumber=8286
bamboo_repository_75956235_git_repositoryUrl=https://github.com/phpbb/phpbb.git
bamboo_capability_system_builder_phpunit_PHPUnit=/usr/bin/phpunit
bamboo_shortJobName=Build and Test Job
bamboo_buildResultsUrl=https://bamboo.phpbb.com/browse/PHPBB3-PR-JOB1-8286
bamboo_repository_75956235_branch_name=3.1.x
bamboo_planRepository_repositoryUrl=https://github.com/phpbb/phpbb.git
bamboo_agentId=131073
bamboo_planName=phpBB3 - Pull Requests
bamboo_build_commandline_com_atlassian_bamboo_plugins_scripttask_task_builder_script_7=/bin/sh /home/bamboo/temp/PHPBB3-PR-JOB1-8286-ScriptBuildTask-8619838594406234099.sh
bamboo_shortPlanKey=PR
bamboo_shortJobKey=JOB1
bamboo_capability_dbms_mysql_55=true
bamboo_capability_system_jdk_JDK_1_7_0_65=/usr/lib/jvm/java-7-openjdk-amd64
bamboo_planRepository_revision=dc8ff9da28b8ab4ad11c7ea94cca526f17c87fe5
bamboo_buildTimeStamp=2018-06-19T19:52:05.356Z
bamboo_repository_previous_revision_number=dc8ff9da28b8ab4ad11c7ea94cca526f17c87fe5
bamboo_capability_system_jdk_JDK_1_6_0_16=/usr/lib/jvm/java-6-sun-1.6.0.16
bamboo_capability_system_builder_mvn2_Maven_2=/usr/share/maven2
bamboo_planRepository_previousRevision=dc8ff9da28b8ab4ad11c7ea94cca526f17c87fe5
bamboo_build_commandline_com_atlassian_bamboo_plugins_scripttask_task_builder_script_4=/bin/sh /home/bamboo/temp/PHPBB3-PR-JOB1-8286-ScriptBuildTask-5310967031814310925.sh
bamboo_repository_git_branch=3.1.x
bamboo_buildResultKey=PHPBB3-PR-JOB1-8286
bamboo_repository_branch_name=3.1.x
bamboo_buildPlanName=phpBB3 - Pull Requests - Build and Test Job
bamboo_planRepository_1_revision=dc8ff9da28b8ab4ad11c7ea94cca526f17c87fe5
bamboo_repository_name=phpBB Ascraeus
bamboo_buildFailed=false
bamboo_capability_system_docker_executable=/usr/bin/docker
bamboo_build_commandline_com_atlassian_bamboo_plugins_bamboo_docker_plugin_task_docker_cli_11=/usr/bin/docker run --volume /home/bamboo/xml-data/build-dir/PHPBB3-PR-JOB1:/data --workdir /data/build --rm -u=991 phpbb:php-5.6 ../phpBB/vendor/bin/phing sniff
bamboo_build_commandline_com_atlassian_bamboo_plugins_bamboo_docker_plugin_task_docker_cli_12=/usr/bin/docker run --volume /home/bamboo/xml-data/build-dir/PHPBB3-PR-JOB1:/data --workdir /data/phpBB --rm -e HOME=/home/bamboo -u=991 phpbb:php-5.6 /bin/bash -c php ../composer.phar install --dev; cd ../build; ../phpBB/vendor/bin/phing clean prepare
bamboo_planRepository_branch=3.1.x
bamboo_agentWorkingDirectory=/home/bamboo/xml-data/build-dir
bamboo_capability_system_git_executable=/usr/bin/git
bamboo_capability_system_builder_phpunit_PHPUnit_3_4=/usr/bin/phpunit
bamboo_repository_git_username=bantu
bamboo_planRepository_1_previousRevision=dc8ff9da28b8ab4ad11c7ea94cca526f17c87fe5
bamboo_repository_75956235_revision_number=dc8ff9da28b8ab4ad11c7ea94cca526f17c87fe5
bamboo_planRepository_branchDisplayName=3.1.x
bamboo_planRepository_1_type=gitv2
bamboo_planRepository_branchName=3.1.x
bamboo_repository_75956235_previous_revision_number=dc8ff9da28b8ab4ad11c7ea94cca526f17c87fe5
bamboo_capability_system_jdk_JDK=/usr/lib/jvm/java-6-sun
bamboo_plan_storageTag=PHPBB3-PR
bamboo_hg_cache_directory=/home/bamboo/xml-data/build-dir/_hg-repositories-cache
bamboo_planRepository_1_username=bantu
bamboo_planRepository_type=gitv2
bamboo_git_cache_directory=/home/bamboo/xml-data/build-dir/_git-repositories-cache
bamboo_ManualBuildTriggerReason_userName=Build Robot
bamboo_repository_git_repositoryUrl=https://github.com/phpbb/phpbb.git
bamboo_repository_75956235_git_branch=3.1.x
bamboo_capability_system_builder_ant_Ant=/usr/share/ant
bamboo_repository_75956235_name=phpBB Ascraeus
bamboo_tmp_directory=/home/bamboo/temp
bamboo_working_directory=/home/bamboo/xml-data/build-dir/PHPBB3-PR-JOB1
bamboo_planKey=PHPBB3-PR
bamboo_capability_local=true
bamboo_planRepository_1_repositoryUrl=https://github.com/phpbb/phpbb.git
bamboo_planRepository_username=bantu
bamboo_capability_system_jdk_JDK_1_6=/usr/lib/jvm/java-6-sun
bamboo_capability_system_jdk_JDK_1_7=/usr/lib/jvm/java-7-openjdk-amd64
bamboo_planRepository_1_branchName=3.1.x
19-Jun-2018 19:55:13 PHPUnit 5.7.26 by Sebastian Bergmann and contributors.
19-Jun-2018 19:55:13
19-Jun-2018 19:55:20 ..EEEEEEEEEEEE...............EEEEEEEEEE...................EEE   61 / 7178 (  0%)
19-Jun-2018 19:55:20 EEEEEEEEEEEEEEEEEEEEEEEEEEEEEEEEEE...........................  122 / 7178 (  1%)
19-Jun-2018 19:55:21 .............I.....SSSSSSSS............SSSS.........S...S....  183 / 7178 (  2%)
19-Jun-2018 19:55:22 .............................................................  244 / 7178 (  3%)
19-Jun-2018 19:55:31 .....S............W.....EEEEEEEE.............................  305 / 7178 (  4%)
19-Jun-2018 19:55:31 .............................................................  366 / 7178 (  5%)
19-Jun-2018 19:55:32 .............................................................  427 / 7178 (  5%)
19-Jun-2018 19:55:32 .............................................................  488 / 7178 (  6%)
19-Jun-2018 19:55:33 .............................................................  549 / 7178 (  7%)
19-Jun-2018 19:55:34 .............................................................  610 / 7178 (  8%)
19-Jun-2018 19:55:34 .............................................................  671 / 7178 (  9%)
19-Jun-2018 19:55:35 .............................................................  732 / 7178 ( 10%)
19-Jun-2018 19:55:36 .............................................................  793 / 7178 ( 11%)
19-Jun-2018 19:55:37 .............................................................  854 / 7178 ( 11%)
19-Jun-2018 19:55:37 .............................................................  915 / 7178 ( 12%)
19-Jun-2018 19:55:38 .............................................................  976 / 7178 ( 13%)
19-Jun-2018 19:55:39 ............................................................. 1037 / 7178 ( 14%)
19-Jun-2018 19:55:43 ................................................I............ 1098 / 7178 ( 15%)
19-Jun-2018 19:55:48 ............................................................. 1159 / 7178 ( 16%)
19-Jun-2018 19:55:54 ............................................................. 1220 / 7178 ( 16%)
19-Jun-2018 19:55:57 ........................................S.S.S................ 1281 / 7178 ( 17%)
19-Jun-2018 19:55:57 ............................................................. 1342 / 7178 ( 18%)
19-Jun-2018 19:55:58 ............................................................. 1403 / 7178 ( 19%)
19-Jun-2018 19:55:58 ............................................................. 1464 / 7178 ( 20%)
19-Jun-2018 19:55:58 ............................................................. 1525 / 7178 ( 21%)
19-Jun-2018 19:55:58 ............................................................. 1586 / 7178 ( 22%)
19-Jun-2018 19:55:58 ............................................................. 1647 / 7178 ( 22%)
19-Jun-2018 19:55:58 ............................................................. 1708 / 7178 ( 23%)
19-Jun-2018 19:55:58 ............................................................. 1769 / 7178 ( 24%)
19-Jun-2018 19:55:58 ............................................................. 1830 / 7178 ( 25%)
19-Jun-2018 19:55:59 ............................................................. 1891 / 7178 ( 26%)
19-Jun-2018 19:55:59 ............................................................. 1952 / 7178 ( 27%)
19-Jun-2018 19:55:59 ............................................................. 2013 / 7178 ( 28%)
19-Jun-2018 19:55:59 ............................................................. 2074 / 7178 ( 28%)
19-Jun-2018 19:56:00 ............................................................. 2135 / 7178 ( 29%)
19-Jun-2018 19:56:00 ............................................................. 2196 / 7178 ( 30%)
19-Jun-2018 19:56:01 ............................................................. 2257 / 7178 ( 31%)
19-Jun-2018 19:56:02 ............................................................. 2318 / 7178 ( 32%)
19-Jun-2018 19:56:02 ............................................................. 2379 / 7178 ( 33%)
19-Jun-2018 19:56:05 .................I.II........................................ 2440 / 7178 ( 33%)
19-Jun-2018 19:56:05 ............................................................. 2501 / 7178 ( 34%)
19-Jun-2018 19:56:06 ............................................................. 2562 / 7178 ( 35%)
19-Jun-2018 19:56:06 ............................................................. 2623 / 7178 ( 36%)
19-Jun-2018 19:56:06 ............................................................. 2684 / 7178 ( 37%)
19-Jun-2018 19:56:11 ............................................................. 2745 / 7178 ( 38%)
19-Jun-2018 19:56:12 ............................................................. 2806 / 7178 ( 39%)
19-Jun-2018 19:56:12 .......................................SSSSSSSSS............. 2867 / 7178 ( 39%)
19-Jun-2018 19:56:12 ............................................................. 2928 / 7178 ( 40%)
19-Jun-2018 19:56:23 ............................................................. 2989 / 7178 ( 41%)
19-Jun-2018 19:56:28 ............................................................. 3050 / 7178 ( 42%)
19-Jun-2018 19:56:33 ...............S............................................. 3111 / 7178 ( 43%)
19-Jun-2018 19:56:33 ............................................................. 3172 / 7178 ( 44%)
19-Jun-2018 19:56:42 ............................................................. 3233 / 7178 ( 45%)
19-Jun-2018 19:56:50 ........................................SSSS................. 3294 / 7178 ( 45%)
19-Jun-2018 19:56:57 ............................................................. 3355 / 7178 ( 46%)
19-Jun-2018 19:56:58 .................................................EEE......... 3416 / 7178 ( 47%)
19-Jun-2018 19:56:58 ............................................................. 3477 / 7178 ( 48%)
19-Jun-2018 19:56:58 ............................................................. 3538 / 7178 ( 49%)
19-Jun-2018 19:56:59 ............................................................. 3599 / 7178 ( 50%)
19-Jun-2018 19:56:59 ............................................................. 3660 / 7178 ( 50%)
19-Jun-2018 19:56:59 ............................................................. 3721 / 7178 ( 51%)
19-Jun-2018 19:56:59 ............................................................. 3782 / 7178 ( 52%)
19-Jun-2018 19:56:59 ............................................................. 3843 / 7178 ( 53%)
19-Jun-2018 19:57:02 ............................................................. 3904 / 7178 ( 54%)
19-Jun-2018 19:57:02 ............................................................. 3965 / 7178 ( 55%)
19-Jun-2018 19:57:05 .........................................EEEEEEEE............ 4026 / 7178 ( 56%)
19-Jun-2018 19:57:06 ............................................................. 4087 / 7178 ( 56%)
19-Jun-2018 19:57:08 ............................................................. 4148 / 7178 ( 57%)
19-Jun-2018 19:57:10 ............................................................. 4209 / 7178 ( 58%)
19-Jun-2018 19:57:21 ............................................................. 4270 / 7178 ( 59%)
19-Jun-2018 19:57:21 ............................................................. 4331 / 7178 ( 60%)
19-Jun-2018 19:57:23 ............................................................. 4392 / 7178 ( 61%)
19-Jun-2018 19:57:23 ............................................................. 4453 / 7178 ( 62%)
19-Jun-2018 19:57:23 ............................................................. 4514 / 7178 ( 62%)
19-Jun-2018 19:57:23 ............................................................. 4575 / 7178 ( 63%)
19-Jun-2018 19:57:23 ............................................................. 4636 / 7178 ( 64%)
19-Jun-2018 19:57:23 ............................................................. 4697 / 7178 ( 65%)
19-Jun-2018 19:57:23 ............................................................. 4758 / 7178 ( 66%)
19-Jun-2018 19:57:23 ............................................................. 4819 / 7178 ( 67%)
19-Jun-2018 19:57:23 ............................................................. 4880 / 7178 ( 67%)
19-Jun-2018 19:57:36 ............................................................. 4941 / 7178 ( 68%)
19-Jun-2018 19:57:45 ...............S............................................. 5002 / 7178 ( 69%)
19-Jun-2018 19:57:53 ............................................................. 5063 / 7178 ( 70%)
19-Jun-2018 19:57:58 ............................................................. 5124 / 7178 ( 71%)
19-Jun-2018 19:57:59 ............................................................. 5185 / 7178 ( 72%)
19-Jun-2018 19:58:00 ............................................................. 5246 / 7178 ( 73%)
19-Jun-2018 19:58:00 ............................................................. 5307 / 7178 ( 73%)
19-Jun-2018 19:58:00 ................................SSSSSSSSSSSSSSSSSSSSSSSSSSSSS 5368 / 7178 ( 74%)
19-Jun-2018 19:58:00 SSSSSSSSSSSSSSSSSSSSSSSSSSSSSSSSSSSSSSSSSSSSSSSSSSSSSSSSSSSSS 5429 / 7178 ( 75%)
19-Jun-2018 19:58:00 SSSSSSSSSSSSSSSSSSSSSSSSSSSSSSSSSSSSSSSSSSSSSSSSSSSSSSSSSSSSS 5490 / 7178 ( 76%)
19-Jun-2018 19:58:00 SSSSSSSSSSSSSSSSSSSSSSSSSSSSSSSSSSSSSSSSSSSSSSSSSSSSSSSSSSSSS 5551 / 7178 ( 77%)
19-Jun-2018 19:58:01 SSSSSSSSSSSSSSSSSSSSSSSSSSSSSSSSSSSSSSSSSSSSSSSSSS........... 5612 / 7178 ( 78%)
19-Jun-2018 19:58:03 ............................................................. 5673 / 7178 ( 79%)
19-Jun-2018 19:58:06 ............................................................. 5734 / 7178 ( 79%)
19-Jun-2018 19:58:09 ............................................................. 5795 / 7178 ( 80%)
19-Jun-2018 19:58:11 ............................................................. 5856 / 7178 ( 81%)
19-Jun-2018 19:58:14 ............................................................. 5917 / 7178 ( 82%)
19-Jun-2018 19:58:16 ............................................................. 5978 / 7178 ( 83%)
19-Jun-2018 19:58:19 ............................................................. 6039 / 7178 ( 84%)
19-Jun-2018 19:58:22 ............................................................. 6100 / 7178 ( 84%)
19-Jun-2018 19:58:24 ............................................................. 6161 / 7178 ( 85%)
19-Jun-2018 19:58:27 ............................................................. 6222 / 7178 ( 86%)
19-Jun-2018 19:58:29 ............................................................. 6283 / 7178 ( 87%)
19-Jun-2018 19:58:32 ............................................................. 6344 / 7178 ( 88%)
19-Jun-2018 19:58:35 ............................................................. 6405 / 7178 ( 89%)
19-Jun-2018 19:58:38 ............................................................. 6466 / 7178 ( 90%)
19-Jun-2018 19:58:40 ............................................................. 6527 / 7178 ( 90%)
19-Jun-2018 19:58:43 ............................................................. 6588 / 7178 ( 91%)
19-Jun-2018 19:58:45 ............................................................. 6649 / 7178 ( 92%)
19-Jun-2018 19:58:48 ............................................................. 6710 / 7178 ( 93%)
19-Jun-2018 19:58:50 ............................................................. 6771 / 7178 ( 94%)
19-Jun-2018 19:58:54 ............................................................. 6832 / 7178 ( 95%)
19-Jun-2018 19:58:56 ............................................................. 6893 / 7178 ( 96%)
19-Jun-2018 19:58:59 ............................................................. 6954 / 7178 ( 96%)
19-Jun-2018 19:59:01 ............................................................. 7015 / 7178 ( 97%)
19-Jun-2018 19:59:04 ............................................................. 7076 / 7178 ( 98%)
19-Jun-2018 19:59:07 ............................................................. 7137 / 7178 ( 99%)
19-Jun-2018 19:59:08 .......................................SS                     7178 / 7178 (100%)
19-Jun-2018 19:59:08
19-Jun-2018 19:59:08 Time: 3.97 minutes, Memory: 520.50MB
19-Jun-2018 19:59:08
19-Jun-2018 19:59:08 There were 78 errors:
19-Jun-2018 19:59:08
19-Jun-2018 19:59:08 1) phpbb_attachment_delete_test::test_attachment_delete with data set #0 ('attach', '', false, false)
19-Jun-2018 19:59:08 Argument 1 passed to phpbb\storage\adapter\local::__construct() must implement interface phpbb\db\driver\driver_interface, instance of Mock_filesystem_f43e7b8e given, called in /data/tests/attachment/delete_test.php on line 59 and defined
19-Jun-2018 19:59:08
19-Jun-2018 19:59:08 /data/phpBB/phpbb/storage/adapter/local.php:100
19-Jun-2018 19:59:08 /data/tests/attachment/delete_test.php:59
19-Jun-2018 19:59:08
19-Jun-2018 19:59:08 2) phpbb_attachment_delete_test::test_attachment_delete with data set #1 ('meh', 5, false, 0)
19-Jun-2018 19:59:08 Argument 1 passed to phpbb\storage\adapter\local::__construct() must implement interface phpbb\db\driver\driver_interface, instance of Mock_filesystem_f43e7b8e given, called in /data/tests/attachment/delete_test.php on line 59 and defined
19-Jun-2018 19:59:08
19-Jun-2018 19:59:08 /data/phpBB/phpbb/storage/adapter/local.php:100
19-Jun-2018 19:59:08 /data/tests/attachment/delete_test.php:59
19-Jun-2018 19:59:08
19-Jun-2018 19:59:08 3) phpbb_attachment_delete_test::test_attachment_delete with data set #2 ('attach', array(5), false, 0)
19-Jun-2018 19:59:08 Argument 1 passed to phpbb\storage\adapter\local::__construct() must implement interface phpbb\db\driver\driver_interface, instance of Mock_filesystem_f43e7b8e given, called in /data/tests/attachment/delete_test.php on line 59 and defined
19-Jun-2018 19:59:08
19-Jun-2018 19:59:08 /data/phpBB/phpbb/storage/adapter/local.php:100
19-Jun-2018 19:59:08 /data/tests/attachment/delete_test.php:59
19-Jun-2018 19:59:08
19-Jun-2018 19:59:08 4) phpbb_attachment_delete_test::test_attachment_delete with data set #3 ('attach', array(1, 2), false, 2)
19-Jun-2018 19:59:08 Argument 1 passed to phpbb\storage\adapter\local::__construct() must implement interface phpbb\db\driver\driver_interface, instance of Mock_filesystem_f43e7b8e given, called in /data/tests/attachment/delete_test.php on line 59 and defined
19-Jun-2018 19:59:08
19-Jun-2018 19:59:08 /data/phpBB/phpbb/storage/adapter/local.php:100
19-Jun-2018 19:59:08 /data/tests/attachment/delete_test.php:59
19-Jun-2018 19:59:08
19-Jun-2018 19:59:08 5) phpbb_attachment_delete_test::test_attachment_delete with data set #4 ('attach', array(1, 2), true, 2)
19-Jun-2018 19:59:08 Argument 1 passed to phpbb\storage\adapter\local::__construct() must implement interface phpbb\db\driver\driver_interface, instance of Mock_filesystem_f43e7b8e given, called in /data/tests/attachment/delete_test.php on line 59 and defined
19-Jun-2018 19:59:08
19-Jun-2018 19:59:08 /data/phpBB/phpbb/storage/adapter/local.php:100
19-Jun-2018 19:59:08 /data/tests/attachment/delete_test.php:59
19-Jun-2018 19:59:08
19-Jun-2018 19:59:08 6) phpbb_attachment_delete_test::test_attachment_delete with data set #5 ('post', 5, false, 0)
19-Jun-2018 19:59:08 Argument 1 passed to phpbb\storage\adapter\local::__construct() must implement interface phpbb\db\driver\driver_interface, instance of Mock_filesystem_f43e7b8e given, called in /data/tests/attachment/delete_test.php on line 59 and defined
19-Jun-2018 19:59:08
19-Jun-2018 19:59:08 /data/phpBB/phpbb/storage/adapter/local.php:100
19-Jun-2018 19:59:08 /data/tests/attachment/delete_test.php:59
19-Jun-2018 19:59:08
19-Jun-2018 19:59:08 7) phpbb_attachment_delete_test::test_attachment_delete with data set #6 ('topic', 5, false, 0)
19-Jun-2018 19:59:08 Argument 1 passed to phpbb\storage\adapter\local::__construct() must implement interface phpbb\db\driver\driver_interface, instance of Mock_filesystem_f43e7b8e given, called in /data/tests/attachment/delete_test.php on line 59 and defined
19-Jun-2018 19:59:08
19-Jun-2018 19:59:08 /data/phpBB/phpbb/storage/adapter/local.php:100
19-Jun-2018 19:59:08 /data/tests/attachment/delete_test.php:59
19-Jun-2018 19:59:08
19-Jun-2018 19:59:08 8) phpbb_attachment_delete_test::test_attachment_delete with data set #7 ('topic', 1, true, 3)
19-Jun-2018 19:59:08 Argument 1 passed to phpbb\storage\adapter\local::__construct() must implement interface phpbb\db\driver\driver_interface, instance of Mock_filesystem_f43e7b8e given, called in /data/tests/attachment/delete_test.php on line 59 and defined
19-Jun-2018 19:59:08
19-Jun-2018 19:59:08 /data/phpBB/phpbb/storage/adapter/local.php:100
19-Jun-2018 19:59:08 /data/tests/attachment/delete_test.php:59
19-Jun-2018 19:59:08
19-Jun-2018 19:59:08 9) phpbb_attachment_delete_test::test_attachment_delete with data set #8 ('user', 1, false, 0)
19-Jun-2018 19:59:08 Argument 1 passed to phpbb\storage\adapter\local::__construct() must implement interface phpbb\db\driver\driver_interface, instance of Mock_filesystem_f43e7b8e given, called in /data/tests/attachment/delete_test.php on line 59 and defined
19-Jun-2018 19:59:08
19-Jun-2018 19:59:08 /data/phpBB/phpbb/storage/adapter/local.php:100
19-Jun-2018 19:59:08 /data/tests/attachment/delete_test.php:59
19-Jun-2018 19:59:08
19-Jun-2018 19:59:08 10) phpbb_attachment_delete_test::test_attachment_delete_success with data set #0 (true, true, true)
19-Jun-2018 19:59:08 Argument 1 passed to phpbb\storage\adapter\local::__construct() must implement interface phpbb\db\driver\driver_interface, instance of Mock_filesystem_f43e7b8e given, called in /data/tests/attachment/delete_test.php on line 59 and defined
19-Jun-2018 19:59:08
19-Jun-2018 19:59:08 /data/phpBB/phpbb/storage/adapter/local.php:100
19-Jun-2018 19:59:08 /data/tests/attachment/delete_test.php:59
19-Jun-2018 19:59:08
19-Jun-2018 19:59:08 11) phpbb_attachment_delete_test::test_attachment_delete_success with data set #1 (true, false, false)
19-Jun-2018 19:59:08 Argument 1 passed to phpbb\storage\adapter\local::__construct() must implement interface phpbb\db\driver\driver_interface, instance of Mock_filesystem_f43e7b8e given, called in /data/tests/attachment/delete_test.php on line 59 and defined
19-Jun-2018 19:59:08
19-Jun-2018 19:59:08 /data/phpBB/phpbb/storage/adapter/local.php:100
19-Jun-2018 19:59:08 /data/tests/attachment/delete_test.php:59
19-Jun-2018 19:59:08
19-Jun-2018 19:59:08 12) phpbb_attachment_delete_test::test_attachment_delete_success with data set #2 (true, true, false, true)
19-Jun-2018 19:59:08 Argument 1 passed to phpbb\storage\adapter\local::__construct() must implement interface phpbb\db\driver\driver_interface, instance of Mock_filesystem_f43e7b8e given, called in /data/tests/attachment/delete_test.php on line 59 and defined
19-Jun-2018 19:59:08
19-Jun-2018 19:59:08 /data/phpBB/phpbb/storage/adapter/local.php:100
19-Jun-2018 19:59:08 /data/tests/attachment/delete_test.php:59
19-Jun-2018 19:59:08
19-Jun-2018 19:59:08 13) phpbb_attachment_upload_test::test_upload with data set #0 ('foobar', 1, false, array(), array(array('Upload initiated but no valid...found.'), false))
19-Jun-2018 19:59:08 Argument 1 passed to phpbb\storage\adapter\local::__construct() must implement interface phpbb\db\driver\driver_interface, instance of phpbb\filesystem\filesystem given, called in /data/tests/attachment/upload_test.php on line 108 and defined
19-Jun-2018 19:59:08
19-Jun-2018 19:59:08 /data/phpBB/phpbb/storage/adapter/local.php:100
19-Jun-2018 19:59:08 /data/tests/attachment/upload_test.php:108
19-Jun-2018 19:59:08
19-Jun-2018 19:59:08 14) phpbb_attachment_upload_test::test_upload with data set #1 ('foobar', 1, true, array('foobar.jpg', 'jpg', 100), array(array('NOT_UPLOADED', 'The image file you tried to a...valid.'), false, 1))
19-Jun-2018 19:59:08 Argument 1 passed to phpbb\storage\adapter\local::__construct() must implement interface phpbb\db\driver\driver_interface, instance of phpbb\filesystem\filesystem given, called in /data/tests/attachment/upload_test.php on line 108 and defined
19-Jun-2018 19:59:08
19-Jun-2018 19:59:08 /data/phpBB/phpbb/storage/adapter/local.php:100
19-Jun-2018 19:59:08 /data/tests/attachment/upload_test.php:108
19-Jun-2018 19:59:08
19-Jun-2018 19:59:08 15) phpbb_attachment_upload_test::test_upload with data set #2 ('foobar', 1, true, array(), array(array('NOT_UPLOADED'), false, 0))
19-Jun-2018 19:59:08 Argument 1 passed to phpbb\storage\adapter\local::__construct() must implement interface phpbb\db\driver\driver_interface, instance of phpbb\filesystem\filesystem given, called in /data/tests/attachment/upload_test.php on line 108 and defined
19-Jun-2018 19:59:08
19-Jun-2018 19:59:08 /data/phpBB/phpbb/storage/adapter/local.php:100
19-Jun-2018 19:59:08 /data/tests/attachment/upload_test.php:108
19-Jun-2018 19:59:08
19-Jun-2018 19:59:08 16) phpbb_attachment_upload_test::test_init_error
19-Jun-2018 19:59:08 Argument 1 passed to phpbb\storage\adapter\local::__construct() must implement interface phpbb\db\driver\driver_interface, instance of phpbb\filesystem\filesystem given, called in /data/tests/attachment/upload_test.php on line 108 and defined
19-Jun-2018 19:59:08
19-Jun-2018 19:59:08 /data/phpBB/phpbb/storage/adapter/local.php:100
19-Jun-2018 19:59:08 /data/tests/attachment/upload_test.php:108
19-Jun-2018 19:59:08
19-Jun-2018 19:59:08 17) phpbb_attachment_upload_test::test_image_upload with data set #0 (false, false, array(), array(array('The image file you tried to a...valid.'), false, 1))
19-Jun-2018 19:59:08 Argument 1 passed to phpbb\storage\adapter\local::__construct() must implement interface phpbb\db\driver\driver_interface, instance of phpbb\filesystem\filesystem given, called in /data/tests/attachment/upload_test.php on line 108 and defined
19-Jun-2018 19:59:08
19-Jun-2018 19:59:08 /data/phpBB/phpbb/storage/adapter/local.php:100
19-Jun-2018 19:59:08 /data/tests/attachment/upload_test.php:108
19-Jun-2018 19:59:08
19-Jun-2018 19:59:08 18) phpbb_attachment_upload_test::test_image_upload with data set #1 (false, true, array(), array(array('The image file you tried to a...valid.'), false, 1))
19-Jun-2018 19:59:08 Argument 1 passed to phpbb\storage\adapter\local::__construct() must implement interface phpbb\db\driver\driver_interface, instance of phpbb\filesystem\filesystem given, called in /data/tests/attachment/upload_test.php on line 108 and defined
19-Jun-2018 19:59:08
19-Jun-2018 19:59:08 /data/phpBB/phpbb/storage/adapter/local.php:100
19-Jun-2018 19:59:08 /data/tests/attachment/upload_test.php:108
19-Jun-2018 19:59:08
19-Jun-2018 19:59:08 19) phpbb_attachment_upload_test::test_image_upload with data set #2 (true, false, array(), array(array(), true, 0, 100, 'jpg', 'jpg', 'foobar.jpg'))
19-Jun-2018 19:59:08 Argument 1 passed to phpbb\storage\adapter\local::__construct() must implement interface phpbb\db\driver\driver_interface, instance of phpbb\filesystem\filesystem given, called in /data/tests/attachment/upload_test.php on line 108 and defined
19-Jun-2018 19:59:08
19-Jun-2018 19:59:08 /data/phpBB/phpbb/storage/adapter/local.php:100
19-Jun-2018 19:59:08 /data/tests/attachment/upload_test.php:108
19-Jun-2018 19:59:08
19-Jun-2018 19:59:08 20) phpbb_attachment_upload_test::test_image_upload with data set #3 (true, false, array(true, ''), array(array(), true, 0, 100, 'jpg', 'jpg', 'foobar.jpg'))
19-Jun-2018 19:59:08 Argument 1 passed to phpbb\storage\adapter\local::__construct() must implement interface phpbb\db\driver\driver_interface, instance of phpbb\filesystem\filesystem given, called in /data/tests/attachment/upload_test.php on line 108 and defined
19-Jun-2018 19:59:08
19-Jun-2018 19:59:08 /data/phpBB/phpbb/storage/adapter/local.php:100
19-Jun-2018 19:59:08 /data/tests/attachment/upload_test.php:108
19-Jun-2018 19:59:08
19-Jun-2018 19:59:08 21) phpbb_attachment_upload_test::test_image_upload with data set #4 (true, false, array(150), array(array(), true, 0, 100, 'jpg', 'jpg', 'foobar.jpg'))
19-Jun-2018 19:59:08 Argument 1 passed to phpbb\storage\adapter\local::__construct() must implement interface phpbb\db\driver\driver_interface, instance of phpbb\filesystem\filesystem given, called in /data/tests/attachment/upload_test.php on line 108 and defined
19-Jun-2018 19:59:08
19-Jun-2018 19:59:08 /data/phpBB/phpbb/storage/adapter/local.php:100
19-Jun-2018 19:59:08 /data/tests/attachment/upload_test.php:108
19-Jun-2018 19:59:08
19-Jun-2018 19:59:08 22) phpbb_attachment_upload_test::test_image_upload with data set #5 (true, false, array(50), array(array('ATTACH_QUOTA_REACHED'), false, 1, 100, 'jpg', 'jpg', 'foobar.jpg'))
19-Jun-2018 19:59:08 Argument 1 passed to phpbb\storage\adapter\local::__construct() must implement interface phpbb\db\driver\driver_interface, instance of phpbb\filesystem\filesystem given, called in /data/tests/attachment/upload_test.php on line 108 and defined
19-Jun-2018 19:59:08
19-Jun-2018 19:59:08 /data/phpBB/phpbb/storage/adapter/local.php:100
19-Jun-2018 19:59:08 /data/tests/attachment/upload_test.php:108
19-Jun-2018 19:59:08
19-Jun-2018 19:59:08 23) phpbb_avatar_manager_test::test_get_all_drivers
19-Jun-2018 19:59:08 Argument 1 passed to phpbb\storage\adapter\local::__construct() must implement interface phpbb\db\driver\driver_interface, instance of phpbb\filesystem\filesystem given, called in /data/tests/avatar/manager_test.php on line 41 and defined
19-Jun-2018 19:59:08
19-Jun-2018 19:59:08 /data/phpBB/phpbb/storage/adapter/local.php:100
19-Jun-2018 19:59:08 /data/tests/avatar/manager_test.php:41
19-Jun-2018 19:59:08
19-Jun-2018 19:59:08 24) phpbb_avatar_manager_test::test_get_enabled_drivers
19-Jun-2018 19:59:08 Argument 1 passed to phpbb\storage\adapter\local::__construct() must implement interface phpbb\db\driver\driver_interface, instance of phpbb\filesystem\filesystem given, called in /data/tests/avatar/manager_test.php on line 41 and defined
19-Jun-2018 19:59:08
19-Jun-2018 19:59:08 /data/phpBB/phpbb/storage/adapter/local.php:100
19-Jun-2018 19:59:08 /data/tests/avatar/manager_test.php:41
19-Jun-2018 19:59:08
19-Jun-2018 19:59:08 25) phpbb_avatar_manager_test::test_get_driver_enabled with data set #0 ('avatar.driver.foobar', 'avatar.driver.foobar')
19-Jun-2018 19:59:08 Argument 1 passed to phpbb\storage\adapter\local::__construct() must implement interface phpbb\db\driver\driver_interface, instance of phpbb\filesystem\filesystem given, called in /data/tests/avatar/manager_test.php on line 41 and defined
19-Jun-2018 19:59:08
19-Jun-2018 19:59:08 /data/phpBB/phpbb/storage/adapter/local.php:100
19-Jun-2018 19:59:08 /data/tests/avatar/manager_test.php:41
19-Jun-2018 19:59:08
19-Jun-2018 19:59:08 26) phpbb_avatar_manager_test::test_get_driver_enabled with data set #1 ('avatar.driver.gravatar', 'avatar.driver.gravatar')
19-Jun-2018 19:59:08 Argument 1 passed to phpbb\storage\adapter\local::__construct() must implement interface phpbb\db\driver\driver_interface, instance of phpbb\filesystem\filesystem given, called in /data/tests/avatar/manager_test.php on line 41 and defined
19-Jun-2018 19:59:08
19-Jun-2018 19:59:08 /data/phpBB/phpbb/storage/adapter/local.php:100
19-Jun-2018 19:59:08 /data/tests/avatar/manager_test.php:41
19-Jun-2018 19:59:08
19-Jun-2018 19:59:08 27) phpbb_avatar_manager_test::test_get_driver_enabled with data set #2 ('avatar.driver.foo_wrong', null)
19-Jun-2018 19:59:08 Argument 1 passed to phpbb\storage\adapter\local::__construct() must implement interface phpbb\db\driver\driver_interface, instance of phpbb\filesystem\filesystem given, called in /data/tests/avatar/manager_test.php on line 41 and defined
19-Jun-2018 19:59:08
19-Jun-2018 19:59:08 /data/phpBB/phpbb/storage/adapter/local.php:100
19-Jun-2018 19:59:08 /data/tests/avatar/manager_test.php:41
19-Jun-2018 19:59:08
19-Jun-2018 19:59:08 28) phpbb_avatar_manager_test::test_get_driver_enabled with data set #3 ('avatar.driver.local', null)
19-Jun-2018 19:59:08 Argument 1 passed to phpbb\storage\adapter\local::__construct() must implement interface phpbb\db\driver\driver_interface, instance of phpbb\filesystem\filesystem given, called in /data/tests/avatar/manager_test.php on line 41 and defined
19-Jun-2018 19:59:08
19-Jun-2018 19:59:08 /data/phpBB/phpbb/storage/adapter/local.php:100
19-Jun-2018 19:59:08 /data/tests/avatar/manager_test.php:41
19-Jun-2018 19:59:08
19-Jun-2018 19:59:08 29) phpbb_avatar_manager_test::test_get_driver_enabled with data set #4 (3, null)
19-Jun-2018 19:59:09 Argument 1 passed to phpbb\storage\adapter\local::__construct() must implement interface phpbb\db\driver\driver_interface, instance of phpbb\filesystem\filesystem given, called in /data/tests/avatar/manager_test.php on line 41 and defined
19-Jun-2018 19:59:09
19-Jun-2018 19:59:09 /data/phpBB/phpbb/storage/adapter/local.php:100
19-Jun-2018 19:59:09 /data/tests/avatar/manager_test.php:41
19-Jun-2018 19:59:09
19-Jun-2018 19:59:09 30) phpbb_avatar_manager_test::test_get_driver_enabled with data set #5 (1, null)
19-Jun-2018 19:59:09 Argument 1 passed to phpbb\storage\adapter\local::__construct() must implement interface phpbb\db\driver\driver_interface, instance of phpbb\filesystem\filesystem given, called in /data/tests/avatar/manager_test.php on line 41 and defined
19-Jun-2018 19:59:09
19-Jun-2018 19:59:09 /data/phpBB/phpbb/storage/adapter/local.php:100
19-Jun-2018 19:59:09 /data/tests/avatar/manager_test.php:41
19-Jun-2018 19:59:09
19-Jun-2018 19:59:09 31) phpbb_avatar_manager_test::test_get_driver_enabled with data set #6 (2, null)
19-Jun-2018 19:59:09 Argument 1 passed to phpbb\storage\adapter\local::__construct() must implement interface phpbb\db\driver\driver_interface, instance of phpbb\filesystem\filesystem given, called in /data/tests/avatar/manager_test.php on line 41 and defined
19-Jun-2018 19:59:09
19-Jun-2018 19:59:09 /data/phpBB/phpbb/storage/adapter/local.php:100
19-Jun-2018 19:59:09 /data/tests/avatar/manager_test.php:41
19-Jun-2018 19:59:09
19-Jun-2018 19:59:09 32) phpbb_avatar_manager_test::test_get_driver_all with data set #0 ('avatar.driver.foobar', 'avatar.driver.foobar')
19-Jun-2018 19:59:09 Argument 1 passed to phpbb\storage\adapter\local::__construct() must implement interface phpbb\db\driver\driver_interface, instance of phpbb\filesystem\filesystem given, called in /data/tests/avatar/manager_test.php on line 41 and defined
19-Jun-2018 19:59:09
19-Jun-2018 19:59:09 /data/phpBB/phpbb/storage/adapter/local.php:100
19-Jun-2018 19:59:09 /data/tests/avatar/manager_test.php:41
19-Jun-2018 19:59:09
19-Jun-2018 19:59:09 33) phpbb_avatar_manager_test::test_get_driver_all with data set #1 ('avatar.driver.foo_wrong', null)
19-Jun-2018 19:59:09 Argument 1 passed to phpbb\storage\adapter\local::__construct() must implement interface phpbb\db\driver\driver_interface, instance of phpbb\filesystem\filesystem given, called in /data/tests/avatar/manager_test.php on line 41 and defined
19-Jun-2018 19:59:09
19-Jun-2018 19:59:09 /data/phpBB/phpbb/storage/adapter/local.php:100
19-Jun-2018 19:59:09 /data/tests/avatar/manager_test.php:41
19-Jun-2018 19:59:09
19-Jun-2018 19:59:09 34) phpbb_avatar_manager_test::test_get_driver_all with data set #2 ('avatar.driver.local', 'avatar.driver.local')
19-Jun-2018 19:59:09 Argument 1 passed to phpbb\storage\adapter\local::__construct() must implement interface phpbb\db\driver\driver_interface, instance of phpbb\filesystem\filesystem given, called in /data/tests/avatar/manager_test.php on line 41 and defined
19-Jun-2018 19:59:09
19-Jun-2018 19:59:09 /data/phpBB/phpbb/storage/adapter/local.php:100
19-Jun-2018 19:59:09 /data/tests/avatar/manager_test.php:41
19-Jun-2018 19:59:09
19-Jun-2018 19:59:09 35) phpbb_avatar_manager_test::test_get_driver_all with data set #3 (3, 'avatar.driver.local')
19-Jun-2018 19:59:09 Argument 1 passed to phpbb\storage\adapter\local::__construct() must implement interface phpbb\db\driver\driver_interface, instance of phpbb\filesystem\filesystem given, called in /data/tests/avatar/manager_test.php on line 41 and defined
19-Jun-2018 19:59:09
19-Jun-2018 19:59:09 /data/phpBB/phpbb/storage/adapter/local.php:100
19-Jun-2018 19:59:09 /data/tests/avatar/manager_test.php:41
19-Jun-2018 19:59:09
19-Jun-2018 19:59:09 36) phpbb_avatar_manager_test::test_get_driver_all with data set #4 (1, 'avatar.driver.upload')
19-Jun-2018 19:59:09 Argument 1 passed to phpbb\storage\adapter\local::__construct() must implement interface phpbb\db\driver\driver_interface, instance of phpbb\filesystem\filesystem given, called in /data/tests/avatar/manager_test.php on line 41 and defined
19-Jun-2018 19:59:09
19-Jun-2018 19:59:09 /data/phpBB/phpbb/storage/adapter/local.php:100
19-Jun-2018 19:59:09 /data/tests/avatar/manager_test.php:41
19-Jun-2018 19:59:09
19-Jun-2018 19:59:09 37) phpbb_avatar_manager_test::test_get_driver_all with data set #5 (2, 'avatar.driver.remote')
19-Jun-2018 19:59:09 Argument 1 passed to phpbb\storage\adapter\local::__construct() must implement interface phpbb\db\driver\driver_interface, instance of phpbb\filesystem\filesystem given, called in /data/tests/avatar/manager_test.php on line 41 and defined
19-Jun-2018 19:59:09
19-Jun-2018 19:59:09 /data/phpBB/phpbb/storage/adapter/local.php:100
19-Jun-2018 19:59:09 /data/tests/avatar/manager_test.php:41
19-Jun-2018 19:59:09
19-Jun-2018 19:59:09 38) phpbb_avatar_manager_test::test_get_avatar_settings
19-Jun-2018 19:59:09 Argument 1 passed to phpbb\storage\adapter\local::__construct() must implement interface phpbb\db\driver\driver_interface, instance of phpbb\filesystem\filesystem given, called in /data/tests/avatar/manager_test.php on line 41 and defined
19-Jun-2018 19:59:09
19-Jun-2018 19:59:09 /data/phpBB/phpbb/storage/adapter/local.php:100
19-Jun-2018 19:59:09 /data/tests/avatar/manager_test.php:41
19-Jun-2018 19:59:09
19-Jun-2018 19:59:09 39) phpbb_avatar_manager_test::test_clean_row with data set #0 (array('', '', '', '', ''), array('', '', '', '', ''), 'foobar')
19-Jun-2018 19:59:09 Argument 1 passed to phpbb\storage\adapter\local::__construct() must implement interface phpbb\db\driver\driver_interface, instance of phpbb\filesystem\filesystem given, called in /data/tests/avatar/manager_test.php on line 41 and defined
19-Jun-2018 19:59:09
19-Jun-2018 19:59:09 /data/phpBB/phpbb/storage/adapter/local.php:100
19-Jun-2018 19:59:09 /data/tests/avatar/manager_test.php:41
19-Jun-2018 19:59:09
19-Jun-2018 19:59:09 40) phpbb_avatar_manager_test::test_clean_row with data set #1 (array(), array('', '', 0, 0))
19-Jun-2018 19:59:09 Argument 1 passed to phpbb\storage\adapter\local::__construct() must implement interface phpbb\db\driver\driver_interface, instance of phpbb\filesystem\filesystem given, called in /data/tests/avatar/manager_test.php on line 41 and defined
19-Jun-2018 19:59:09
19-Jun-2018 19:59:09 /data/phpBB/phpbb/storage/adapter/local.php:100
19-Jun-2018 19:59:09 /data/tests/avatar/manager_test.php:41
19-Jun-2018 19:59:09
19-Jun-2018 19:59:09 41) phpbb_avatar_manager_test::test_clean_row with data set #2 (array('', 5, 4), array('', 5, 4))
19-Jun-2018 19:59:09 Argument 1 passed to phpbb\storage\adapter\local::__construct() must implement interface phpbb\db\driver\driver_interface, instance of phpbb\filesystem\filesystem given, called in /data/tests/avatar/manager_test.php on line 41 and defined
19-Jun-2018 19:59:09
19-Jun-2018 19:59:09 /data/phpBB/phpbb/storage/adapter/local.php:100
19-Jun-2018 19:59:09 /data/tests/avatar/manager_test.php:41
19-Jun-2018 19:59:09
19-Jun-2018 19:59:09 42) phpbb_avatar_manager_test::test_clean_row with data set #3 (array('', 5, 4), array('', 5, 4), 'user')
19-Jun-2018 19:59:09 Argument 1 passed to phpbb\storage\adapter\local::__construct() must implement interface phpbb\db\driver\driver_interface, instance of phpbb\filesystem\filesystem given, called in /data/tests/avatar/manager_test.php on line 41 and defined
19-Jun-2018 19:59:09
19-Jun-2018 19:59:09 /data/phpBB/phpbb/storage/adapter/local.php:100
19-Jun-2018 19:59:09 /data/tests/avatar/manager_test.php:41
19-Jun-2018 19:59:09
19-Jun-2018 19:59:09 43) phpbb_avatar_manager_test::test_clean_row with data set #4 (array('', 5, 4), array('', 'g4', 5), 'group')
19-Jun-2018 19:59:09 Argument 1 passed to phpbb\storage\adapter\local::__construct() must implement interface phpbb\db\driver\driver_interface, instance of phpbb\filesystem\filesystem given, called in /data/tests/avatar/manager_test.php on line 41 and defined
19-Jun-2018 19:59:09
19-Jun-2018 19:59:09 /data/phpBB/phpbb/storage/adapter/local.php:100
19-Jun-2018 19:59:09 /data/tests/avatar/manager_test.php:41
19-Jun-2018 19:59:09
19-Jun-2018 19:59:09 44) phpbb_avatar_manager_test::test_clean_driver_name
19-Jun-2018 19:59:09 Argument 1 passed to phpbb\storage\adapter\local::__construct() must implement interface phpbb\db\driver\driver_interface, instance of phpbb\filesystem\filesystem given, called in /data/tests/avatar/manager_test.php on line 41 and defined
19-Jun-2018 19:59:09
19-Jun-2018 19:59:09 /data/phpBB/phpbb/storage/adapter/local.php:100
19-Jun-2018 19:59:09 /data/tests/avatar/manager_test.php:41
19-Jun-2018 19:59:09
19-Jun-2018 19:59:09 45) phpbb_avatar_manager_test::test_prepare_driver_name
19-Jun-2018 19:59:09 Argument 1 passed to phpbb\storage\adapter\local::__construct() must implement interface phpbb\db\driver\driver_interface, instance of phpbb\filesystem\filesystem given, called in /data/tests/avatar/manager_test.php on line 41 and defined
19-Jun-2018 19:59:09
19-Jun-2018 19:59:09 /data/phpBB/phpbb/storage/adapter/local.php:100
19-Jun-2018 19:59:09 /data/tests/avatar/manager_test.php:41
19-Jun-2018 19:59:09
19-Jun-2018 19:59:09 46) phpbb_avatar_manager_test::test_localize_errors
19-Jun-2018 19:59:09 Argument 1 passed to phpbb\storage\adapter\local::__construct() must implement interface phpbb\db\driver\driver_interface, instance of phpbb\filesystem\filesystem given, called in /data/tests/avatar/manager_test.php on line 41 and defined
19-Jun-2018 19:59:09
19-Jun-2018 19:59:09 /data/phpBB/phpbb/storage/adapter/local.php:100
19-Jun-2018 19:59:09 /data/tests/avatar/manager_test.php:41
19-Jun-2018 19:59:09
19-Jun-2018 19:59:09 47) phpbb_avatar_manager_test::test_handle_avatar_delete with data set #0 (array('', '', 0, 0), 1, array('foobar@example.com', 'avatar.driver.gravatar', '16', '16'), 'phpbb_users', 'user_')
19-Jun-2018 19:59:09 Argument 1 passed to phpbb\storage\adapter\local::__construct() must implement interface phpbb\db\driver\driver_interface, instance of phpbb\filesystem\filesystem given, called in /data/tests/avatar/manager_test.php on line 41 and defined
19-Jun-2018 19:59:09
19-Jun-2018 19:59:09 /data/phpBB/phpbb/storage/adapter/local.php:100
19-Jun-2018 19:59:09 /data/tests/avatar/manager_test.php:41
19-Jun-2018 19:59:09
19-Jun-2018 19:59:09 48) phpbb_avatar_manager_test::test_handle_avatar_delete with data set #1 (array('', '', 0, 0), 5, array('g5_1414350991.jpg', 'avatar.driver.upload', '80', '80'), 'phpbb_groups', 'group_')
19-Jun-2018 19:59:09 Argument 1 passed to phpbb\storage\adapter\local::__construct() must implement interface phpbb\db\driver\driver_interface, instance of phpbb\filesystem\filesystem given, called in /data/tests/avatar/manager_test.php on line 41 and defined
19-Jun-2018 19:59:09
19-Jun-2018 19:59:09 /data/phpBB/phpbb/storage/adapter/local.php:100
19-Jun-2018 19:59:09 /data/tests/avatar/manager_test.php:41
19-Jun-2018 19:59:09
19-Jun-2018 19:59:09 49) phpbb_avatar_manager_test::test_user_group_avatar_deleted
19-Jun-2018 19:59:09 Argument 1 passed to phpbb\storage\adapter\local::__construct() must implement interface phpbb\db\driver\driver_interface, instance of phpbb\filesystem\filesystem given, called in /data/tests/avatar/manager_test.php on line 41 and defined
19-Jun-2018 19:59:09
19-Jun-2018 19:59:09 /data/phpBB/phpbb/storage/adapter/local.php:100
19-Jun-2018 19:59:09 /data/tests/avatar/manager_test.php:41
19-Jun-2018 19:59:09
19-Jun-2018 19:59:09 50) phpbb_avatar_manager_test::test_remote_avatar_url with data set #0 ('127.0.0.1:91?foo.jpg', 80, 80, array('AVATAR_URL_INVALID'))
19-Jun-2018 19:59:09 Argument 1 passed to phpbb\storage\adapter\local::__construct() must implement interface phpbb\db\driver\driver_interface, instance of phpbb\filesystem\filesystem given, called in /data/tests/avatar/manager_test.php on line 41 and defined
19-Jun-2018 19:59:09
19-Jun-2018 19:59:09 /data/phpBB/phpbb/storage/adapter/local.php:100
19-Jun-2018 19:59:09 /data/tests/avatar/manager_test.php:41
19-Jun-2018 19:59:09
19-Jun-2018 19:59:09 51) phpbb_avatar_manager_test::test_remote_avatar_url with data set #1 ('192.0.73.2/avatar/55502f40dc8...d0.jpg', 80, 80, array('AVATAR_URL_INVALID'))
19-Jun-2018 19:59:09 Argument 1 passed to phpbb\storage\adapter\local::__construct() must implement interface phpbb\db\driver\driver_interface, instance of phpbb\filesystem\filesystem given, called in /data/tests/avatar/manager_test.php on line 41 and defined
19-Jun-2018 19:59:09
19-Jun-2018 19:59:09 /data/phpBB/phpbb/storage/adapter/local.php:100
19-Jun-2018 19:59:09 /data/tests/avatar/manager_test.php:41
19-Jun-2018 19:59:09
19-Jun-2018 19:59:09 52) phpbb_avatar_manager_test::test_remote_avatar_url with data set #2 ('secure.gravatar.com/avatar/55...d0.jpg', 80, 80)
19-Jun-2018 19:59:09 Argument 1 passed to phpbb\storage\adapter\local::__construct() must implement interface phpbb\db\driver\driver_interface, instance of phpbb\filesystem\filesystem given, called in /data/tests/avatar/manager_test.php on line 41 and defined
19-Jun-2018 19:59:09
19-Jun-2018 19:59:09 /data/phpBB/phpbb/storage/adapter/local.php:100
19-Jun-2018 19:59:09 /data/tests/avatar/manager_test.php:41
19-Jun-2018 19:59:09
19-Jun-2018 19:59:09 53) phpbb_avatar_manager_test::test_remote_avatar_url with data set #3 ('192.0.73.2:120/avatar/55502f4...d0.jpg', 80, 80, array('AVATAR_URL_INVALID'))
19-Jun-2018 19:59:09 Argument 1 passed to phpbb\storage\adapter\local::__construct() must implement interface phpbb\db\driver\driver_interface, instance of phpbb\filesystem\filesystem given, called in /data/tests/avatar/manager_test.php on line 41 and defined
19-Jun-2018 19:59:09
19-Jun-2018 19:59:09 /data/phpBB/phpbb/storage/adapter/local.php:100
19-Jun-2018 19:59:09 /data/tests/avatar/manager_test.php:41
19-Jun-2018 19:59:09
19-Jun-2018 19:59:09 54) phpbb_avatar_manager_test::test_remote_avatar_url with data set #4 ('secure.gravatar.com:80/avatar...d0.jpg', 80, 80, array('AVATAR_URL_INVALID'))
19-Jun-2018 19:59:09 Argument 1 passed to phpbb\storage\adapter\local::__construct() must implement interface phpbb\db\driver\driver_interface, instance of phpbb\filesystem\filesystem given, called in /data/tests/avatar/manager_test.php on line 41 and defined
19-Jun-2018 19:59:09
19-Jun-2018 19:59:09 /data/phpBB/phpbb/storage/adapter/local.php:100
19-Jun-2018 19:59:09 /data/tests/avatar/manager_test.php:41
19-Jun-2018 19:59:09
19-Jun-2018 19:59:09 55) phpbb_avatar_manager_test::test_remote_avatar_url with data set #5 ('secure.gravatar.com:80?55502f...d0.jpg', 80, 80, array('AVATAR_URL_INVALID'))
19-Jun-2018 19:59:09 Argument 1 passed to phpbb\storage\adapter\local::__construct() must implement interface phpbb\db\driver\driver_interface, instance of phpbb\filesystem\filesystem given, called in /data/tests/avatar/manager_test.php on line 41 and defined
19-Jun-2018 19:59:09
19-Jun-2018 19:59:09 /data/phpBB/phpbb/storage/adapter/local.php:100
19-Jun-2018 19:59:09 /data/tests/avatar/manager_test.php:41
19-Jun-2018 19:59:09
19-Jun-2018 19:59:09 56) phpbb_avatar_manager_test::test_remote_avatar_url with data set #6 ('secure.gravatar.com?55502f40d...d0.jpg', 80, 80, array('AVATAR_URL_INVALID'))
19-Jun-2018 19:59:09 Argument 1 passed to phpbb\storage\adapter\local::__construct() must implement interface phpbb\db\driver\driver_interface, instance of phpbb\filesystem\filesystem given, called in /data/tests/avatar/manager_test.php on line 41 and defined
19-Jun-2018 19:59:09
19-Jun-2018 19:59:09 /data/phpBB/phpbb/storage/adapter/local.php:100
19-Jun-2018 19:59:09 /data/tests/avatar/manager_test.php:41
19-Jun-2018 19:59:09
19-Jun-2018 19:59:09 57) phpbb_avatar_manager_test::test_remote_avatar_url with data set #7 ('2001:db8:0:0:0:0:2:1/avatar/5...d0.jpg', 80, 80, array('AVATAR_URL_INVALID'))
19-Jun-2018 19:59:09 Argument 1 passed to phpbb\storage\adapter\local::__construct() must implement interface phpbb\db\driver\driver_interface, instance of phpbb\filesystem\filesystem given, called in /data/tests/avatar/manager_test.php on line 41 and defined
19-Jun-2018 19:59:09
19-Jun-2018 19:59:09 /data/phpBB/phpbb/storage/adapter/local.php:100
19-Jun-2018 19:59:09 /data/tests/avatar/manager_test.php:41
19-Jun-2018 19:59:09
19-Jun-2018 19:59:09 58) phpbb_avatar_manager_test::test_remote_avatar_url with data set #8 ('secure.gravatar.com/2001:db8:...d0.jpg', 80, 80, array('AVATAR_URL_INVALID'))
19-Jun-2018 19:59:09 Argument 1 passed to phpbb\storage\adapter\local::__construct() must implement interface phpbb\db\driver\driver_interface, instance of phpbb\filesystem\filesystem given, called in /data/tests/avatar/manager_test.php on line 41 and defined
19-Jun-2018 19:59:09
19-Jun-2018 19:59:09 /data/phpBB/phpbb/storage/adapter/local.php:100
19-Jun-2018 19:59:09 /data/tests/avatar/manager_test.php:41
19-Jun-2018 19:59:09
19-Jun-2018 19:59:09 59) phpbb_avatar_manager_test::test_remote_avatar_url with data set #9 ('secure.gravatar.com/127.0.0.1...d0.jpg', 80, 80, array('AVATAR_URL_INVALID'))
19-Jun-2018 19:59:09 Argument 1 passed to phpbb\storage\adapter\local::__construct() must implement interface phpbb\db\driver\driver_interface, instance of phpbb\filesystem\filesystem given, called in /data/tests/avatar/manager_test.php on line 41 and defined
19-Jun-2018 19:59:09
19-Jun-2018 19:59:09 /data/phpBB/phpbb/storage/adapter/local.php:100
19-Jun-2018 19:59:09 /data/tests/avatar/manager_test.php:41
19-Jun-2018 19:59:09
19-Jun-2018 19:59:09 60) phpbb_content_visibility_delete_post_test::test_delete_post with data set #0 (1, 1, 2, array(1, 3, 3, 0, 0, 1, 2, 1, true, 1, false), false, 'harddelete', array(array(1, 1, ''), array(3, 1, '')), array(array(1, 1, 3, 2, 0, 0, '')), array(array(2, 0, 0, 1, 0, 0, 3)), array(array(3)))
19-Jun-2018 19:59:09 Argument 1 passed to phpbb\storage\adapter\local::__construct() must implement interface phpbb\db\driver\driver_interface, instance of phpbb\filesystem\filesystem given, called in /data/tests/content_visibility/delete_post_test.php on line 301 and defined
19-Jun-2018 19:59:09
19-Jun-2018 19:59:09 /data/phpBB/phpbb/storage/adapter/local.php:100
19-Jun-2018 19:59:09 /data/tests/content_visibility/delete_post_test.php:301
19-Jun-2018 19:59:09
19-Jun-2018 19:59:09 61) phpbb_content_visibility_delete_post_test::test_delete_post with data set #1 (1, 1, 1, array(1, 3, 3, 0, 0, 1, 1, 1, true, 1, false), false, 'harddelete', array(array(2, 1, ''), array(3, 1, '')), array(array(1, 2, 3, 2, 0, 0, '')), array(array(2, 0, 0, 1, 0, 0, 3)), array(array(3)))
19-Jun-2018 19:59:09 Argument 1 passed to phpbb\storage\adapter\local::__construct() must implement interface phpbb\db\driver\driver_interface, instance of phpbb\filesystem\filesystem given, called in /data/tests/content_visibility/delete_post_test.php on line 301 and defined
19-Jun-2018 19:59:09
19-Jun-2018 19:59:09 /data/phpBB/phpbb/storage/adapter/local.php:100
19-Jun-2018 19:59:09 /data/tests/content_visibility/delete_post_test.php:301
19-Jun-2018 19:59:09
19-Jun-2018 19:59:09 62) phpbb_content_visibility_delete_post_test::test_delete_post with data set #2 (1, 1, 3, array(1, 3, 3, 0, 0, 1, 3, 1, true, 1, false), false, 'harddelete', array(array(1, 1, ''), array(2, 1, '')), array(array(1, 1, 2, 2, 0, 0, '')), array(array(2, 0, 0, 1, 0, 0, 2)), array(array(3)))
19-Jun-2018 19:59:09 Argument 1 passed to phpbb\storage\adapter\local::__construct() must implement interface phpbb\db\driver\driver_interface, instance of phpbb\filesystem\filesystem given, called in /data/tests/content_visibility/delete_post_test.php on line 301 and defined
19-Jun-2018 19:59:09
19-Jun-2018 19:59:09 /data/phpBB/phpbb/storage/adapter/local.php:100
19-Jun-2018 19:59:09 /data/tests/content_visibility/delete_post_test.php:301
19-Jun-2018 19:59:09
19-Jun-2018 19:59:09 63) phpbb_content_visibility_delete_post_test::test_delete_post with data set #3 (1, 1, 2, array(1, 3, 3, 0, 0, 1, 2, 1, true, 1, false), true, 'soft delete', array(array(1, 1, ''), array(2, 2, 'soft delete'), array(3, 1, '')), array(array(1, 1, 3, 2, 0, 1, '')), array(array(2, 0, 1, 1, 0, 0, 3)), array(array(3)))
19-Jun-2018 19:59:09 Argument 1 passed to phpbb\storage\adapter\local::__construct() must implement interface phpbb\db\driver\driver_interface, instance of phpbb\filesystem\filesystem given, called in /data/tests/content_visibility/delete_post_test.php on line 301 and defined
19-Jun-2018 19:59:09
19-Jun-2018 19:59:09 /data/phpBB/phpbb/storage/adapter/local.php:100
19-Jun-2018 19:59:09 /data/tests/content_visibility/delete_post_test.php:301
19-Jun-2018 19:59:09
19-Jun-2018 19:59:09 64) phpbb_content_visibility_delete_post_test::test_delete_post with data set #4 (1, 1, 1, array(1, 3, 3, 0, 0, 1, 1, 1, true, 1, false), true, 'soft delete', array(array(1, 2, 'soft delete'), array(2, 1, ''), array(3, 1, '')), array(array(1, 2, 3, 2, 0, 1, '')), array(array(2, 0, 1, 1, 0, 0, 3)), array(array(3)))
19-Jun-2018 19:59:09 Argument 1 passed to phpbb\storage\adapter\local::__construct() must implement interface phpbb\db\driver\driver_interface, instance of phpbb\filesystem\filesystem given, called in /data/tests/content_visibility/delete_post_test.php on line 301 and defined
19-Jun-2018 19:59:09
19-Jun-2018 19:59:09 /data/phpBB/phpbb/storage/adapter/local.php:100
19-Jun-2018 19:59:09 /data/tests/content_visibility/delete_post_test.php:301
19-Jun-2018 19:59:09
19-Jun-2018 19:59:09 65) phpbb_content_visibility_delete_post_test::test_delete_post with data set #5 (1, 1, 3, array(1, 3, 3, 0, 0, 1, 3, 1, true, 1, false), true, 'soft delete', array(array(1, 1, ''), array(2, 1, ''), array(3, 2, 'soft delete')), array(array(1, 1, 2, 2, 0, 1, '')), array(array(2, 0, 1, 1, 0, 0, 2)), array(array(3)))
19-Jun-2018 19:59:09 Argument 1 passed to phpbb\storage\adapter\local::__construct() must implement interface phpbb\db\driver\driver_interface, instance of phpbb\filesystem\filesystem given, called in /data/tests/content_visibility/delete_post_test.php on line 301 and defined
19-Jun-2018 19:59:09
19-Jun-2018 19:59:09 /data/phpBB/phpbb/storage/adapter/local.php:100
19-Jun-2018 19:59:09 /data/tests/content_visibility/delete_post_test.php:301
19-Jun-2018 19:59:09
19-Jun-2018 19:59:09 66) phpbb_content_visibility_delete_post_test::test_delete_post with data set #6 (2, 2, 4, array(4, 4, 1, 0, 0, 1, 4, 1, true, 1, false), false, 'harddelete', array(), array(), array(array(0, 0, 0, 0, 0, 0, 0)), array(array(3)))
19-Jun-2018 19:59:09 Argument 1 passed to phpbb\storage\adapter\local::__construct() must implement interface phpbb\db\driver\driver_interface, instance of phpbb\filesystem\filesystem given, called in /data/tests/content_visibility/delete_post_test.php on line 301 and defined
19-Jun-2018 19:59:09
19-Jun-2018 19:59:09 /data/phpBB/phpbb/storage/adapter/local.php:100
19-Jun-2018 19:59:09 /data/tests/content_visibility/delete_post_test.php:301
19-Jun-2018 19:59:09
19-Jun-2018 19:59:09 67) phpbb_content_visibility_delete_post_test::test_delete_post with data set #7 (2, 2, 4, array(4, 4, 1, 0, 0, 1, 4, 1, true, 1, false), true, 'soft delete', array(array(4, 2, '')), array(array(2, 4, 4, 0, 0, 1, 'soft delete')), array(array(0, 0, 1, 0, 0, 1, 0)), array(array(3)))
19-Jun-2018 19:59:09 Argument 1 passed to phpbb\storage\adapter\local::__construct() must implement interface phpbb\db\driver\driver_interface, instance of phpbb\filesystem\filesystem given, called in /data/tests/content_visibility/delete_post_test.php on line 301 and defined
19-Jun-2018 19:59:09
19-Jun-2018 19:59:09 /data/phpBB/phpbb/storage/adapter/local.php:100
19-Jun-2018 19:59:09 /data/tests/content_visibility/delete_post_test.php:301
19-Jun-2018 19:59:09
19-Jun-2018 19:59:09 68) phpbb_privmsgs_delete_user_pms_test::test_delete_user_pms with data set #0 (2, array(array(1)), array(array(1, 3)))
19-Jun-2018 19:59:09 Argument 1 passed to phpbb\storage\adapter\local::__construct() must implement interface phpbb\db\driver\driver_interface, instance of phpbb\filesystem\filesystem given, called in /data/tests/privmsgs/delete_user_pms_test.php on line 98 and defined
19-Jun-2018 19:59:09
19-Jun-2018 19:59:09 /data/phpBB/phpbb/storage/adapter/local.php:100
19-Jun-2018 19:59:09 /data/tests/privmsgs/delete_user_pms_test.php:98
19-Jun-2018 19:59:09
19-Jun-2018 19:59:09 69) phpbb_privmsgs_delete_user_pms_test::test_delete_user_pms with data set #1 (3, array(array(1), array(2), array(3), array(5)), array(array(1, 2), array(1, 4), array(2, 2), array(2, 4), array(3, 2), array(5, 2), array(5, 4)))
19-Jun-2018 19:59:09 Argument 1 passed to phpbb\storage\adapter\local::__construct() must implement interface phpbb\db\driver\driver_interface, instance of phpbb\filesystem\filesystem given, called in /data/tests/privmsgs/delete_user_pms_test.php on line 98 and defined
19-Jun-2018 19:59:09
19-Jun-2018 19:59:09 /data/phpBB/phpbb/storage/adapter/local.php:100
19-Jun-2018 19:59:09 /data/tests/privmsgs/delete_user_pms_test.php:98
19-Jun-2018 19:59:09
19-Jun-2018 19:59:09 70) phpbb_privmsgs_delete_user_pms_test::test_delete_user_pms with data set #2 (5, array(array(1), array(2), array(3), array(4), array(5)), array(array(1, 2), array(1, 3), array(1, 4), array(2, 2), array(2, 4), array(3, 2), array(4, 3), array(5, 2), array(5, 3), array(5, 4)))
19-Jun-2018 19:59:09 Argument 1 passed to phpbb\storage\adapter\local::__construct() must implement interface phpbb\db\driver\driver_interface, instance of phpbb\filesystem\filesystem given, called in /data/tests/privmsgs/delete_user_pms_test.php on line 98 and defined
19-Jun-2018 19:59:09
19-Jun-2018 19:59:09 /data/phpBB/phpbb/storage/adapter/local.php:100
19-Jun-2018 19:59:09 /data/tests/privmsgs/delete_user_pms_test.php:98
19-Jun-2018 19:59:09
19-Jun-2018 19:59:09 71) phpbb_storage_adapter_local_test::test_put_contents
19-Jun-2018 19:59:09 Argument 1 passed to phpbb\storage\adapter\local::__construct() must implement interface phpbb\db\driver\driver_interface, instance of phpbb\filesystem\filesystem given, called in /data/tests/storage/adapter/local_test.php on line 29 and defined
19-Jun-2018 19:59:09
19-Jun-2018 19:59:09 /data/phpBB/phpbb/storage/adapter/local.php:100
19-Jun-2018 19:59:09 /data/tests/storage/adapter/local_test.php:29
19-Jun-2018 19:59:09
19-Jun-2018 19:59:09 72) phpbb_storage_adapter_local_test::test_get_contents
19-Jun-2018 19:59:09 Argument 1 passed to phpbb\storage\adapter\local::__construct() must implement interface phpbb\db\driver\driver_interface, instance of phpbb\filesystem\filesystem given, called in /data/tests/storage/adapter/local_test.php on line 29 and defined
19-Jun-2018 19:59:09
19-Jun-2018 19:59:09 /data/phpBB/phpbb/storage/adapter/local.php:100
19-Jun-2018 19:59:09 /data/tests/storage/adapter/local_test.php:29
19-Jun-2018 19:59:09
19-Jun-2018 19:59:09 73) phpbb_storage_adapter_local_test::test_exists
19-Jun-2018 19:59:09 Argument 1 passed to phpbb\storage\adapter\local::__construct() must implement interface phpbb\db\driver\driver_interface, instance of phpbb\filesystem\filesystem given, called in /data/tests/storage/adapter/local_test.php on line 29 and defined
19-Jun-2018 19:59:09
19-Jun-2018 19:59:09 /data/phpBB/phpbb/storage/adapter/local.php:100
19-Jun-2018 19:59:09 /data/tests/storage/adapter/local_test.php:29
19-Jun-2018 19:59:09
19-Jun-2018 19:59:09 74) phpbb_storage_adapter_local_test::test_delete_file
19-Jun-2018 19:59:09 Argument 1 passed to phpbb\storage\adapter\local::__construct() must implement interface phpbb\db\driver\driver_interface, instance of phpbb\filesystem\filesystem given, called in /data/tests/storage/adapter/local_test.php on line 29 and defined
19-Jun-2018 19:59:09
19-Jun-2018 19:59:09 /data/phpBB/phpbb/storage/adapter/local.php:100
19-Jun-2018 19:59:09 /data/tests/storage/adapter/local_test.php:29
19-Jun-2018 19:59:09
19-Jun-2018 19:59:09 75) phpbb_storage_adapter_local_test::test_rename
19-Jun-2018 19:59:09 Argument 1 passed to phpbb\storage\adapter\local::__construct() must implement interface phpbb\db\driver\driver_interface, instance of phpbb\filesystem\filesystem given, called in /data/tests/storage/adapter/local_test.php on line 29 and defined
19-Jun-2018 19:59:09
19-Jun-2018 19:59:09 /data/phpBB/phpbb/storage/adapter/local.php:100
19-Jun-2018 19:59:09 /data/tests/storage/adapter/local_test.php:29
19-Jun-2018 19:59:09
19-Jun-2018 19:59:09 76) phpbb_storage_adapter_local_test::test_copy
19-Jun-2018 19:59:09 Argument 1 passed to phpbb\storage\adapter\local::__construct() must implement interface phpbb\db\driver\driver_interface, instance of phpbb\filesystem\filesystem given, called in /data/tests/storage/adapter/local_test.php on line 29 and defined
19-Jun-2018 19:59:09
19-Jun-2018 19:59:09 /data/phpBB/phpbb/storage/adapter/local.php:100
19-Jun-2018 19:59:09 /data/tests/storage/adapter/local_test.php:29
19-Jun-2018 19:59:09
19-Jun-2018 19:59:09 77) phpbb_storage_adapter_local_test::test_read_stream
19-Jun-2018 19:59:09 Argument 1 passed to phpbb\storage\adapter\local::__construct() must implement interface phpbb\db\driver\driver_interface, instance of phpbb\filesystem\filesystem given, called in /data/tests/storage/adapter/local_test.php on line 29 and defined
19-Jun-2018 19:59:09
19-Jun-2018 19:59:09 /data/phpBB/phpbb/storage/adapter/local.php:100
19-Jun-2018 19:59:09 /data/tests/storage/adapter/local_test.php:29
19-Jun-2018 19:59:09
19-Jun-2018 19:59:09 78) phpbb_storage_adapter_local_test::test_write_stream
19-Jun-2018 19:59:09 Argument 1 passed to phpbb\storage\adapter\local::__construct() must implement interface phpbb\db\driver\driver_interface, instance of phpbb\filesystem\filesystem given, called in /data/tests/storage/adapter/local_test.php on line 29 and defined
19-Jun-2018 19:59:09
19-Jun-2018 19:59:09 /data/phpBB/phpbb/storage/adapter/local.php:100
19-Jun-2018 19:59:09 /data/tests/storage/adapter/local_test.php:29
19-Jun-2018 19:59:09
19-Jun-2018 19:59:09 --
19-Jun-2018 19:59:09
19-Jun-2018 19:59:09 There was 1 warning:
19-Jun-2018 19:59:09
19-Jun-2018 19:59:09 1) phpbb_console_user_add_test::test_add_dialog
19-Jun-2018 19:59:09 PHPUnit_Framework_TestCase::getMock() is deprecated, use PHPUnit_Framework_TestCase::createMock() or PHPUnit_Framework_TestCase::getMockBuilder() instead
19-Jun-2018 19:59:09
19-Jun-2018 19:59:09 ERRORS!
19-Jun-2018 19:59:09 Tests: 9488, Assertions: 103170, Errors: 78, Warnings: 1, Skipped: 297, Incomplete: 5.
19-Jun-2018 19:59:10 Error occurred while running Task 'Run tests(10)' of type com.atlassian.bamboo.plugins.bamboo-docker-plugin:task.docker.cli.
19-Jun-2018 19:59:10 com.atlassian.bamboo.task.TaskException: Failed to execute task
19-Jun-2018 19:59:10         at com.atlassian.bamboo.plugins.docker.service.RunService.execute(RunService.java:75)
19-Jun-2018 19:59:10         at com.atlassian.bamboo.plugins.docker.tasks.cli.DockerCliTask.execute(DockerCliTask.java:70)
19-Jun-2018 19:59:10         at com.atlassian.bamboo.task.TaskExecutorImpl.lambda$executeTasks$3(TaskExecutorImpl.java:285)
19-Jun-2018 19:59:10         at com.atlassian.bamboo.task.TaskExecutorImpl.executeTaskWithPrePostActions(TaskExecutorImpl.java:224)
19-Jun-2018 19:59:10         at com.atlassian.bamboo.task.TaskExecutorImpl.executeTasks(TaskExecutorImpl.java:285)
19-Jun-2018 19:59:10         at com.atlassian.bamboo.task.TaskExecutorImpl.execute(TaskExecutorImpl.java:112)
19-Jun-2018 19:59:10         at com.atlassian.bamboo.build.pipeline.tasks.ExecuteBuildTask.call(ExecuteBuildTask.java:71)
19-Jun-2018 19:59:10         at com.atlassian.bamboo.v2.build.agent.DefaultBuildAgent.executeBuildPhase(DefaultBuildAgent.java:203)
19-Jun-2018 19:59:10         at com.atlassian.bamboo.v2.build.agent.DefaultBuildAgent.build(DefaultBuildAgent.java:175)
19-Jun-2018 19:59:10         at com.atlassian.bamboo.v2.build.agent.BuildAgentControllerImpl.lambda$waitAndPerformBuild$0(BuildAgentControllerImpl.java:122)
19-Jun-2018 19:59:10         at com.atlassian.bamboo.variable.CustomVariableContextImpl.withVariableSubstitutor(CustomVariableContextImpl.java:185)
19-Jun-2018 19:59:10         at com.atlassian.bamboo.v2.build.agent.BuildAgentControllerImpl.waitAndPerformBuild(BuildAgentControllerImpl.java:117)
19-Jun-2018 19:59:10         at com.atlassian.bamboo.v2.build.agent.DefaultBuildAgent$1.run(DefaultBuildAgent.java:126)
19-Jun-2018 19:59:10         at com.atlassian.bamboo.utils.BambooRunnables$1.run(BambooRunnables.java:48)
19-Jun-2018 19:59:10         at com.atlassian.bamboo.security.ImpersonationHelper.runWith(ImpersonationHelper.java:26)
19-Jun-2018 19:59:10         at com.atlassian.bamboo.security.ImpersonationHelper.runWithSystemAuthority(ImpersonationHelper.java:17)
19-Jun-2018 19:59:10         at com.atlassian.bamboo.security.ImpersonationHelper$1.run(ImpersonationHelper.java:41)
19-Jun-2018 19:59:10         at java.lang.Thread.run(Thread.java:748)
19-Jun-2018 19:59:10 Caused by: com.atlassian.bamboo.docker.DockerException: Error running Docker run command
19-Jun-2018 19:59:10         at com.atlassian.bamboo.docker.DockerContainerServiceImpl.run(DockerContainerServiceImpl.java:118)
19-Jun-2018 19:59:10         at sun.reflect.GeneratedMethodAccessor2553.invoke(Unknown Source)
19-Jun-2018 19:59:10         at sun.reflect.DelegatingMethodAccessorImpl.invoke(DelegatingMethodAccessorImpl.java:43)
19-Jun-2018 19:59:10         at java.lang.reflect.Method.invoke(Method.java:498)
19-Jun-2018 19:59:10         at com.atlassian.plugin.util.ContextClassLoaderSettingInvocationHandler.invoke(ContextClassLoaderSettingInvocationHandler.java:26)
19-Jun-2018 19:59:10         at com.sun.proxy.$Proxy401.run(Unknown Source)
19-Jun-2018 19:59:10         at sun.reflect.GeneratedMethodAccessor2553.invoke(Unknown Source)
19-Jun-2018 19:59:10         at sun.reflect.DelegatingMethodAccessorImpl.invoke(DelegatingMethodAccessorImpl.java:43)
19-Jun-2018 19:59:10         at java.lang.reflect.Method.invoke(Method.java:498)
19-Jun-2018 19:59:10         at org.springframework.aop.support.AopUtils.invokeJoinpointUsingReflection(AopUtils.java:302)
19-Jun-2018 19:59:10         at org.eclipse.gemini.blueprint.service.importer.support.internal.aop.ServiceInvoker.doInvoke(ServiceInvoker.java:56)
19-Jun-2018 19:59:10         at org.eclipse.gemini.blueprint.service.importer.support.internal.aop.ServiceInvoker.invoke(ServiceInvoker.java:60)
19-Jun-2018 19:59:10         at org.springframework.aop.framework.ReflectiveMethodInvocation.proceed(ReflectiveMethodInvocation.java:179)
19-Jun-2018 19:59:10         at org.springframework.aop.support.DelegatingIntroductionInterceptor.doProceed(DelegatingIntroductionInterceptor.java:133)
19-Jun-2018 19:59:10         at org.springframework.aop.support.DelegatingIntroductionInterceptor.invoke(DelegatingIntroductionInterceptor.java:121)
19-Jun-2018 19:59:10         at org.springframework.aop.framework.ReflectiveMethodInvocation.proceed(ReflectiveMethodInvocation.java:179)
19-Jun-2018 19:59:10         at org.eclipse.gemini.blueprint.service.util.internal.aop.ServiceTCCLInterceptor.invokeUnprivileged(ServiceTCCLInterceptor.java:70)
19-Jun-2018 19:59:10         at org.eclipse.gemini.blueprint.service.util.internal.aop.ServiceTCCLInterceptor.invoke(ServiceTCCLInterceptor.java:53)
19-Jun-2018 19:59:10         at org.springframework.aop.framework.ReflectiveMethodInvocation.proceed(ReflectiveMethodInvocation.java:179)
19-Jun-2018 19:59:10         at org.eclipse.gemini.blueprint.service.importer.support.LocalBundleContextAdvice.invoke(LocalBundleContextAdvice.java:57)
19-Jun-2018 19:59:10         at org.springframework.aop.framework.ReflectiveMethodInvocation.proceed(ReflectiveMethodInvocation.java:179)
19-Jun-2018 19:59:10         at org.springframework.aop.support.DelegatingIntroductionInterceptor.doProceed(DelegatingIntroductionInterceptor.java:133)
19-Jun-2018 19:59:10         at org.springframework.aop.support.DelegatingIntroductionInterceptor.invoke(DelegatingIntroductionInterceptor.java:121)
19-Jun-2018 19:59:10         at org.springframework.aop.framework.ReflectiveMethodInvocation.proceed(ReflectiveMethodInvocation.java:179)
19-Jun-2018 19:59:10         at org.springframework.aop.framework.JdkDynamicAopProxy.invoke(JdkDynamicAopProxy.java:207)
19-Jun-2018 19:59:10         at com.sun.proxy.$Proxy679.run(Unknown Source)
19-Jun-2018 19:59:10         at com.atlassian.bamboo.plugins.docker.client.DockerCmd.run(DockerCmd.java:51)
19-Jun-2018 19:59:10         at com.atlassian.bamboo.plugins.docker.service.RunService.execute(RunService.java:64)
19-Jun-2018 19:59:10         ... 17 more
19-Jun-2018 19:59:10 Caused by: com.atlassian.utils.process.ProcessException: Error executing /usr/bin/docker run --volume /home/bamboo/xml-data/build-dir/PHPBB3-PR-JOB1:/data --workdir /data --rm -u=991 -t phpbb:php-5.6 /bin/bash -c "phpBB/vendor/bin/phpunit --log-junit build/logs/phpunit.xml"
19-Jun-2018 19:59:10         at com.atlassian.bamboo.docker.DockerContainerServiceImpl.execute(DockerContainerServiceImpl.java:252)
19-Jun-2018 19:59:10         at com.atlassian.bamboo.docker.DockerContainerServiceImpl.run(DockerContainerServiceImpl.java:106)
19-Jun-2018 19:59:10         ... 44 more
19-Jun-2018 19:59:10 Starting task 'Parsing test results produced by script' of type 'com.atlassian.bamboo.plugins.testresultparser:task.testresultparser.junit'
19-Jun-2018 19:59:10 Parsing test results under /home/bamboo/xml-data/build-dir/PHPBB3-PR-JOB1...
19-Jun-2018 19:59:10 Failing task since 78 failing test cases were found.
19-Jun-2018 19:59:10 Finished task 'Parsing test results produced by script' with result: Failed
19-Jun-2018 19:59:10
Substituting variable: ${bamboo.PRnumber} with 5247
19-Jun-2018 19:59:10
Substituting variable: ${bamboo.buildResultsUrl} with https://bamboo.phpbb.com/browse/PHPBB3-PR-JOB1-8286
19-Jun-2018 19:59:10
Substituting variable: ${bamboo.buildResultsUrl} with https://bamboo.phpbb.com/browse/PHPBB3-PR-JOB1-8286
19-Jun-2018 19:59:10 Starting task 'Set result build status' of type 'com.atlassian.bamboo.plugins.scripttask:task.builder.script'
19-Jun-2018 19:59:10
Beginning to execute external process for build 'phpBB3 - Pull Requests - Build and Test Job #8286 (PHPBB3-PR-JOB1-8286)'
... running command line:
/bin/sh /home/bamboo/temp/PHPBB3-PR-JOB1-8286-ScriptBuildTask-3232338346985265515.sh
... in: /home/bamboo/xml-data/build-dir/PHPBB3-PR-JOB1
... using extra environment variables:
bamboo_planRepository_1_branch=3.1.x
bamboo_planRepository_1_branchDisplayName=3.1.x
bamboo_repository_revision_number=dc8ff9da28b8ab4ad11c7ea94cca526f17c87fe5
bamboo_PRref=master
bamboo_resultsUrl=https://bamboo.phpbb.com/browse/PHPBB3-PR-JOB1-8286
bamboo_capability_system_builder_command_Git=/usr/bin/git
bamboo_repository_75956235_git_username=bantu
bamboo_build_working_directory=/home/bamboo/xml-data/build-dir/PHPBB3-PR-JOB1
bamboo_planRepository_1_name=phpBB Ascraeus
bamboo_buildKey=PHPBB3-PR-JOB1
bamboo_capability_phpbb_tests=true
bamboo_shortPlanName=Pull Requests
bamboo_capability_system_builder_command_fop=/usr/bin/fop
bamboo_capability_dbms_sqlite_2=true
bamboo_planRepository_name=phpBB Ascraeus
bamboo_PRnumber=5247
bamboo_buildNumber=8286
bamboo_repository_75956235_git_repositoryUrl=https://github.com/phpbb/phpbb.git
bamboo_capability_system_builder_phpunit_PHPUnit=/usr/bin/phpunit
bamboo_shortJobName=Build and Test Job
bamboo_buildResultsUrl=https://bamboo.phpbb.com/browse/PHPBB3-PR-JOB1-8286
bamboo_repository_75956235_branch_name=3.1.x
bamboo_planRepository_repositoryUrl=https://github.com/phpbb/phpbb.git
bamboo_agentId=131073
bamboo_planName=phpBB3 - Pull Requests
bamboo_build_commandline_com_atlassian_bamboo_plugins_scripttask_task_builder_script_7=/bin/sh /home/bamboo/temp/PHPBB3-PR-JOB1-8286-ScriptBuildTask-8619838594406234099.sh
bamboo_shortPlanKey=PR
bamboo_shortJobKey=JOB1
bamboo_capability_dbms_mysql_55=true
bamboo_capability_system_jdk_JDK_1_7_0_65=/usr/lib/jvm/java-7-openjdk-amd64
bamboo_planRepository_revision=dc8ff9da28b8ab4ad11c7ea94cca526f17c87fe5
bamboo_buildTimeStamp=2018-06-19T19:52:05.356Z
bamboo_repository_previous_revision_number=dc8ff9da28b8ab4ad11c7ea94cca526f17c87fe5
bamboo_capability_system_jdk_JDK_1_6_0_16=/usr/lib/jvm/java-6-sun-1.6.0.16
bamboo_capability_system_builder_mvn2_Maven_2=/usr/share/maven2
bamboo_planRepository_previousRevision=dc8ff9da28b8ab4ad11c7ea94cca526f17c87fe5
bamboo_build_commandline_com_atlassian_bamboo_plugins_scripttask_task_builder_script_4=/bin/sh /home/bamboo/temp/PHPBB3-PR-JOB1-8286-ScriptBuildTask-5310967031814310925.sh
bamboo_repository_git_branch=3.1.x
bamboo_buildResultKey=PHPBB3-PR-JOB1-8286
bamboo_repository_branch_name=3.1.x
bamboo_buildPlanName=phpBB3 - Pull Requests - Build and Test Job
bamboo_planRepository_1_revision=dc8ff9da28b8ab4ad11c7ea94cca526f17c87fe5
bamboo_repository_name=phpBB Ascraeus
bamboo_buildFailed=true
bamboo_build_commandline_com_atlassian_bamboo_plugins_bamboo_docker_plugin_task_docker_cli_10=/usr/bin/docker run --volume /home/bamboo/xml-data/build-dir/PHPBB3-PR-JOB1:/data --workdir /data --rm -u=991 -t phpbb:php-5.6 /bin/bash -c phpBB/vendor/bin/phpunit --log-junit build/logs/phpunit.xml
bamboo_capability_system_docker_executable=/usr/bin/docker
bamboo_build_commandline_com_atlassian_bamboo_plugins_bamboo_docker_plugin_task_docker_cli_11=/usr/bin/docker run --volume /home/bamboo/xml-data/build-dir/PHPBB3-PR-JOB1:/data --workdir /data/build --rm -u=991 phpbb:php-5.6 ../phpBB/vendor/bin/phing sniff
bamboo_build_commandline_com_atlassian_bamboo_plugins_bamboo_docker_plugin_task_docker_cli_12=/usr/bin/docker run --volume /home/bamboo/xml-data/build-dir/PHPBB3-PR-JOB1:/data --workdir /data/phpBB --rm -e HOME=/home/bamboo -u=991 phpbb:php-5.6 /bin/bash -c php ../composer.phar install --dev; cd ../build; ../phpBB/vendor/bin/phing clean prepare
bamboo_planRepository_branch=3.1.x
bamboo_agentWorkingDirectory=/home/bamboo/xml-data/build-dir
bamboo_jobFailed=true
bamboo_capability_system_git_executable=/usr/bin/git
bamboo_capability_system_builder_phpunit_PHPUnit_3_4=/usr/bin/phpunit
bamboo_repository_git_username=bantu
bamboo_planRepository_1_previousRevision=dc8ff9da28b8ab4ad11c7ea94cca526f17c87fe5
bamboo_repository_75956235_revision_number=dc8ff9da28b8ab4ad11c7ea94cca526f17c87fe5
bamboo_planRepository_branchDisplayName=3.1.x
bamboo_planRepository_1_type=gitv2
bamboo_planRepository_branchName=3.1.x
bamboo_repository_75956235_previous_revision_number=dc8ff9da28b8ab4ad11c7ea94cca526f17c87fe5
bamboo_capability_system_jdk_JDK=/usr/lib/jvm/java-6-sun
bamboo_plan_storageTag=PHPBB3-PR
bamboo_hg_cache_directory=/home/bamboo/xml-data/build-dir/_hg-repositories-cache
bamboo_planRepository_1_username=bantu
bamboo_planRepository_type=gitv2
bamboo_git_cache_directory=/home/bamboo/xml-data/build-dir/_git-repositories-cache
bamboo_ManualBuildTriggerReason_userName=Build Robot
bamboo_repository_git_repositoryUrl=https://github.com/phpbb/phpbb.git
bamboo_repository_75956235_git_branch=3.1.x
bamboo_capability_system_builder_ant_Ant=/usr/share/ant
bamboo_repository_75956235_name=phpBB Ascraeus
bamboo_tmp_directory=/home/bamboo/temp
bamboo_working_directory=/home/bamboo/xml-data/build-dir/PHPBB3-PR-JOB1
bamboo_planKey=PHPBB3-PR
bamboo_capability_local=true
bamboo_planRepository_1_repositoryUrl=https://github.com/phpbb/phpbb.git
bamboo_planRepository_username=bantu
bamboo_capability_system_jdk_JDK_1_6=/usr/lib/jvm/java-6-sun
bamboo_capability_system_jdk_JDK_1_7=/usr/lib/jvm/java-7-openjdk-amd64
bamboo_planRepository_1_branchName=3.1.x
19-Jun-2018 19:59:13 From https://github.com/phpbb/phpbb
19-Jun-2018 19:59:13 * branch            refs/pull/5247/head -> FETCH_HEAD
19-Jun-2018 19:59:13         <testsuite name="phpbb_attachment_delete_test::test_attachment_delete" tests="9" assertions="0" failures="0" errors="9" time="1.990666">
19-Jun-2018 19:59:13         <testsuite name="phpbb_attachment_delete_test::test_attachment_delete_success" tests="3" assertions="0" failures="0" errors="3" time="0.444697">
19-Jun-2018 19:59:13         <testsuite name="phpbb_attachment_upload_test::test_upload" tests="3" assertions="0" failures="0" errors="3" time="0.559967">
19-Jun-2018 19:59:13         <testsuite name="phpbb_attachment_upload_test::test_image_upload" tests="6" assertions="0" failures="0" errors="6" time="0.857627">
19-Jun-2018 19:59:13         <testsuite name="phpbb_avatar_manager_test::test_get_driver_enabled" tests="7" assertions="0" failures="0" errors="7" time="0.013104">
19-Jun-2018 19:59:13         <testsuite name="phpbb_avatar_manager_test::test_get_driver_all" tests="6" assertions="0" failures="0" errors="6" time="0.011908">
19-Jun-2018 19:59:13         <testsuite name="phpbb_avatar_manager_test::test_clean_row" tests="5" assertions="0" failures="0" errors="5" time="0.009558">
19-Jun-2018 19:59:13         <testsuite name="phpbb_avatar_manager_test::test_handle_avatar_delete" tests="2" assertions="0" failures="0" errors="2" time="0.003715">
19-Jun-2018 19:59:13       <testsuite name="phpbb_content_visibility_delete_post_test" file="/data/tests/content_visibility/delete_post_test.php" tests="8" assertions="0" failures="0" errors="8" time="0.893422">
19-Jun-2018 19:59:13         <testsuite name="phpbb_content_visibility_delete_post_test::test_delete_post" tests="8" assertions="0" failures="0" errors="8" time="0.893422">
19-Jun-2018 19:59:13       <testsuite name="phpbb_privmsgs_delete_user_pms_test" file="/data/tests/privmsgs/delete_user_pms_test.php" tests="3" assertions="0" failures="0" errors="3" time="0.537569">
19-Jun-2018 19:59:13         <testsuite name="phpbb_privmsgs_delete_user_pms_test::test_delete_user_pms" tests="3" assertions="0" failures="0" errors="3" time="0.537569">
19-Jun-2018 19:59:13       <testsuite name="phpbb_storage_adapter_local_test" file="/data/tests/storage/adapter/local_test.php" tests="8" assertions="0" failures="0" errors="8" time="0.012665">
19-Jun-2018 19:59:13   % Total    % Received % Xferd  Average Speed   Time    Time     Time  Current
19-Jun-2018 19:59:13                                  Dload  Upload   Total   Spent    Left  Speed
19-Jun-2018 19:59:13
19-Jun-2018 19:59:14   0     0    0     0    0     0      0      0 --:--:-- --:--:-- --:--:--     0
19-Jun-2018 19:59:14 100   267  100    93  100   174    313    585 --:--:-- --:--:-- --:--:--   587
19-Jun-2018 19:59:14 Finished task 'Set result build status' with result: Success
19-Jun-2018 19:59:14 Running post build plugin 'NCover Results Collector'
19-Jun-2018 19:59:14 Running post build plugin 'Artifact Copier'
19-Jun-2018 19:59:14 Running post build plugin 'npm Cache Cleanup'
19-Jun-2018 19:59:14 Running post build plugin 'Clover Results Collector'
19-Jun-2018 19:59:14 Running post build plugin 'Docker Container Cleanup'
19-Jun-2018 19:59:14 Successfully removed working directory at '/home/bamboo/xml-data/build-dir/PHPBB3-PR-JOB1'
19-Jun-2018 19:59:14 Finalising the build...
19-Jun-2018 19:59:14 Stopping timer.
19-Jun-2018 19:59:14 Build PHPBB3-PR-JOB1-8286 completed.
19-Jun-2018 19:59:14 Running on server: post build plugin 'NCover Results Collector'
19-Jun-2018 19:59:14 Running on server: post build plugin 'Build Hanging Detection Configuration'
19-Jun-2018 19:59:14 Running on server: post build plugin 'Clover Delta Calculator'
19-Jun-2018 19:59:14 Running on server: post build plugin 'Maven Dependencies Postprocessor'
19-Jun-2018 19:59:14 All post build plugins have finished
19-Jun-2018 19:59:14 Generating build results summary...
19-Jun-2018 19:59:19 Saving build results to disk...
19-Jun-2018 19:59:19 Logging substituted variables...
19-Jun-2018 19:59:19 Indexing build results...
19-Jun-2018 19:59:19 Finished building PHPBB3-PR-JOB1-8286.
19-Jun-2018 19:59:19
Substituting variable: ${bamboo.PRnumber} with 5247